uima-dev mailing list archives

Site index · List index
Message view « Date » · « Thread »
Top « Date » · « Thread »
From Apache Jenkins Server <jenk...@builds.apache.org>
Subject Build failed in Jenkins: UIMA-v3-sdk #296
Date Mon, 30 Oct 2017 18:50:29 GMT
See <https://builds.apache.org/job/UIMA-v3-sdk/296/display/redirect?page=changes>

Changes:

[schor] no jira comment only

------------------------------------------
[...truncated 535.23 KB...]
[INFO] Using 'UTF-8' encoding to copy filtered resources.
[INFO] skip non existing resourceDirectory F:\jenkins\jenkins-slave\workspace\UIMA-v3-sdk\uimaj-v3migration-jcas\src\test\resources
[INFO] Copying 3 resources
[INFO] 
[INFO] --- maven-compiler-plugin:3.1:testCompile (default-testCompile) @ uimaj-v3migration-jcas
---
[INFO] Nothing to compile - all classes are up to date
[INFO] 
[INFO] --- maven-surefire-plugin:2.19.1:test (default-test) @ uimaj-v3migration-jcas ---
[JENKINS] Recording test results
[INFO] 
[INFO] --- maven-antrun-plugin:1.7:run (dup-meta-jar-cleanup) @ uimaj-v3migration-jcas ---
[INFO] Executing tasks

main:
[INFO] Executed tasks
[INFO] 
[INFO] --- jacoco-maven-plugin:0.7.6.201602180812:report (default-report) @ uimaj-v3migration-jcas
---
[INFO] Skipping JaCoCo execution due to missing execution data file:F:\jenkins\jenkins-slave\workspace\UIMA-v3-sdk\uimaj-v3migration-jcas\target\jacoco.exec
[PMD] No report found for mojo report
[INFO] 
[INFO] --- maven-jar-plugin:2.3.2:jar (default-jar) @ uimaj-v3migration-jcas ---
[INFO] Building jar: F:\jenkins\jenkins-slave\workspace\UIMA-v3-sdk\uimaj-v3migration-jcas\target\uimaj-v3migration-jcas.jar
[INFO] 
[INFO] --- maven-site-plugin:3.3:attach-descriptor (attach-descriptor) @ uimaj-v3migration-jcas
---
[INFO] 
[INFO] --- findbugs-maven-plugin:3.0.3:findbugs (default) @ uimaj-v3migration-jcas ---
[INFO] Fork Value is true
     [java] Warnings generated: 4
[INFO] Done FindBugs Analysis....
[FINDBUGS] Searching for all files in F:\jenkins\jenkins-slave\workspace\UIMA-v3-sdk\uimaj-v3migration-jcas\target
that match the pattern findbugsXml.xml
[FINDBUGS] Parsing 1 file in F:\jenkins\jenkins-slave\workspace\UIMA-v3-sdk\uimaj-v3migration-jcas\target
[FINDBUGS] Successfully parsed file F:\jenkins\jenkins-slave\workspace\UIMA-v3-sdk\uimaj-v3migration-jcas\target\findbugsXml.xml
of module Apache UIMA Base: uimaj-v3migration-jcas with 4 unique warnings and 0 duplicates.
[FINDBUGS] Computing warning deltas based on reference build #295
[INFO] 
[INFO] --- maven-pmd-plugin:3.6:cpd (default) @ uimaj-v3migration-jcas ---
[DRY] Searching for all files in F:\jenkins\jenkins-slave\workspace\UIMA-v3-sdk\uimaj-v3migration-jcas\target
that match the pattern cpd.xml
[DRY] Parsing 1 file in F:\jenkins\jenkins-slave\workspace\UIMA-v3-sdk\uimaj-v3migration-jcas\target
[DRY] Successfully parsed file F:\jenkins\jenkins-slave\workspace\UIMA-v3-sdk\uimaj-v3migration-jcas\target\cpd.xml
of module Apache UIMA Base: uimaj-v3migration-jcas with 0 unique warnings and 0 duplicates.
[DRY] Computing warning deltas based on reference build #295
[INFO] 
[INFO] --- maven-pmd-plugin:3.6:pmd (default) @ uimaj-v3migration-jcas ---
[PMD] Searching for all files in F:\jenkins\jenkins-slave\workspace\UIMA-v3-sdk\uimaj-v3migration-jcas\target
that match the pattern pmd.xml
[PMD] Parsing 1 file in F:\jenkins\jenkins-slave\workspace\UIMA-v3-sdk\uimaj-v3migration-jcas\target
[PMD] Successfully parsed file F:\jenkins\jenkins-slave\workspace\UIMA-v3-sdk\uimaj-v3migration-jcas\target\pmd.xml
of module Apache UIMA Base: uimaj-v3migration-jcas with 24 unique warnings and 0 duplicates.
[PMD] Computing warning deltas based on reference build #295
[INFO] 
[INFO] --- jacoco-maven-plugin:0.7.6.201602180812:check (default-check) @ uimaj-v3migration-jcas
---
[INFO] Skipping JaCoCo execution due to missing execution data file:F:\jenkins\jenkins-slave\workspace\UIMA-v3-sdk\uimaj-v3migration-jcas\target\jacoco.exec
[INFO] 
[INFO] --- maven-install-plugin:2.5.1:install (default-install) @ uimaj-v3migration-jcas ---
[INFO] Installing F:\jenkins\jenkins-slave\workspace\UIMA-v3-sdk\uimaj-v3migration-jcas\target\uimaj-v3migration-jcas.jar
to f:\jenkins\jenkins-slave\maven-repositories\1\org\apache\uima\uimaj-v3migration-jcas\3.0.1-beta-SNAPSHOT\uimaj-v3migration-jcas-3.0.1-beta-SNAPSHOT.jar
[INFO] Installing F:\jenkins\jenkins-slave\workspace\UIMA-v3-sdk\uimaj-v3migration-jcas\pom.xml
to f:\jenkins\jenkins-slave\maven-repositories\1\org\apache\uima\uimaj-v3migration-jcas\3.0.1-beta-SNAPSHOT\uimaj-v3migration-jcas-3.0.1-beta-SNAPSHOT.pom
[INFO] 
[INFO] >>> maven-dependency-plugin:2.9:analyze (default-cli) > test-compile @
uimaj-v3migration-jcas >>>
[INFO] 
[INFO] --- maven-enforcer-plugin:1.3.1:enforce (enforce-versions) @ uimaj-v3migration-jcas
---
[INFO] 
[INFO] --- build-helper-maven-plugin:1.8:parse-version (parse-project-version) @ uimaj-v3migration-jcas
---
[INFO] 
[INFO] --- uima-build-helper-maven-plugin:7:parse-date-time (set buildYear and buildMonth)
@ uimaj-v3migration-jcas ---
[INFO] 
[INFO] --- jacoco-maven-plugin:0.7.6.201602180812:prepare-agent (default-prepare-agent) @
uimaj-v3migration-jcas ---
[INFO] jacoco.argLine set to -javaagent:f:\\jenkins\\jenkins-slave\\maven-repositories\\1\\org\\jacoco\\org.jacoco.agent\\0.7.6.201602180812\\org.jacoco.agent-0.7.6.201602180812-runtime.jar=destfile=F:\\jenkins\\jenkins-slave\\workspace\\UIMA-v3-sdk\\uimaj-v3migration-jcas\\target\\jacoco.exec,excludes=**/org/apache/uima/examples/SourceDocumentInformation*:**/org/apache/uima/examples/SourceDocumentInformation_Type*
[INFO] 
[INFO] --- maven-remote-resources-plugin:1.5:process (default) @ uimaj-v3migration-jcas ---
[INFO] 
[INFO] --- maven-resources-plugin:2.6:resources (default-resources) @ uimaj-v3migration-jcas
---
[INFO] Using 'UTF-8' encoding to copy filtered resources.
[INFO] Copying 0 resource
[INFO] Copying 3 resources
[INFO] Copying 3 resources
[INFO] 
[INFO] --- maven-compiler-plugin:3.1:compile (default-compile) @ uimaj-v3migration-jcas ---
[INFO] Nothing to compile - all classes are up to date
[INFO] 
[INFO] --- maven-resources-plugin:2.6:testResources (default-testResources) @ uimaj-v3migration-jcas
---
[INFO] Using 'UTF-8' encoding to copy filtered resources.
[INFO] skip non existing resourceDirectory F:\jenkins\jenkins-slave\workspace\UIMA-v3-sdk\uimaj-v3migration-jcas\src\test\resources
[INFO] Copying 3 resources
[INFO] Copying 3 resources
[INFO] 
[INFO] --- maven-compiler-plugin:3.1:testCompile (default-testCompile) @ uimaj-v3migration-jcas
---
[INFO] Nothing to compile - all classes are up to date
[WARNING] Failed to getClass for org.apache.maven.plugin.dependency.analyze.AnalyzeMojo
[INFO] 
[INFO] <<< maven-dependency-plugin:2.9:analyze (default-cli) < test-compile @
uimaj-v3migration-jcas <<<
[INFO] 
[INFO] --- maven-dependency-plugin:2.9:analyze (default-cli) @ uimaj-v3migration-jcas ---
[WARNING] Unused declared dependencies found:
[WARNING]    org.apache.uima:uimaj-test-util:jar:3.0.1-beta-SNAPSHOT:test
[WARNING]    com.github.stephenc.findbugs:findbugs-annotations:jar:1.3.9-1:provided
[INFO]                                                                         
[INFO] ------------------------------------------------------------------------
[INFO] Building Apache UIMA Base: uimaj-examples: SDK Examples 3.0.1-beta-SNAPSHOT
[INFO] ------------------------------------------------------------------------
[INFO] 
[INFO] --- maven-clean-plugin:2.5:clean (default-clean) @ uimaj-examples ---
[TASKS] Scanning folder 'F:\jenkins\jenkins-slave\workspace\UIMA-v3-sdk\uimaj-examples' for
files matching the pattern '**/*.java' - excludes: 
[TASKS] Found 49 files to scan for tasks
Found 5 open tasks.
[TASKS] Computing warning deltas based on reference build #294
[INFO] 
[INFO] --- maven-enforcer-plugin:1.3.1:enforce (enforce-versions) @ uimaj-examples ---
[INFO] 
[INFO] --- build-helper-maven-plugin:1.8:parse-version (parse-project-version) @ uimaj-examples
---
[INFO] 
[INFO] --- uima-build-helper-maven-plugin:7:parse-date-time (set buildYear and buildMonth)
@ uimaj-examples ---
[INFO] 
[INFO] --- jacoco-maven-plugin:0.7.6.201602180812:prepare-agent (default-prepare-agent) @
uimaj-examples ---
[INFO] jacoco.argLine set to -javaagent:f:\\jenkins\\jenkins-slave\\maven-repositories\\1\\org\\jacoco\\org.jacoco.agent\\0.7.6.201602180812\\org.jacoco.agent-0.7.6.201602180812-runtime.jar=destfile=F:\\jenkins\\jenkins-slave\\workspace\\UIMA-v3-sdk\\uimaj-examples\\target\\jacoco.exec,excludes=**/org/apache/uima/examples/SourceDocumentInformation*:**/org/apache/uima/examples/SourceDocumentInformation_Type*
[INFO] 
[INFO] --- maven-remote-resources-plugin:1.5:process (default) @ uimaj-examples ---
[INFO] 
[INFO] --- maven-resources-plugin:2.6:resources (default-resources) @ uimaj-examples ---
[INFO] Using 'UTF-8' encoding to copy filtered resources.
[INFO] Copying 6 resources
[INFO] Copying 3 resources
[INFO] 
[INFO] --- maven-compiler-plugin:3.1:compile (default-compile) @ uimaj-examples ---
[INFO] Changes detected - recompiling the module!
[INFO] Compiling 49 source files to F:\jenkins\jenkins-slave\workspace\UIMA-v3-sdk\uimaj-examples\target\classes
[INFO] -------------------------------------------------------------
[WARNING] COMPILATION WARNING : 
[INFO] -------------------------------------------------------------
[WARNING] /F:/jenkins/jenkins-slave/workspace/UIMA-v3-sdk/uimaj-examples/src/main/java/org/apache/uima/tutorial/UimaAcronym.java:
Some input files use or override a deprecated API.
[WARNING] /F:/jenkins/jenkins-slave/workspace/UIMA-v3-sdk/uimaj-examples/src/main/java/org/apache/uima/tutorial/UimaAcronym.java:
Recompile with -Xlint:deprecation for details.
[WARNING] /F:/jenkins/jenkins-slave/workspace/UIMA-v3-sdk/uimaj-examples/src/main/java/org/apache/uima/examples/xmi/XmiEcoreCasConsumer.java:
Some input files use unchecked or unsafe operations.
[WARNING] /F:/jenkins/jenkins-slave/workspace/UIMA-v3-sdk/uimaj-examples/src/main/java/org/apache/uima/examples/xmi/XmiEcoreCasConsumer.java:
Recompile with -Xlint:unchecked for details.
[INFO] 4 warnings 
[INFO] -------------------------------------------------------------
[INFO] -------------------------------------------------------------
[ERROR] COMPILATION ERROR : 
[INFO] -------------------------------------------------------------
[ERROR] /F:/jenkins/jenkins-slave/workspace/UIMA-v3-sdk/uimaj-examples/src/main/java/org/apache/uima/tutorial/ex4/MeetingAnnotator.java:[68,50]
incompatible types: org.apache.uima.cas.FeatureStructure cannot be converted to org.apache.uima.tutorial.RoomNumber
[ERROR] /F:/jenkins/jenkins-slave/workspace/UIMA-v3-sdk/uimaj-examples/src/main/java/org/apache/uima/tutorial/ex4/MeetingAnnotator.java:[69,45]
incompatible types: org.apache.uima.cas.FeatureStructure cannot be converted to org.apache.uima.tutorial.DateAnnot
[ERROR] /F:/jenkins/jenkins-slave/workspace/UIMA-v3-sdk/uimaj-examples/src/main/java/org/apache/uima/tutorial/ex4/MeetingAnnotator.java:[70,47]
incompatible types: org.apache.uima.cas.FeatureStructure cannot be converted to org.apache.uima.tutorial.TimeAnnot
[ERROR] /F:/jenkins/jenkins-slave/workspace/UIMA-v3-sdk/uimaj-examples/src/main/java/org/apache/uima/tutorial/ex4/MeetingAnnotator.java:[71,50]
incompatible types: org.apache.uima.cas.FeatureStructure cannot be converted to org.apache.uima.tutorial.TimeAnnot
[INFO] 4 errors 
[INFO] -------------------------------------------------------------
[INFO]                                                                         
[INFO] ------------------------------------------------------------------------
[INFO] Skipping Apache UIMA Java SDK: uimaj
[INFO] This project has been banned from the build due to previous failures.
[INFO] ------------------------------------------------------------------------
[INFO] ------------------------------------------------------------------------
[INFO] Reactor Summary:
[INFO] 
[INFO] Apache UIMA Java SDK: uimaj-parent ................. SUCCESS [ 34.147 s]
[INFO] Apache UIMA Base: uimaj-test-util: JUnit utilities . SUCCESS [ 37.001 s]
[INFO] Apache UIMA Base: uimaj-core ....................... SUCCESS [04:25 min]
[INFO] Apache UIMA Base: jVinci: Vinci Transport Library .. SUCCESS [ 20.609 s]
[INFO] Apache UIMA Base: uimaj-adapter-vinci: Vinci Adapter SUCCESS [ 19.890 s]
[INFO] Apache UIMA Base: uimaj-cpe: Collection Processing Engine SUCCESS [01:32 min]
[INFO] Apache UIMA Base: uimaj-document-annotation ........ SUCCESS [ 28.021 s]
[INFO] Apache UIMA Base: uimaj-tools: Tools ............... SUCCESS [01:24 min]
[INFO] Apache UIMA Base: uimaj-v3migration-jcas ........... SUCCESS [ 14.974 s]
[INFO] Apache UIMA Base: uimaj-examples: SDK Examples ..... FAILURE [  1.733 s]
[INFO] Apache UIMA Base: uimaj-adapter-soap: SOAP Adapter . SKIPPED
[INFO] Apache UIMA Base: uimaj-component-test-util: for JUnit SKIPPED
[INFO] Apache UIMA Eclipse: uimaj-ep-debug ................ SKIPPED
[INFO] Apache UIMA Eclipse: uimaj-ep-jcasgen .............. SKIPPED
[INFO] Apache UIMA Eclipse: uimaj-ep-configurator: Descriptor Editor SKIPPED
[INFO] Apache UIMA Eclipse: uimaj-ep-pear-packager ........ SKIPPED
[INFO] Apache UIMA Eclipse: uimaj-ep-launcher ............. SKIPPED
[INFO] Apache UIMA Eclipse: uimaj-ep-cas-editor ........... SKIPPED
[INFO] Apache UIMA Eclipse: uimaj-ep-cas-editor-ide ....... SKIPPED
[INFO] Apache UIMA Eclipse: uimaj-ep-runtime .............. SKIPPED
[INFO] Apache UIMA Eclipse: uimaj-eclipse-feature-tools ... SKIPPED
[INFO] Apache UIMA Eclipse: uimaj-eclipse-feature-runtime . SKIPPED
[INFO] Apache UIMA Aggregate: aggregate-uimaj-eclipse-plugins SKIPPED
[INFO] Apache UIMA SDK Documentation - overview and setup . SKIPPED
[INFO] Apache UIMA SDK Documentation - references ......... SKIPPED
[INFO] Apache UIMA SDK Documentation - tools .............. SKIPPED
[INFO] Apache UIMA SDK Documentation - tutorials and user's guides SKIPPED
[INFO] Apache UIMA SDK Documentation - Version 3 user's guide SKIPPED
[INFO] Apache UIMA Aggregate: aggregate-uimaj-docbooks .... SKIPPED
[INFO] Apache UIMA Maven: PearPackagingMavenPlugin ........ SKIPPED
[INFO] Apache UIMA Maven: jcasgen-maven-plugin ............ SKIPPED
[INFO] Apache UIMA Base: uimaj-bootstrap .................. SKIPPED
[INFO] Apache UIMA Aggregate: aggregate-uimaj ............. SKIPPED
[INFO] Apache UIMA Base: uimaj-json: JSON ................. SKIPPED
[INFO] Apache UIMA Java SDK: uimaj ........................ SKIPPED
[INFO] ------------------------------------------------------------------------
[INFO] BUILD FAILURE
[INFO] ------------------------------------------------------------------------
[INFO] Total time: 11:14 min
[INFO] Finished at: 2017-10-30T18:50:19+00:00
[INFO] Final Memory: 109M/977M
[INFO] ------------------------------------------------------------------------
[ERROR] Failed to execute goal org.apache.maven.plugins:maven-compiler-plugin:3.1:compile
(default-compile) on project uimaj-examples: Compilation failure: Compilation failure:
[ERROR] /F:/jenkins/jenkins-slave/workspace/UIMA-v3-sdk/uimaj-examples/src/main/java/org/apache/uima/tutorial/ex4/MeetingAnnotator.java:[68,50]
incompatible types: org.apache.uima.cas.FeatureStructure cannot be converted to org.apache.uima.tutorial.RoomNumber
[ERROR] /F:/jenkins/jenkins-slave/workspace/UIMA-v3-sdk/uimaj-examples/src/main/java/org/apache/uima/tutorial/ex4/MeetingAnnotator.java:[69,45]
incompatible types: org.apache.uima.cas.FeatureStructure cannot be converted to org.apache.uima.tutorial.DateAnnot
[ERROR] /F:/jenkins/jenkins-slave/workspace/UIMA-v3-sdk/uimaj-examples/src/main/java/org/apache/uima/tutorial/ex4/MeetingAnnotator.java:[70,47]
incompatible types: org.apache.uima.cas.FeatureStructure cannot be converted to org.apache.uima.tutorial.TimeAnnot
[ERROR] /F:/jenkins/jenkins-slave/workspace/UIMA-v3-sdk/uimaj-examples/src/main/java/org/apache/uima/tutorial/ex4/MeetingAnnotator.java:[71,50]
incompatible types: org.apache.uima.cas.FeatureStructure cannot be converted to org.apache.uima.tutorial.TimeAnnot
[ERROR] -> [Help 1]
[ERROR] 
[ERROR] To see the full stack trace of the errors, re-run Maven with the -e switch.
[ERROR] Re-run Maven using the -X switch to enable full debug logging.
[ERROR] 
[ERROR] For more information about the errors and possible solutions, please read the following
articles:
[ERROR] [Help 1] http://cwiki.apache.org/confluence/display/MAVEN/MojoFailureException
[ERROR] 
[ERROR] After correcting the problems, you can resume the build with the command
[ERROR]   mvn <goals> -rf :uimaj-examples
[JENKINS] Archiving F:\jenkins\jenkins-slave\workspace\UIMA-v3-sdk\uimaj-eclipse-feature-runtime\pom.xml
to org.apache.uima/uimaj-eclipse-feature-runtime/3.0.1-beta-SNAPSHOT/uimaj-eclipse-feature-runtime-3.0.1-beta-SNAPSHOT.pom
[JENKINS] Archiving F:\jenkins\jenkins-slave\workspace\UIMA-v3-sdk\uimaj-ep-launcher\pom.xml
to org.apache.uima/uimaj-ep-launcher/3.0.1-beta-SNAPSHOT/uimaj-ep-launcher-3.0.1-beta-SNAPSHOT.pom
[JENKINS] Archiving F:\jenkins\jenkins-slave\workspace\UIMA-v3-sdk\uimaj-eclipse-feature-tools\pom.xml
to org.apache.uima/uimaj-eclipse-feature-tools/3.0.1-beta-SNAPSHOT/uimaj-eclipse-feature-tools-3.0.1-beta-SNAPSHOT.pom
[JENKINS] Archiving F:\jenkins\jenkins-slave\workspace\UIMA-v3-sdk\uimaj-bootstrap\pom.xml
to org.apache.uima/uimaj-bootstrap/3.0.1-beta-SNAPSHOT/uimaj-bootstrap-3.0.1-beta-SNAPSHOT.pom
[JENKINS] Archiving F:\jenkins\jenkins-slave\workspace\UIMA-v3-sdk\aggregate-uimaj-eclipse-plugins\pom.xml
to org.apache.uima/aggregate-uimaj-eclipse-plugins/3.0.1-beta-SNAPSHOT/aggregate-uimaj-eclipse-plugins-3.0.1-beta-SNAPSHOT.pom
[JENKINS] Archiving F:\jenkins\jenkins-slave\workspace\UIMA-v3-sdk\uimaj-core\pom.xml to org.apache.uima/uimaj-core/3.0.1-beta-SNAPSHOT/uimaj-core-3.0.1-beta-SNAPSHOT.pom
[JENKINS] Archiving F:\jenkins\jenkins-slave\workspace\UIMA-v3-sdk\uimaj-core\target\uima-core.jar
to org.apache.uima/uimaj-core/3.0.1-beta-SNAPSHOT/uimaj-core-3.0.1-beta-SNAPSHOT.jar
[JENKINS] Archiving F:\jenkins\jenkins-slave\workspace\UIMA-v3-sdk\uimaj-component-test-util\pom.xml
to org.apache.uima/uimaj-component-test-util/3.0.1-beta-SNAPSHOT/uimaj-component-test-util-3.0.1-beta-SNAPSHOT.pom
[JENKINS] Archiving F:\jenkins\jenkins-slave\workspace\UIMA-v3-sdk\aggregate-uimaj-docbooks\pom.xml
to org.apache.uima/aggregate-uimaj-docbooks/3.0.1-beta-SNAPSHOT/aggregate-uimaj-docbooks-3.0.1-beta-SNAPSHOT.pom
[JENKINS] Archiving F:\jenkins\jenkins-slave\workspace\UIMA-v3-sdk\uima-docbook-tools\pom.xml
to org.apache.uima/uima-docbook-tools/3.0.1-beta-SNAPSHOT/uima-docbook-tools-3.0.1-beta-SNAPSHOT.pom
[JENKINS] Archiving F:\jenkins\jenkins-slave\workspace\UIMA-v3-sdk\uimaj-document-annotation\pom.xml
to org.apache.uima/uimaj-document-annotation/3.0.1-beta-SNAPSHOT/uimaj-document-annotation-3.0.1-beta-SNAPSHOT.pom
[JENKINS] Archiving F:\jenkins\jenkins-slave\workspace\UIMA-v3-sdk\uimaj-document-annotation\target\uima-document-annotation.jar
to org.apache.uima/uimaj-document-annotation/3.0.1-beta-SNAPSHOT/uimaj-document-annotation-3.0.1-beta-SNAPSHOT.jar
[JENKINS] Archiving F:\jenkins\jenkins-slave\workspace\UIMA-v3-sdk\jVinci\pom.xml to org.apache.uima/jVinci/3.0.1-beta-SNAPSHOT/jVinci-3.0.1-beta-SNAPSHOT.pom
[JENKINS] Archiving F:\jenkins\jenkins-slave\workspace\UIMA-v3-sdk\jVinci\target\jVinci.jar
to org.apache.uima/jVinci/3.0.1-beta-SNAPSHOT/jVinci-3.0.1-beta-SNAPSHOT.jar
[JENKINS] Archiving F:\jenkins\jenkins-slave\workspace\UIMA-v3-sdk\uimaj-ep-configurator\pom.xml
to org.apache.uima/uimaj-ep-configurator/3.0.1-beta-SNAPSHOT/uimaj-ep-configurator-3.0.1-beta-SNAPSHOT.pom
[JENKINS] Archiving F:\jenkins\jenkins-slave\workspace\UIMA-v3-sdk\uimaj-examples\pom.xml
to org.apache.uima/uimaj-examples/3.0.1-beta-SNAPSHOT/uimaj-examples-3.0.1-beta-SNAPSHOT.pom
[JENKINS] Archiving F:\jenkins\jenkins-slave\workspace\UIMA-v3-sdk\uimaj-adapter-vinci\pom.xml
to org.apache.uima/uimaj-adapter-vinci/3.0.1-beta-SNAPSHOT/uimaj-adapter-vinci-3.0.1-beta-SNAPSHOT.pom
[JENKINS] Archiving F:\jenkins\jenkins-slave\workspace\UIMA-v3-sdk\uimaj-adapter-vinci\target\uima-adapter-vinci.jar
to org.apache.uima/uimaj-adapter-vinci/3.0.1-beta-SNAPSHOT/uimaj-adapter-vinci-3.0.1-beta-SNAPSHOT.jar
[JENKINS] Archiving F:\jenkins\jenkins-slave\workspace\UIMA-v3-sdk\PearPackagingMavenPlugin\pom.xml
to org.apache.uima/PearPackagingMavenPlugin/3.0.1-beta-SNAPSHOT/PearPackagingMavenPlugin-3.0.1-beta-SNAPSHOT.pom
[JENKINS] Archiving F:\jenkins\jenkins-slave\workspace\UIMA-v3-sdk\uimaj-ep-cas-editor-ide\pom.xml
to org.apache.uima/uimaj-ep-cas-editor-ide/3.0.1-beta-SNAPSHOT/uimaj-ep-cas-editor-ide-3.0.1-beta-SNAPSHOT.pom
[JENKINS] Archiving F:\jenkins\jenkins-slave\workspace\UIMA-v3-sdk\uimaj-test-util\pom.xml
to org.apache.uima/uimaj-test-util/3.0.1-beta-SNAPSHOT/uimaj-test-util-3.0.1-beta-SNAPSHOT.pom
[JENKINS] Archiving F:\jenkins\jenkins-slave\workspace\UIMA-v3-sdk\uimaj-test-util\target\uimaj-test-util-3.0.1-beta-SNAPSHOT.jar
to org.apache.uima/uimaj-test-util/3.0.1-beta-SNAPSHOT/uimaj-test-util-3.0.1-beta-SNAPSHOT.jar
[JENKINS] Archiving F:\jenkins\jenkins-slave\workspace\UIMA-v3-sdk\uimaj-ep-runtime\pom.xml
to org.apache.uima/uimaj-ep-runtime/3.0.1-beta-SNAPSHOT/uimaj-ep-runtime-3.0.1-beta-SNAPSHOT.pom
[JENKINS] Archiving F:\jenkins\jenkins-slave\workspace\UIMA-v3-sdk\uimaj-ep-debug\pom.xml
to org.apache.uima/uimaj-ep-debug/3.0.1-beta-SNAPSHOT/uimaj-ep-debug-3.0.1-beta-SNAPSHOT.pom
[JENKINS] Archiving F:\jenkins\jenkins-slave\workspace\UIMA-v3-sdk\uimaj-ep-cas-editor\pom.xml
to org.apache.uima/uimaj-ep-cas-editor/3.0.1-beta-SNAPSHOT/uimaj-ep-cas-editor-3.0.1-beta-SNAPSHOT.pom
[JENKINS] Archiving F:\jenkins\jenkins-slave\workspace\UIMA-v3-sdk\aggregate-uimaj\pom.xml
to org.apache.uima/aggregate-uimaj/3.0.1-beta-SNAPSHOT/aggregate-uimaj-3.0.1-beta-SNAPSHOT.pom
[JENKINS] Archiving F:\jenkins\jenkins-slave\workspace\UIMA-v3-sdk\uimaj-parent\pom.xml to
org.apache.uima/uimaj-parent/3.0.1-beta-SNAPSHOT/uimaj-parent-3.0.1-beta-SNAPSHOT.pom
[JENKINS] Archiving F:\jenkins\jenkins-slave\workspace\UIMA-v3-sdk\jcasgen-maven-plugin\pom.xml
to org.apache.uima/jcasgen-maven-plugin/3.0.1-beta-SNAPSHOT/jcasgen-maven-plugin-3.0.1-beta-SNAPSHOT.pom
[JENKINS] Archiving <https://builds.apache.org/job/UIMA-v3-sdk/ws/pom.xml> to org.apache.uima/uimaj/3.0.1-beta-SNAPSHOT/uimaj-3.0.1-beta-SNAPSHOT.pom
[JENKINS] Archiving F:\jenkins\jenkins-slave\workspace\UIMA-v3-sdk\uimaj-ep-jcasgen\pom.xml
to org.apache.uima/uimaj-ep-jcasgen/3.0.1-beta-SNAPSHOT/uimaj-ep-jcasgen-3.0.1-beta-SNAPSHOT.pom
[JENKINS] Archiving F:\jenkins\jenkins-slave\workspace\UIMA-v3-sdk\uimaj-json\pom.xml to org.apache.uima/uimaj-json/3.0.1-beta-SNAPSHOT/uimaj-json-3.0.1-beta-SNAPSHOT.pom
[JENKINS] Archiving F:\jenkins\jenkins-slave\workspace\UIMA-v3-sdk\uimaj-v3migration-jcas\pom.xml
to org.apache.uima/uimaj-v3migration-jcas/3.0.1-beta-SNAPSHOT/uimaj-v3migration-jcas-3.0.1-beta-SNAPSHOT.pom
[JENKINS] Archiving F:\jenkins\jenkins-slave\workspace\UIMA-v3-sdk\uimaj-v3migration-jcas\target\uimaj-v3migration-jcas.jar
to org.apache.uima/uimaj-v3migration-jcas/3.0.1-beta-SNAPSHOT/uimaj-v3migration-jcas-3.0.1-beta-SNAPSHOT.jar
[JENKINS] Archiving F:\jenkins\jenkins-slave\workspace\UIMA-v3-sdk\uimaj-tools\pom.xml to
org.apache.uima/uimaj-tools/3.0.1-beta-SNAPSHOT/uimaj-tools-3.0.1-beta-SNAPSHOT.pom
[JENKINS] Archiving F:\jenkins\jenkins-slave\workspace\UIMA-v3-sdk\uimaj-tools\target\uima-tools.jar
to org.apache.uima/uimaj-tools/3.0.1-beta-SNAPSHOT/uimaj-tools-3.0.1-beta-SNAPSHOT.jar
[JENKINS] Archiving F:\jenkins\jenkins-slave\workspace\UIMA-v3-sdk\uima-docbook-tutorials-and-users-guides\pom.xml
to org.apache.uima/uima-docbook-tutorials-and-users-guides/3.0.1-beta-SNAPSHOT/uima-docbook-tutorials-and-users-guides-3.0.1-beta-SNAPSHOT.pom
[JENKINS] Archiving F:\jenkins\jenkins-slave\workspace\UIMA-v3-sdk\uimaj-adapter-soap\pom.xml
to org.apache.uima/uimaj-adapter-soap/3.0.1-beta-SNAPSHOT/uimaj-adapter-soap-3.0.1-beta-SNAPSHOT.pom
[JENKINS] Archiving F:\jenkins\jenkins-slave\workspace\UIMA-v3-sdk\uima-docbook-v3-users-guide\pom.xml
to org.apache.uima/uima-docbook-v3-users-guide/3.0.1-beta-SNAPSHOT/uima-docbook-v3-users-guide-3.0.1-beta-SNAPSHOT.pom
[JENKINS] Archiving F:\jenkins\jenkins-slave\workspace\UIMA-v3-sdk\uimaj-ep-pear-packager\pom.xml
to org.apache.uima/uimaj-ep-pear-packager/3.0.1-beta-SNAPSHOT/uimaj-ep-pear-packager-3.0.1-beta-SNAPSHOT.pom
[JENKINS] Archiving F:\jenkins\jenkins-slave\workspace\UIMA-v3-sdk\uima-docbook-overview-and-setup\pom.xml
to org.apache.uima/uima-docbook-overview-and-setup/3.0.1-beta-SNAPSHOT/uima-docbook-overview-and-setup-3.0.1-beta-SNAPSHOT.pom
[JENKINS] Archiving F:\jenkins\jenkins-slave\workspace\UIMA-v3-sdk\uima-docbook-references\pom.xml
to org.apache.uima/uima-docbook-references/3.0.1-beta-SNAPSHOT/uima-docbook-references-3.0.1-beta-SNAPSHOT.pom
[JENKINS] Archiving F:\jenkins\jenkins-slave\workspace\UIMA-v3-sdk\uimaj-cpe\pom.xml to org.apache.uima/uimaj-cpe/3.0.1-beta-SNAPSHOT/uimaj-cpe-3.0.1-beta-SNAPSHOT.pom
[JENKINS] Archiving F:\jenkins\jenkins-slave\workspace\UIMA-v3-sdk\uimaj-cpe\target\uima-cpe.jar
to org.apache.uima/uimaj-cpe/3.0.1-beta-SNAPSHOT/uimaj-cpe-3.0.1-beta-SNAPSHOT.jar
channel stopped
[WARNINGS] Skipping publisher since build result is FAILURE

Mime
View raw message