uima-dev mailing list archives

Site index · List index
Message view « Date » · « Thread »
Top « Date » · « Thread »
From Apache Jenkins Server <jenk...@builds.apache.org>
Subject Build failed in Jenkins: UIMA-DUCC #1273
Date Thu, 26 Oct 2017 18:56:45 GMT
See <https://builds.apache.org/job/UIMA-DUCC/1273/display/redirect?page=changes>

Changes:

[burn] UIMA-5605 Set free space correctly when a machine size changes

------------------------------------------
[...truncated 97.97 KB...]
[INFO] 
[INFO] --- maven-resources-plugin:2.6:resources (default-resources) @ uima-ducc-transport
---
[INFO] Using 'UTF-8' encoding to copy filtered resources.
[INFO] Copying 0 resource
[INFO] Copying 3 resources
[INFO] Copying 3 resources
[INFO] 
[INFO] --- maven-compiler-plugin:3.1:compile (default-compile) @ uima-ducc-transport ---
[INFO] Nothing to compile - all classes are up to date
[INFO] 
[INFO] --- cobertura-maven-plugin:2.7:instrument (default-cli) @ uima-ducc-transport ---
[INFO] Cobertura 2.1.1 - GNU GPL License (NO WARRANTY) - See COPYRIGHT file
[INFO] Cobertura: Saved information on 351 classes.
[INFO] Cobertura: Saved information on 351 classes.

[ERROR] SLF4J: Class path contains multiple SLF4J bindings.
SLF4J: Found binding in [jar:file:/home/jenkins/jenkins-slave/maven-repositories/0/ch/qos/logback/logback-classic/1.0.13/logback-classic-1.0.13.jar!/org/slf4j/impl/StaticLoggerBinder.class]
SLF4J: Found binding in [jar:file:/home/jenkins/jenkins-slave/maven-repositories/0/org/slf4j/slf4j-log4j12/1.7.6/slf4j-log4j12-1.7.6.jar!/org/slf4j/impl/StaticLoggerBinder.class]
SLF4J: Found binding in [jar:file:/home/jenkins/jenkins-slave/maven-repositories/0/org/apache/activemq/activemq-all/5.14.0/activemq-all-5.14.0.jar!/org/slf4j/impl/StaticLoggerBinder.class]
SLF4J: See http://www.slf4j.org/codes.html#multiple_bindings for an explanation.
SLF4J: Actual binding is of type [ch.qos.logback.classic.util.ContextSelectorStaticBinder]

[INFO] Instrumentation was successful.
[INFO] NOT adding cobertura ser file to attached artifacts list.
[INFO] 
[INFO] --- maven-resources-plugin:2.6:testResources (default-testResources) @ uima-ducc-transport
---
[INFO] Using 'UTF-8' encoding to copy filtered resources.
[INFO] Copying 0 resource
[INFO] Copying 3 resources
[INFO] Copying 3 resources
[INFO] 
[INFO] --- maven-compiler-plugin:3.1:testCompile (default-testCompile) @ uima-ducc-transport
---
[INFO] Nothing to compile - all classes are up to date
[INFO] 
[INFO] --- maven-surefire-plugin:2.16:test (default-test) @ uima-ducc-transport ---
[INFO] Surefire report directory: <https://builds.apache.org/job/UIMA-DUCC/ws/trunk/uima-ducc-transport/target/surefire-reports>

-------------------------------------------------------
 T E S T S
-------------------------------------------------------
Running org.apache.uima.ducc.transport.test.DuccProcessWorkItemsTest
SLF4J: Class path contains multiple SLF4J bindings.
SLF4J: Found binding in [jar:file:/home/jenkins/jenkins-slave/maven-repositories/0/org/slf4j/slf4j-log4j12/1.7.6/slf4j-log4j12-1.7.6.jar!/org/slf4j/impl/StaticLoggerBinder.class]
SLF4J: Found binding in [jar:file:/home/jenkins/jenkins-slave/maven-repositories/0/org/apache/activemq/activemq-all/5.14.0/activemq-all-5.14.0.jar!/org/slf4j/impl/StaticLoggerBinder.class]
SLF4J: Found binding in [jar:file:/home/jenkins/jenkins-slave/maven-repositories/0/ch/qos/logback/logback-classic/1.0.13/logback-classic-1.0.13.jar!/org/slf4j/impl/StaticLoggerBinder.class]
SLF4J: See http://www.slf4j.org/codes.html#multiple_bindings for an explanation.
SLF4J: Actual binding is of type [org.slf4j.impl.Log4jLoggerFactory]
     done: 2
    error: 9
    retry: 4
 dispatch: 1
avg(secs): 35
min(secs): 30
max(secs): 40
Tests run: 1, Failures: 0, Errors: 0, Skipped: 0, Time elapsed: 0.234 sec - in org.apache.uima.ducc.transport.test.DuccProcessWorkItemsTest
 INFO | Cobertura: Loaded information on 351 classes.
 INFO | Cobertura: Saved information on 351 classes.

Results :

Tests run: 1, Failures: 0, Errors: 0, Skipped: 0

[JENKINS] Recording test results
[INFO] 
[INFO] <<< cobertura-maven-plugin:2.7:cobertura (default-cli) < [cobertura]test
@ uima-ducc-transport <<<
[INFO] 
[INFO] --- cobertura-maven-plugin:2.7:cobertura (default-cli) @ uima-ducc-transport ---
[INFO] Cobertura 2.1.1 - GNU GPL License (NO WARRANTY) - See COPYRIGHT file
[INFO] Cobertura: Loaded information on 351 classes.
Report time: 1587ms

[INFO] Cobertura Report generation was successful.
[INFO]                                                                         
[INFO] ------------------------------------------------------------------------
[INFO] Building Apache UIMA DUCC: uima-ducc-cli 2.2.2-SNAPSHOT
[INFO] ------------------------------------------------------------------------
[INFO] 
[INFO] --- maven-clean-plugin:2.5:clean (default-clean) @ uima-ducc-cli ---
[INFO] Deleting <https://builds.apache.org/job/UIMA-DUCC/ws/trunk/uima-ducc-cli/target>
[TASKS] Scanning folder '<https://builds.apache.org/job/UIMA-DUCC/ws/trunk/uima-ducc-cli'>
for files matching the pattern '**/*.java' - excludes: 
[TASKS] Found 47 files to scan for tasks
Found 14 open tasks.
[TASKS] Computing warning deltas based on reference build #1272
[INFO] 
[INFO] --- maven-enforcer-plugin:1.3.1:enforce (enforce-versions) @ uima-ducc-cli ---
[INFO] 
[INFO] --- build-helper-maven-plugin:1.8:parse-version (parse-project-version) @ uima-ducc-cli
---
[INFO] 
[INFO] --- uima-build-helper-maven-plugin:7:parse-date-time (set buildYear and buildMonth)
@ uima-ducc-cli ---
[INFO] 
[INFO] --- buildnumber-maven-plugin:1.4:create (default) @ uima-ducc-cli ---
[INFO] Executing: /bin/sh -c cd '<https://builds.apache.org/job/UIMA-DUCC/ws/trunk/uima-ducc-cli'>
&& 'svn' '--non-interactive' 'info'
[INFO] Working directory: <https://builds.apache.org/job/UIMA-DUCC/ws/trunk/uima-ducc-cli>
[INFO] Storing buildNumber: 1813448 at timestamp: 1509044175457
[INFO] Executing: /bin/sh -c cd '<https://builds.apache.org/job/UIMA-DUCC/ws/trunk/uima-ducc-cli'>
&& 'svn' '--non-interactive' 'info'
[INFO] Working directory: <https://builds.apache.org/job/UIMA-DUCC/ws/trunk/uima-ducc-cli>
[INFO] Storing buildScmBranch: trunk
[INFO] 
[INFO] --- maven-remote-resources-plugin:1.5:process (default) @ uima-ducc-cli ---
[INFO] 
[INFO] --- maven-resources-plugin:2.6:resources (default-resources) @ uima-ducc-cli ---
[INFO] Using 'UTF-8' encoding to copy filtered resources.
[INFO] Copying 0 resource
[INFO] Copying 3 resources
[INFO] 
[INFO] --- maven-compiler-plugin:3.1:compile (default-compile) @ uima-ducc-cli ---
[INFO] Changes detected - recompiling the module!
[INFO] Compiling 37 source files to <https://builds.apache.org/job/UIMA-DUCC/ws/trunk/uima-ducc-cli/target/classes>
[INFO] 
[INFO] --- maven-resources-plugin:2.6:testResources (default-testResources) @ uima-ducc-cli
---
[INFO] Using 'UTF-8' encoding to copy filtered resources.
[INFO] Copying 0 resource
[INFO] Copying 3 resources
[INFO] 
[INFO] --- maven-compiler-plugin:3.1:testCompile (default-testCompile) @ uima-ducc-cli ---
[INFO] Changes detected - recompiling the module!
[INFO] Compiling 10 source files to <https://builds.apache.org/job/UIMA-DUCC/ws/trunk/uima-ducc-cli/target/test-classes>
[INFO] 
[INFO] --- maven-surefire-plugin:2.16:test (default-test) @ uima-ducc-cli ---
[INFO] Surefire report directory: <https://builds.apache.org/job/UIMA-DUCC/ws/trunk/uima-ducc-cli/target/surefire-reports>

-------------------------------------------------------
 T E S T S
-------------------------------------------------------

Results :

Tests run: 0, Failures: 0, Errors: 0, Skipped: 0

[JENKINS] Recording test results[INFO] 
[INFO] --- maven-antrun-plugin:1.7:run (dup-meta-jar-cleanup) @ uima-ducc-cli ---

[INFO] Executing tasks

main:
[INFO] Executed tasks
[INFO] 
[INFO] --- maven-jar-plugin:2.3.2:jar (default-jar) @ uima-ducc-cli ---
[INFO] Building jar: <https://builds.apache.org/job/UIMA-DUCC/ws/trunk/uima-ducc-cli/target/uima-ducc-cli-2.2.2-SNAPSHOT.jar>
[INFO] 
[INFO] --- maven-site-plugin:3.3:attach-descriptor (attach-descriptor) @ uima-ducc-cli ---
[INFO] 
[INFO] --- maven-jar-plugin:2.3.2:jar (DuccCli) @ uima-ducc-cli ---
[INFO] Building jar: <https://builds.apache.org/job/UIMA-DUCC/ws/trunk/uima-ducc-cli/target/uima-ducc-cli.jar>
[INFO] 
[INFO] --- maven-jar-plugin:2.3.2:jar (uima-ducc-cli) @ uima-ducc-cli ---
[INFO] 
[INFO] --- maven-install-plugin:2.5.1:install (default-install) @ uima-ducc-cli ---
[INFO] Installing <https://builds.apache.org/job/UIMA-DUCC/ws/trunk/uima-ducc-cli/target/uima-ducc-cli-2.2.2-SNAPSHOT.jar>
to /home/jenkins/jenkins-slave/maven-repositories/0/org/apache/uima/uima-ducc-cli/2.2.2-SNAPSHOT/uima-ducc-cli-2.2.2-SNAPSHOT.jar
[INFO] Installing <https://builds.apache.org/job/UIMA-DUCC/ws/trunk/uima-ducc-cli/pom.xml>
to /home/jenkins/jenkins-slave/maven-repositories/0/org/apache/uima/uima-ducc-cli/2.2.2-SNAPSHOT/uima-ducc-cli-2.2.2-SNAPSHOT.pom
[INFO] 
[INFO] --- maven-pmd-plugin:3.6:pmd (default-cli) @ uima-ducc-cli ---
[PMD] Searching for all files in <https://builds.apache.org/job/UIMA-DUCC/ws/trunk/uima-ducc-cli/target>
that match the pattern pmd.xml
[PMD] Parsing 1 file in <https://builds.apache.org/job/UIMA-DUCC/ws/trunk/uima-ducc-cli/target>
[PMD] Successfully parsed file <https://builds.apache.org/job/UIMA-DUCC/ws/trunk/uima-ducc-cli/target/pmd.xml>
of module Apache UIMA DUCC: uima-ducc-cli with 69 unique warnings and 0 duplicates.
[PMD] Computing warning deltas based on reference build #1272
[INFO] 
[INFO] --- maven-pmd-plugin:3.6:cpd (default-cli) @ uima-ducc-cli ---
[DRY] Searching for all files in <https://builds.apache.org/job/UIMA-DUCC/ws/trunk/uima-ducc-cli/target>
that match the pattern cpd.xml
[DRY] Parsing 1 file in <https://builds.apache.org/job/UIMA-DUCC/ws/trunk/uima-ducc-cli/target>
[DRY] Successfully parsed file <https://builds.apache.org/job/UIMA-DUCC/ws/trunk/uima-ducc-cli/target/cpd.xml>
of module Apache UIMA DUCC: uima-ducc-cli with 2 unique warnings and 0 duplicates.
[DRY] Computing warning deltas based on reference build #1272
[INFO] 
[INFO] --- findbugs-maven-plugin:3.0.4:findbugs (default-cli) @ uima-ducc-cli ---
[INFO] Fork Value is true
     [java] Exception in thread "main" java.lang.AbstractMethodError
     [java] 	at edu.umd.cs.findbugs.ba.jsr305.TypeQualifierResolver.resolveTypeQualifiers(TypeQualifierResolver.java:183)
     [java] 	at edu.umd.cs.findbugs.ba.jsr305.TypeQualifierApplications.getDirectAnnotation(TypeQualifierApplications.java:156)
     [java] 	at edu.umd.cs.findbugs.ba.jsr305.TypeQualifierApplications.getDirectApplications(TypeQualifierApplications.java:237)
     [java] 	at edu.umd.cs.findbugs.ba.jsr305.TypeQualifierApplications.getApplicableScopedApplications(TypeQualifierApplications.java:295)
     [java] 	at edu.umd.cs.findbugs.ba.jsr305.TypeQualifierApplications.getApplicableScopedApplications(TypeQualifierApplications.java:311)
     [java] 	at edu.umd.cs.findbugs.ba.jsr305.TypeQualifierApplications.getApplicableApplications(TypeQualifierApplications.java:352)
     [java] 	at edu.umd.cs.findbugs.detect.NoteDirectlyRelevantTypeQualifiers.updateApplicableAnnotations(NoteDirectlyRelevantTypeQualifiers.java:129)
     [java] 	at edu.umd.cs.findbugs.detect.NoteDirectlyRelevantTypeQualifiers.visit(NoteDirectlyRelevantTypeQualifiers.java:76)
     [java] 	at edu.umd.cs.findbugs.visitclass.BetterVisitor.visitCode(BetterVisitor.java:218)
     [java] 	at edu.umd.cs.findbugs.visitclass.PreorderVisitor.visitCode(PreorderVisitor.java:235)
     [java] 	at org.apache.bcel.classfile.Code.accept(Code.java:135)
     [java] 	at edu.umd.cs.findbugs.visitclass.PreorderVisitor.doVisitMethod(PreorderVisitor.java:307)
     [java] 	at edu.umd.cs.findbugs.visitclass.PreorderVisitor.visitJavaClass(PreorderVisitor.java:395)
     [java] 	at org.apache.bcel.classfile.JavaClass.accept(JavaClass.java:215)
     [java] 	at edu.umd.cs.findbugs.detect.NoteDirectlyRelevantTypeQualifiers.visitClassContext(NoteDirectlyRelevantTypeQualifiers.java:64)
     [java] 	at edu.umd.cs.findbugs.DetectorToDetector2Adapter.visitClass(DetectorToDetector2Adapter.java:76)
     [java] 	at edu.umd.cs.findbugs.FindBugs2.analyzeApplication(FindBugs2.java:1089)
     [java] 	at edu.umd.cs.findbugs.FindBugs2.execute(FindBugs2.java:283)
     [java] 	at edu.umd.cs.findbugs.FindBugs.runMain(FindBugs.java:402)
     [java] 	at edu.umd.cs.findbugs.FindBugs2.main(FindBugs2.java:1200)
[FINDBUGS] No report found for mojo findbugs
[INFO] ------------------------------------------------------------------------
[INFO] Reactor Summary:
[INFO] 
[INFO] Apache UIMA DUCC: uima-ducc-parent ................. SUCCESS [ 22.911 s]
[INFO] Apache UIMA DUCC: uima-ducc-user ................... SUCCESS [ 52.710 s]
[INFO] Apache UIMA DUCC: uima-ducc-common ................. SUCCESS [ 54.267 s]
[INFO] Apache UIMA DUCC: uima-ducc-container .............. SUCCESS [01:00 min]
[INFO] Apache UIMA DUCC: uima-ducc-transport .............. SUCCESS [ 48.140 s]
[INFO] Apache UIMA DUCC: uima-ducc-cli .................... FAILURE [ 19.008 s]
[INFO] Apache UIMA DUCC: uima-ducc-pm ..................... SKIPPED
[INFO] Apache UIMA DUCC: uima-ducc-rm ..................... SKIPPED
[INFO] Apache UIMA DUCC: uima-ducc-sm ..................... SKIPPED
[INFO] Apache UIMA DUCC: uima-ducc-database ............... SKIPPED
[INFO] Apache UIMA DUCC: uima-ducc-orchestrator ........... SKIPPED
[INFO] Apache UIMA DUCC: uima-ducc-agent .................. SKIPPED
[INFO] Apache UIMA DUCC: uima-ducc-duccdocs ............... SKIPPED
[INFO] Apache UIMA DUCC: uima-ducc-web .................... SKIPPED
[INFO] Apache UIMA DUCC: uima-ducc-examples ............... SKIPPED
[INFO] Apache UIMA DUCC: uima-ducc-spawn .................. SKIPPED
[INFO] Apache UIMA-DUCC: uima-ducc ........................ SKIPPED
[INFO] ------------------------------------------------------------------------
[INFO] BUILD FAILURE
[INFO] ------------------------------------------------------------------------
[INFO] Total time: 04:30 min
[INFO] Finished at: 2017-10-26T18:56:35+00:00
[INFO] Final Memory: 92M/711M
[INFO] ------------------------------------------------------------------------
[ERROR] Failed to execute goal org.codehaus.mojo:findbugs-maven-plugin:3.0.4:findbugs (default-cli)
on project uima-ducc-cli: Execution default-cli of goal org.codehaus.mojo:findbugs-maven-plugin:3.0.4:findbugs
failed: Java returned: 1 -> [Help 1]
[ERROR] 
[ERROR] To see the full stack trace of the errors, re-run Maven with the -e switch.
[ERROR] Re-run Maven using the -X switch to enable full debug logging.
[ERROR] 
[ERROR] For more information about the errors and possible solutions, please read the following
articles:
[ERROR] [Help 1] http://cwiki.apache.org/confluence/display/MAVEN/PluginExecutionException
[ERROR] 
[ERROR] After correcting the problems, you can resume the build with the command
[ERROR]   mvn <goals> -rf :uima-ducc-cli
[JENKINS] Archiving <https://builds.apache.org/job/UIMA-DUCC/ws/trunk/uima-ducc-sm/pom.xml>
to org.apache.uima/uima-ducc-sm/2.2.2-SNAPSHOT/uima-ducc-sm-2.2.2-SNAPSHOT.pom
[JENKINS] Archiving <https://builds.apache.org/job/UIMA-DUCC/ws/trunk/uima-ducc-parent/pom.xml>
to org.apache.uima/uima-ducc-parent/2.2.2-SNAPSHOT/uima-ducc-parent-2.2.2-SNAPSHOT.pom
[JENKINS] Archiving <https://builds.apache.org/job/UIMA-DUCC/ws/trunk/uima-ducc-duccdocs/pom.xml>
to org.apache.uima/uima-ducc-duccdocs/2.2.2-SNAPSHOT/uima-ducc-duccdocs-2.2.2-SNAPSHOT.pom
[JENKINS] Archiving <https://builds.apache.org/job/UIMA-DUCC/ws/trunk/uima-ducc-pm/pom.xml>
to org.apache.uima/uima-ducc-pm/2.2.2-SNAPSHOT/uima-ducc-pm-2.2.2-SNAPSHOT.pom
[JENKINS] Archiving <https://builds.apache.org/job/UIMA-DUCC/ws/trunk/uima-ducc-database/pom.xml>
to org.apache.uima/uima-ducc-database/2.2.2-SNAPSHOT/uima-ducc-database-2.2.2-SNAPSHOT.pom
[JENKINS] Archiving <https://builds.apache.org/job/UIMA-DUCC/ws/trunk/uima-ducc-rm/pom.xml>
to org.apache.uima/uima-ducc-rm/2.2.2-SNAPSHOT/uima-ducc-rm-2.2.2-SNAPSHOT.pom
[JENKINS] Archiving <https://builds.apache.org/job/UIMA-DUCC/ws/trunk/uima-ducc-examples/pom.xml>
to org.apache.uima/uima-ducc-examples/2.2.2-SNAPSHOT/uima-ducc-examples-2.2.2-SNAPSHOT.pom
[JENKINS] Archiving <https://builds.apache.org/job/UIMA-DUCC/ws/trunk/uima-ducc-web/pom.xml>
to org.apache.uima/uima-ducc-web/2.2.2-SNAPSHOT/uima-ducc-web-2.2.2-SNAPSHOT.pom
[JENKINS] Archiving <https://builds.apache.org/job/UIMA-DUCC/ws/trunk/uima-ducc-container/pom.xml>
to org.apache.uima/uima-ducc-container/2.2.2-SNAPSHOT/uima-ducc-container-2.2.2-SNAPSHOT.pom
[JENKINS] Archiving <https://builds.apache.org/job/UIMA-DUCC/ws/trunk/uima-ducc-container/target/uima-ducc-container-2.2.2-SNAPSHOT.jar>
to org.apache.uima/uima-ducc-container/2.2.2-SNAPSHOT/uima-ducc-container-2.2.2-SNAPSHOT.jar
[JENKINS] Archiving <https://builds.apache.org/job/UIMA-DUCC/ws/trunk/uima-ducc-spawn/pom.xml>
to org.apache.uima/uima-ducc-spawn/2.2.2-SNAPSHOT/uima-ducc-spawn-2.2.2-SNAPSHOT.pom
[JENKINS] Archiving <https://builds.apache.org/job/UIMA-DUCC/ws/trunk/uima-ducc-common/pom.xml>
to org.apache.uima/uima-ducc-common/2.2.2-SNAPSHOT/uima-ducc-common-2.2.2-SNAPSHOT.pom
[JENKINS] Archiving <https://builds.apache.org/job/UIMA-DUCC/ws/trunk/uima-ducc-common/target/uima-ducc-common-2.2.2-SNAPSHOT.jar>
to org.apache.uima/uima-ducc-common/2.2.2-SNAPSHOT/uima-ducc-common-2.2.2-SNAPSHOT.jar
[JENKINS] Archiving <https://builds.apache.org/job/UIMA-DUCC/ws/trunk/pom.xml> to org.apache.uima/uima-ducc/2.2.2-SNAPSHOT/uima-ducc-2.2.2-SNAPSHOT.pom
[JENKINS] Archiving <https://builds.apache.org/job/UIMA-DUCC/ws/trunk/uima-ducc-agent/pom.xml>
to org.apache.uima/uima-ducc-agent/2.2.2-SNAPSHOT/uima-ducc-agent-2.2.2-SNAPSHOT.pom
[JENKINS] Archiving <https://builds.apache.org/job/UIMA-DUCC/ws/trunk/uima-ducc-user/pom.xml>
to org.apache.uima/uima-ducc-user/2.2.2-SNAPSHOT/uima-ducc-user-2.2.2-SNAPSHOT.pom
[JENKINS] Archiving <https://builds.apache.org/job/UIMA-DUCC/ws/trunk/uima-ducc-user/target/uima-ducc-user-2.2.2-SNAPSHOT.jar>
to org.apache.uima/uima-ducc-user/2.2.2-SNAPSHOT/uima-ducc-user-2.2.2-SNAPSHOT.jar
[JENKINS] Archiving <https://builds.apache.org/job/UIMA-DUCC/ws/trunk/uima-ducc-orchestrator/pom.xml>
to org.apache.uima/uima-ducc-orchestrator/2.2.2-SNAPSHOT/uima-ducc-orchestrator-2.2.2-SNAPSHOT.pom
[JENKINS] Archiving <https://builds.apache.org/job/UIMA-DUCC/ws/trunk/uima-ducc-transport/pom.xml>
to org.apache.uima/uima-ducc-transport/2.2.2-SNAPSHOT/uima-ducc-transport-2.2.2-SNAPSHOT.pom
[JENKINS] Archiving <https://builds.apache.org/job/UIMA-DUCC/ws/trunk/uima-ducc-transport/target/uima-ducc-transport-2.2.2-SNAPSHOT.jar>
to org.apache.uima/uima-ducc-transport/2.2.2-SNAPSHOT/uima-ducc-transport-2.2.2-SNAPSHOT.jar
[JENKINS] Archiving <https://builds.apache.org/job/UIMA-DUCC/ws/trunk/uima-ducc-cli/pom.xml>
to org.apache.uima/uima-ducc-cli/2.2.2-SNAPSHOT/uima-ducc-cli-2.2.2-SNAPSHOT.pom
[JENKINS] Archiving <https://builds.apache.org/job/UIMA-DUCC/ws/trunk/uima-ducc-cli/target/uima-ducc-cli-2.2.2-SNAPSHOT.jar>
to org.apache.uima/uima-ducc-cli/2.2.2-SNAPSHOT/uima-ducc-cli-2.2.2-SNAPSHOT.jar
Sending e-mails to: dev@uima.apache.org
channel stopped
[WARNINGS] Skipping publisher since build result is FAILURE

Mime
View raw message