uima-dev mailing list archives

Site index · List index
Message view « Date » · « Thread »
Top « Date » · « Thread »
From Apache Jenkins Server <jenk...@builds.apache.org>
Subject Build failed in Jenkins: UIMA-uimaFIT_java9 #11
Date Thu, 09 Nov 2017 22:39:12 GMT
See <https://builds.apache.org/job/UIMA-uimaFIT_java9/11/display/redirect?page=changes>

Changes:

[rec] [UIMA-5645] Add FSUtil.isMultiValuedFeature signature that works without a feature structure

- Added signature that takes a type system instead of a feature structure.

[rec] [UIMA-5644] Upgrade to UIMA 2.10.2

- Set UIMA version to 2.10.2

[rec] No issue. Set version back to 2.3.1-SNAPSHOT.

------------------------------------------
[...truncated 50.77 KB...]
maven35-agent.jar already up to date
maven35-interceptor.jar already up to date
maven3-interceptor-commons.jar already up to date
[trunk] $ /home/jenkins/tools/java/jigsaw-jdk-9-ea-b156/bin/java -Xmx800m -XX:MaxPermSize=256m
-cp /home/jenkins/jenkins-slave/maven35-agent.jar:/home/jenkins/tools/maven/latest3/boot/plexus-classworlds-2.5.2.jar:/home/jenkins/tools/maven/latest3/conf/logging
jenkins.maven3.agent.Maven35Main /home/jenkins/tools/maven/latest3/ /home/jenkins/jenkins-slave/slave.jar
/home/jenkins/jenkins-slave/maven35-interceptor.jar /home/jenkins/jenkins-slave/maven3-interceptor-commons.jar
51128
Java HotSpot(TM) 64-Bit Server VM warning: Ignoring option MaxPermSize; support was removed
in 8.0
<===[JENKINS REMOTING CAPACITY]===>   channel started
Nov 09, 2017 10:38:54 PM hudson.remoting.RemoteClassLoader <clinit>
WARNING: null
java.lang.reflect.InaccessibleObjectException: Unable to make protected java.lang.Object java.lang.ClassLoader.getClassLoadingLock(java.lang.String)
accessible: module java.base does not "opens java.lang" to unnamed module @624fab
	at java.base/java.lang.reflect.AccessibleObject.checkCanSetAccessible(AccessibleObject.java:335)
	at java.base/java.lang.reflect.AccessibleObject.checkCanSetAccessible(AccessibleObject.java:278)
	at java.base/java.lang.reflect.Method.checkCanSetAccessible(Method.java:196)
	at java.base/java.lang.reflect.Method.setAccessible(Method.java:190)
	at hudson.remoting.RemoteClassLoader.<clinit>(RemoteClassLoader.java:338)
	at hudson.remoting.ImportedClassLoaderTable.get(ImportedClassLoaderTable.java:69)
	at hudson.remoting.UserRequest.perform(UserRequest.java:122)
	at hudson.remoting.UserRequest.perform(UserRequest.java:52)
	at hudson.remoting.Request$2.run(Request.java:336)
	at hudson.remoting.InterceptingExecutorService$1.call(InterceptingExecutorService.java:68)
	at java.base/java.util.concurrent.FutureTask.run(FutureTask.java:264)
	at java.base/java.util.concurrent.ThreadPoolExecutor.runWorker(ThreadPoolExecutor.java:1161)
	at java.base/java.util.concurrent.ThreadPoolExecutor$Worker.run(ThreadPoolExecutor.java:635)
	at java.base/java.lang.Thread.run(Thread.java:844)

using settings config with name simple-deploy-settings-no-mirror
Replacing all maven server entries not found in credentials list is true
Executing Maven:  -B -f <https://builds.apache.org/job/UIMA-uimaFIT_java9/ws/trunk/pom.xml>
-Dmaven.repo.local=/home/jenkins/jenkins-slave/maven-repositories/1 -s /tmp/settings1089539752675802369.xml
-U -Djava.awt.headless=true -Ppmd clean install dependency:analyze javadoc:aggregate
[INFO] Scanning for projects...
[INFO] ------------------------------------------------------------------------
[INFO] Reactor Build Order:
[INFO] 
[INFO] Apache UIMA uimaFIT - Parent
[INFO] Apache UIMA uimaFIT - Core
[INFO] Apache UIMA uimaFIT - Examples
[INFO] Apache UIMA uimaFIT - Spring integration
[INFO] Apache UIMA uimaFIT - Maven Plugin
[INFO] Apache UIMA uimaFIT - Legacy uimaFIT support
[INFO] Apache UIMA uimaFIT - Documentation
[INFO] Apache UIMA uimaFIT - Collection Processing Engine support
[INFO] Apache UIMA uimaFIT
[INFO] 
[INFO] ------------------------------------------------------------------------
[INFO] Building Apache UIMA uimaFIT - Parent 2.3.1-SNAPSHOT
[INFO] ------------------------------------------------------------------------
[INFO] 
[INFO] --- maven-clean-plugin:2.5:clean (default-clean) @ uimafit-parent ---
[TASKS] Scanning folder '<https://builds.apache.org/job/UIMA-uimaFIT_java9/ws/trunk/uimafit-parent'>
for files matching the pattern '**/*.java' - excludes: 
[TASKS] Found 0 files to scan for tasks
Found 0 open tasks.
java.io.EOFException
	at java.io.DataInputStream.readInt(DataInputStream.java:392)
	at java.io.ObjectInputStream$BlockDataInputStream.readInt(ObjectInputStream.java:3176)
	at java.io.ObjectInputStream.readInt(ObjectInputStream.java:1029)
	at com.google.common.collect.Serialization.readCount(Serialization.java:50)
	at com.google.common.collect.HashMultimap.readObject(HashMultimap.java:134)
	at sun.reflect.GeneratedMethodAccessor11283.invoke(Unknown Source)
	at sun.reflect.DelegatingMethodAccessorImpl.invoke(DelegatingMethodAccessorImpl.java:43)
	at java.lang.reflect.Method.invoke(Method.java:498)
	at java.io.ObjectStreamClass.invokeReadObject(ObjectStreamClass.java:1158)
	at java.io.ObjectInputStream.readSerialData(ObjectInputStream.java:2173)
	at java.io.ObjectInputStream.readOrdinaryObject(ObjectInputStream.java:2064)
	at java.io.ObjectInputStream.readObject0(ObjectInputStream.java:1568)
	at java.io.ObjectInputStream.defaultReadFields(ObjectInputStream.java:2282)
	at java.io.ObjectInputStream.readSerialData(ObjectInputStream.java:2206)
	at java.io.ObjectInputStream.readOrdinaryObject(ObjectInputStream.java:2064)
	at java.io.ObjectInputStream.readObject0(ObjectInputStream.java:1568)
	at java.io.ObjectInputStream.defaultReadFields(ObjectInputStream.java:2282)
	at java.io.ObjectInputStream.readSerialData(ObjectInputStream.java:2206)
	at java.io.ObjectInputStream.readOrdinaryObject(ObjectInputStream.java:2064)
	at java.io.ObjectInputStream.readObject0(ObjectInputStream.java:1568)
	at java.io.ObjectInputStream.readArray(ObjectInputStream.java:1970)
	at java.io.ObjectInputStream.readObject0(ObjectInputStream.java:1562)
	at java.io.ObjectInputStream.defaultReadFields(ObjectInputStream.java:2282)
	at java.io.ObjectInputStream.readSerialData(ObjectInputStream.java:2206)
	at java.io.ObjectInputStream.readOrdinaryObject(ObjectInputStream.java:2064)
	at java.io.ObjectInputStream.readObject0(ObjectInputStream.java:1568)
	at java.io.ObjectInputStream.readObject(ObjectInputStream.java:428)
	at hudson.remoting.UserRequest.deserialize(UserRequest.java:245)
	at hudson.remoting.UserRequest.perform(UserRequest.java:159)
	at hudson.remoting.UserRequest.perform(UserRequest.java:52)
	at hudson.remoting.Request$2.run(Request.java:336)
	at hudson.remoting.InterceptingExecutorService$1.call(InterceptingExecutorService.java:68)
	at org.jenkinsci.remoting.CallableDecorator.call(CallableDecorator.java:19)
	at hudson.remoting.CallableDecoratorList$1.call(CallableDecoratorList.java:21)
	at jenkins.util.ContextResettingExecutorService$2.call(ContextResettingExecutorService.java:46)
	at java.util.concurrent.FutureTask.run(FutureTask.java:266)
	at java.util.concurrent.ThreadPoolExecutor.runWorker(ThreadPoolExecutor.java:1149)
	at java.util.concurrent.ThreadPoolExecutor$Worker.run(ThreadPoolExecutor.java:624)
	at java.lang.Thread.run(Thread.java:748)
	at ......remote call to channel(Native Method)
	at hudson.remoting.Channel.attachCallSiteStackTrace(Channel.java:1554)
	at hudson.remoting.UserResponse.retrieve(UserRequest.java:281)
	at hudson.remoting.Channel.call(Channel.java:839)
	at hudson.remoting.RemoteInvocationHandler.invoke(RemoteInvocationHandler.java:257)
	at com.sun.proxy.$Proxy5.execute(Unknown Source)
	at hudson.maven.MavenBuildProxy$Filter.execute(MavenBuildProxy.java:207)
	at hudson.plugins.analysis.core.HealthAwareReporter.registerResultsOnMaster(HealthAwareReporter.java:364)
	at hudson.plugins.analysis.core.HealthAwareReporter.postExecute(HealthAwareReporter.java:355)
	at hudson.maven.Maven3Builder$MavenExecutionListener.recordMojoEnded(Maven3Builder.java:629)
	at hudson.maven.Maven3Builder$MavenExecutionListener.mojoSucceeded(Maven3Builder.java:610)
	at hudson.maven.Maven3Builder$JenkinsEventSpy.onEvent(Maven3Builder.java:303)
	at org.apache.maven.eventspy.internal.EventSpyDispatcher.onEvent(EventSpyDispatcher.java:104)
	at org.apache.maven.eventspy.internal.EventSpyExecutionListener.mojoSucceeded(EventSpyExecutionListener.java:131)
	at org.apache.maven.lifecycle.internal.DefaultExecutionEventCatapult.fire(DefaultExecutionEventCatapult.java:87)
	at org.apache.maven.lifecycle.internal.DefaultExecutionEventCatapult.fire(DefaultExecutionEventCatapult.java:42)
	at org.apache.maven.lifecycle.internal.MojoExecutor.execute(MojoExecutor.java:216)
	at org.apache.maven.lifecycle.internal.MojoExecutor.execute(MojoExecutor.java:154)
	at org.apache.maven.lifecycle.internal.MojoExecutor.execute(MojoExecutor.java:146)
	at org.apache.maven.lifecycle.internal.LifecycleModuleBuilder.buildProject(LifecycleModuleBuilder.java:117)
	at org.apache.maven.lifecycle.internal.LifecycleModuleBuilder.buildProject(LifecycleModuleBuilder.java:81)
	at org.apache.maven.lifecycle.internal.builder.singlethreaded.SingleThreadedBuilder.build(SingleThreadedBuilder.java:51)
	at org.apache.maven.lifecycle.internal.LifecycleStarter.execute(LifecycleStarter.java:128)
	at org.apache.maven.DefaultMaven.doExecute(DefaultMaven.java:309)
	at org.apache.maven.DefaultMaven.doExecute(DefaultMaven.java:194)
	at org.apache.maven.DefaultMaven.execute(DefaultMaven.java:107)
	at org.jvnet.hudson.maven3.launcher.Maven35Launcher.main(Maven35Launcher.java:130)
	at java.base/jdk.internal.reflect.NativeMethodAccessorImpl.invoke0(Native Method)
	at java.base/jdk.internal.reflect.NativeMethodAccessorImpl.invoke(NativeMethodAccessorImpl.java:62)
	at java.base/jdk.internal.reflect.DelegatingMethodAccessorImpl.invoke(DelegatingMethodAccessorImpl.java:43)
	at java.base/java.lang.reflect.Method.invoke(Method.java:547)
	at org.codehaus.plexus.classworlds.launcher.Launcher.launchEnhanced(Launcher.java:289)
	at org.codehaus.plexus.classworlds.launcher.Launcher.launch(Launcher.java:229)
	at jenkins.maven3.agent.Maven35Main.launch(Maven35Main.java:176)
	at java.base/jdk.internal.reflect.NativeMethodAccessorImpl.invoke0(Native Method)
	at java.base/jdk.internal.reflect.NativeMethodAccessorImpl.invoke(NativeMethodAccessorImpl.java:62)
	at java.base/jdk.internal.reflect.DelegatingMethodAccessorImpl.invoke(DelegatingMethodAccessorImpl.java:43)
	at java.base/java.lang.reflect.Method.invoke(Method.java:547)
	at hudson.maven.Maven3Builder.call(Maven3Builder.java:139)
	at hudson.maven.Maven3Builder.call(Maven3Builder.java:70)
	at hudson.remoting.UserRequest.perform(UserRequest.java:181)
	at hudson.remoting.UserRequest.perform(UserRequest.java:52)
	at hudson.remoting.Request$2.run(Request.java:336)
	at hudson.remoting.InterceptingExecutorService$1.call(InterceptingExecutorService.java:68)
	at java.base/java.util.concurrent.FutureTask.run(FutureTask.java:264)
	at java.base/java.util.concurrent.ThreadPoolExecutor.runWorker(ThreadPoolExecutor.java:1161)
	at java.base/java.util.concurrent.ThreadPoolExecutor$Worker.run(ThreadPoolExecutor.java:635)
	at java.base/java.lang.Thread.run(Thread.java:844)
[INFO] 
[INFO] --- maven-enforcer-plugin:1.3.1:enforce (enforce-versions) @ uimafit-parent ---
[TASKS] Skipping reporter since build result is FAILURE[INFO] 
[INFO] --- build-helper-maven-plugin:1.8:parse-version (parse-project-version) @ uimafit-parent
---

[INFO] 
[INFO] --- uima-build-helper-maven-plugin:7:parse-date-time (set buildYear and buildMonth)
@ uimafit-parent ---
[TASKS] Skipping reporter since build result is FAILURE
[TASKS] Skipping reporter since build result is FAILURE[INFO] 
[INFO] --- gmaven-plugin:1.5:execute (read-notice) @ uimafit-parent ---

[TASKS] Skipping reporter since build result is FAILURE
[INFO] 
[INFO] ------------------------------------------------------------------------
[INFO] Skipping Apache UIMA uimaFIT
[INFO] This project has been banned from the build due to previous failures.
[INFO] ------------------------------------------------------------------------
[INFO] ------------------------------------------------------------------------
[INFO] Reactor Summary:
[INFO] 
[INFO] Apache UIMA uimaFIT - Parent ....................... FAILURE [  5.764 s]
[INFO] Apache UIMA uimaFIT - Core ......................... SKIPPED
[INFO] Apache UIMA uimaFIT - Examples ..................... SKIPPED
[INFO] Apache UIMA uimaFIT - Spring integration ........... SKIPPED
[INFO] Apache UIMA uimaFIT - Maven Plugin ................. SKIPPED
[INFO] Apache UIMA uimaFIT - Legacy uimaFIT support ....... SKIPPED
[INFO] Apache UIMA uimaFIT - Documentation ................ SKIPPED
[INFO] Apache UIMA uimaFIT - Collection Processing Engine support SKIPPED
[INFO] Apache UIMA uimaFIT ................................ SKIPPED
[INFO] ------------------------------------------------------------------------
[INFO] BUILD FAILURE
[INFO] ------------------------------------------------------------------------
[INFO] Total time: 9.199 s
[INFO] Finished at: 2017-11-09T22:39:10Z
[INFO] Final Memory: 26M/87M
[INFO] ------------------------------------------------------------------------
Waiting for Jenkins to finish collecting data[ERROR] Failed to execute goal org.codehaus.gmaven:gmaven-plugin:1.5:execute
(read-notice) on project uimafit-parent: Execution read-notice of goal org.codehaus.gmaven:gmaven-plugin:1.5:execute
failed: An API incompatibility was encountered while executing org.codehaus.gmaven:gmaven-plugin:1.5:execute:
java.lang.ExceptionInInitializerError: null
[ERROR] -----------------------------------------------------
[ERROR] realm =    plugin>org.codehaus.gmaven:gmaven-plugin:1.5
[ERROR] strategy = org.codehaus.plexus.classworlds.strategy.SelfFirstStrategy
[ERROR] urls[0] = file:/home/jenkins/jenkins-slave/maven-repositories/1/org/codehaus/gmaven/gmaven-plugin/1.5/gmaven-plugin-1.5.jar
[ERROR] urls[1] = file:/home/jenkins/jenkins-slave/maven-repositories/1/org/codehaus/gmaven/runtime/gmaven-runtime-api/1.5/gmaven-runtime-api-1.5.jar
[ERROR] urls[2] = file:/home/jenkins/jenkins-slave/maven-repositories/1/org/codehaus/gmaven/feature/gmaven-feature-api/1.5/gmaven-feature-api-1.5.jar
[ERROR] urls[3] = file:/home/jenkins/jenkins-slave/maven-repositories/1/org/codehaus/gmaven/runtime/gmaven-runtime-loader/1.5/gmaven-runtime-loader-1.5.jar
[ERROR] urls[4] = file:/home/jenkins/jenkins-slave/maven-repositories/1/org/codehaus/gmaven/feature/gmaven-feature-support/1.5/gmaven-feature-support-1.5.jar
[ERROR] urls[5] = file:/home/jenkins/jenkins-slave/maven-repositories/1/org/codehaus/gmaven/runtime/gmaven-runtime-support/1.5/gmaven-runtime-support-1.5.jar
[ERROR] urls[6] = file:/home/jenkins/jenkins-slave/maven-repositories/1/org/sonatype/gshell/gshell-io/2.4/gshell-io-2.4.jar
[ERROR] urls[7] = file:/home/jenkins/jenkins-slave/maven-repositories/1/org/codehaus/plexus/plexus-utils/3.0/plexus-utils-3.0.jar
[ERROR] urls[8] = file:/home/jenkins/jenkins-slave/maven-repositories/1/com/thoughtworks/qdox/qdox/1.12/qdox-1.12.jar
[ERROR] urls[9] = file:/home/jenkins/jenkins-slave/maven-repositories/1/org/apache/maven/shared/file-management/1.2.1/file-management-1.2.1.jar
[ERROR] urls[10] = file:/home/jenkins/jenkins-slave/maven-repositories/1/org/apache/maven/shared/maven-shared-io/1.1/maven-shared-io-1.1.jar
[ERROR] urls[11] = file:/home/jenkins/jenkins-slave/maven-repositories/1/org/apache/xbean/xbean-reflect/3.4/xbean-reflect-3.4.jar
[ERROR] urls[12] = file:/home/jenkins/jenkins-slave/maven-repositories/1/log4j/log4j/1.2.12/log4j-1.2.12.jar
[ERROR] urls[13] = file:/home/jenkins/jenkins-slave/maven-repositories/1/commons-logging/commons-logging-api/1.1/commons-logging-api-1.1.jar
[ERROR] urls[14] = file:/home/jenkins/jenkins-slave/maven-repositories/1/com/google/collections/google-collections/1.0/google-collections-1.0.jar
[ERROR] urls[15] = file:/home/jenkins/jenkins-slave/maven-repositories/1/org/apache/maven/reporting/maven-reporting-impl/2.0.4.1/maven-reporting-impl-2.0.4.1.jar
[ERROR] urls[16] = file:/home/jenkins/jenkins-slave/maven-repositories/1/org/codehaus/plexus/plexus-interpolation/1.1/plexus-interpolation-1.1.jar
[ERROR] urls[17] = file:/home/jenkins/jenkins-slave/maven-repositories/1/commons-validator/commons-validator/1.2.0/commons-validator-1.2.0.jar
[ERROR] urls[18] = file:/home/jenkins/jenkins-slave/maven-repositories/1/commons-beanutils/commons-beanutils/1.7.0/commons-beanutils-1.7.0.jar
[ERROR] urls[19] = file:/home/jenkins/jenkins-slave/maven-repositories/1/commons-digester/commons-digester/1.6/commons-digester-1.6.jar
[ERROR] urls[20] = file:/home/jenkins/jenkins-slave/maven-repositories/1/commons-logging/commons-logging/1.0.4/commons-logging-1.0.4.jar
[ERROR] urls[21] = file:/home/jenkins/jenkins-slave/maven-repositories/1/oro/oro/2.0.8/oro-2.0.8.jar
[ERROR] urls[22] = file:/home/jenkins/jenkins-slave/maven-repositories/1/xml-apis/xml-apis/1.0.b2/xml-apis-1.0.b2.jar
[ERROR] urls[23] = file:/home/jenkins/jenkins-slave/maven-repositories/1/org/apache/maven/doxia/doxia-core/1.0-alpha-10/doxia-core-1.0-alpha-10.jar
[ERROR] urls[24] = file:/home/jenkins/jenkins-slave/maven-repositories/1/org/apache/maven/doxia/doxia-sink-api/1.0-alpha-10/doxia-sink-api-1.0-alpha-10.jar
[ERROR] urls[25] = file:/home/jenkins/jenkins-slave/maven-repositories/1/org/apache/maven/reporting/maven-reporting-api/2.0.4/maven-reporting-api-2.0.4.jar
[ERROR] urls[26] = file:/home/jenkins/jenkins-slave/maven-repositories/1/org/apache/maven/doxia/doxia-site-renderer/1.0-alpha-10/doxia-site-renderer-1.0-alpha-10.jar
[ERROR] urls[27] = file:/home/jenkins/jenkins-slave/maven-repositories/1/org/codehaus/plexus/plexus-i18n/1.0-beta-7/plexus-i18n-1.0-beta-7.jar
[ERROR] urls[28] = file:/home/jenkins/jenkins-slave/maven-repositories/1/org/codehaus/plexus/plexus-velocity/1.1.7/plexus-velocity-1.1.7.jar
[ERROR] urls[29] = file:/home/jenkins/jenkins-slave/maven-repositories/1/org/apache/velocity/velocity/1.5/velocity-1.5.jar
[ERROR] urls[30] = file:/home/jenkins/jenkins-slave/maven-repositories/1/org/apache/maven/doxia/doxia-decoration-model/1.0-alpha-10/doxia-decoration-model-1.0-alpha-10.jar
[ERROR] urls[31] = file:/home/jenkins/jenkins-slave/maven-repositories/1/commons-collections/commons-collections/3.2/commons-collections-3.2.jar
[ERROR] urls[32] = file:/home/jenkins/jenkins-slave/maven-repositories/1/org/apache/maven/doxia/doxia-module-apt/1.0-alpha-10/doxia-module-apt-1.0-alpha-10.jar
[ERROR] urls[33] = file:/home/jenkins/jenkins-slave/maven-repositories/1/org/apache/maven/doxia/doxia-module-fml/1.0-alpha-10/doxia-module-fml-1.0-alpha-10.jar
[ERROR] urls[34] = file:/home/jenkins/jenkins-slave/maven-repositories/1/org/apache/maven/doxia/doxia-module-xdoc/1.0-alpha-10/doxia-module-xdoc-1.0-alpha-10.jar
[ERROR] urls[35] = file:/home/jenkins/jenkins-slave/maven-repositories/1/org/apache/maven/doxia/doxia-module-xhtml/1.0-alpha-10/doxia-module-xhtml-1.0-alpha-10.jar
[ERROR] urls[36] = file:/home/jenkins/jenkins-slave/maven-repositories/1/commons-lang/commons-lang/2.6/commons-lang-2.6.jar
[ERROR] urls[37] = file:/home/jenkins/jenkins-slave/maven-repositories/1/org/sonatype/gossip/gossip/1.2/gossip-1.2.jar
[ERROR] Number of foreign imports: 1
[ERROR] import: Entry[import  from realm ClassRealm[maven.api, parent: null]]
[ERROR] 
[ERROR] -----------------------------------------------------: Unable to make protected void
java.lang.Object.finalize() throws java.lang.Throwable accessible: module java.base does not
"opens java.lang" to unnamed module @4d829243
[ERROR] -> [Help 1]
[ERROR] 
[ERROR] To see the full stack trace of the errors, re-run Maven with the -e switch.
[ERROR] Re-run Maven using the -X switch to enable full debug logging.
[ERROR] 
[ERROR] For more information about the errors and possible solutions, please read the following
articles:
[ERROR] [Help 1] http://cwiki.apache.org/confluence/display/MAVEN/PluginContainerException

[JENKINS] Archiving <https://builds.apache.org/job/UIMA-uimaFIT_java9/ws/trunk/uimafit-core/pom.xml>
to org.apache.uima/uimafit-core/2.3.1-SNAPSHOT/uimafit-core-2.3.1-SNAPSHOT.pom
[Fast Archiver] No prior successful build to compare, so performing full copy of artifacts
[JENKINS] Archiving <https://builds.apache.org/job/UIMA-uimaFIT_java9/ws/trunk/uimafit-docbook/pom.xml>
to org.apache.uima/uimafit-docbook/2.3.1-SNAPSHOT/uimafit-docbook-2.3.1-SNAPSHOT.pom
[Fast Archiver] No prior successful build to compare, so performing full copy of artifacts
[JENKINS] Archiving <https://builds.apache.org/job/UIMA-uimaFIT_java9/ws/trunk/pom.xml>
to org.apache.uima/uimafit/2.3.1-SNAPSHOT/uimafit-2.3.1-SNAPSHOT.pom
[Fast Archiver] No prior successful build to compare, so performing full copy of artifacts
[JENKINS] Archiving <https://builds.apache.org/job/UIMA-uimaFIT_java9/ws/trunk/uimafit-cpe/pom.xml>
to org.apache.uima/uimafit-cpe/2.3.1-SNAPSHOT/uimafit-cpe-2.3.1-SNAPSHOT.pom
[Fast Archiver] No prior successful build to compare, so performing full copy of artifacts
[JENKINS] Archiving <https://builds.apache.org/job/UIMA-uimaFIT_java9/ws/trunk/uimafit-maven-plugin/pom.xml>
to org.apache.uima/uimafit-maven-plugin/2.3.1-SNAPSHOT/uimafit-maven-plugin-2.3.1-SNAPSHOT.pom
[Fast Archiver] No prior successful build to compare, so performing full copy of artifacts
[JENKINS] Archiving <https://builds.apache.org/job/UIMA-uimaFIT_java9/ws/trunk/uimafit-legacy-support/pom.xml>
to org.apache.uima/uimafit-legacy-support/2.3.1-SNAPSHOT/uimafit-legacy-support-2.3.1-SNAPSHOT.pom
[Fast Archiver] No prior successful build to compare, so performing full copy of artifacts
[JENKINS] Archiving <https://builds.apache.org/job/UIMA-uimaFIT_java9/ws/trunk/uimafit-parent/pom.xml>
to org.apache.uima/uimafit-parent/2.3.1-SNAPSHOT/uimafit-parent-2.3.1-SNAPSHOT.pom
[Fast Archiver] No prior successful build to compare, so performing full copy of artifacts
[JENKINS] Archiving <https://builds.apache.org/job/UIMA-uimaFIT_java9/ws/trunk/uimafit-examples/pom.xml>
to org.apache.uima/uimafit-examples/2.3.1-SNAPSHOT/uimafit-examples-2.3.1-SNAPSHOT.pom
[Fast Archiver] No prior successful build to compare, so performing full copy of artifacts
[JENKINS] Archiving <https://builds.apache.org/job/UIMA-uimaFIT_java9/ws/trunk/uimafit-spring/pom.xml>
to org.apache.uima/uimafit-spring/2.3.1-SNAPSHOT/uimafit-spring-2.3.1-SNAPSHOT.pom
[Fast Archiver] No prior successful build to compare, so performing full copy of artifacts
Sending e-mails to: dev@uima.apache.org
channel stopped
[WARNINGS] Skipping publisher since build result is FAILURE
[Cobertura] Publishing Cobertura coverage report...

Mime
View raw message