uima-dev mailing list archives

Site index · List index
Message view « Date » · « Thread »
Top « Date » · « Thread »
From Apache Jenkins Server <jenk...@builds.apache.org>
Subject Build failed in Jenkins: UIMA-AS » Apache UIMA-AS: uima-as-docbooks #548
Date Mon, 08 Jan 2018 18:58:45 GMT
See <https://builds.apache.org/job/UIMA-AS/org.apache.uima$uima-as-docbooks/548/display/redirect>

------------------------------------------
[INFO]                                                                         
[INFO] ------------------------------------------------------------------------
[INFO] Building Apache UIMA-AS: uima-as-docbooks 2.10.3-SNAPSHOT
[INFO] ------------------------------------------------------------------------
[INFO] Downloading: https://repo.maven.apache.org/maven2/com/agilejava/docbkx/docbkx-maven-plugin/2.0.14/docbkx-maven-plugin-2.0.14.pom
[INFO] Downloaded: https://repo.maven.apache.org/maven2/com/agilejava/docbkx/docbkx-maven-plugin/2.0.14/docbkx-maven-plugin-2.0.14.pom
(9 KB at 798.0 KB/sec)
[INFO] Downloading: https://repo.maven.apache.org/maven2/com/agilejava/docbkx/docbkx/2.0.14/docbkx-2.0.14.pom
[INFO] Downloaded: https://repo.maven.apache.org/maven2/com/agilejava/docbkx/docbkx/2.0.14/docbkx-2.0.14.pom
(6 KB at 54.7 KB/sec)
[INFO] Downloading: https://repo.maven.apache.org/maven2/com/agilejava/docbkx/docbkx-maven-plugin/2.0.14/docbkx-maven-plugin-2.0.14.jar
[INFO] Downloaded: https://repo.maven.apache.org/maven2/com/agilejava/docbkx/docbkx-maven-plugin/2.0.14/docbkx-maven-plugin-2.0.14.jar
(268 KB at 2268.0 KB/sec)
[WARNING] The POM for org.eclipse.m2e:lifecycle-mapping:jar:1.0.0 is missing, no dependency
information available
[WARNING] Failed to retrieve plugin descriptor for org.eclipse.m2e:lifecycle-mapping:1.0.0:
Plugin org.eclipse.m2e:lifecycle-mapping:1.0.0 or one of its dependencies could not be resolved:
Failure to find org.eclipse.m2e:lifecycle-mapping:jar:1.0.0 in https://repo.maven.apache.org/maven2
was cached in the local repository, resolution will not be reattempted until the update interval
of central has elapsed or updates are forced
[WARNING] The POM for org.eclipse.m2e:lifecycle-mapping:jar:1.0.0 is missing, no dependency
information available
[WARNING] Failed to retrieve plugin descriptor for org.eclipse.m2e:lifecycle-mapping:1.0.0:
Plugin org.eclipse.m2e:lifecycle-mapping:1.0.0 or one of its dependencies could not be resolved:
Failure to find org.eclipse.m2e:lifecycle-mapping:jar:1.0.0 in https://repo.maven.apache.org/maven2
was cached in the local repository, resolution will not be reattempted until the update interval
of central has elapsed or updates are forced
[WARNING] The POM for org.eclipse.m2e:lifecycle-mapping:jar:1.0.0 is missing, no dependency
information available
[WARNING] Failed to retrieve plugin descriptor for org.eclipse.m2e:lifecycle-mapping:1.0.0:
Plugin org.eclipse.m2e:lifecycle-mapping:1.0.0 or one of its dependencies could not be resolved:
Failure to find org.eclipse.m2e:lifecycle-mapping:jar:1.0.0 in https://repo.maven.apache.org/maven2
was cached in the local repository, resolution will not be reattempted until the update interval
of central has elapsed or updates are forced
[WARNING] The POM for org.eclipse.m2e:lifecycle-mapping:jar:1.0.0 is missing, no dependency
information available
[WARNING] Failed to retrieve plugin descriptor for org.eclipse.m2e:lifecycle-mapping:1.0.0:
Plugin org.eclipse.m2e:lifecycle-mapping:1.0.0 or one of its dependencies could not be resolved:
Failure to find org.eclipse.m2e:lifecycle-mapping:jar:1.0.0 in https://repo.maven.apache.org/maven2
was cached in the local repository, resolution will not be reattempted until the update interval
of central has elapsed or updates are forced
[INFO] 
[INFO] --- maven-clean-plugin:3.0.0:clean (default-clean) @ uima-as-docbooks ---
[TASKS] Scanning folder '<https://builds.apache.org/job/UIMA-AS/org.apache.uima$uima-as-docbooks/ws/'>
for files matching the pattern '**/*.java' - excludes: 
[TASKS] Found 0 files to scan for tasks
Found 0 open tasks.
[TASKS] Computing warning deltas based on reference build #547
[INFO] 
[INFO] --- maven-enforcer-plugin:3.0.0-M1:enforce (enforce-versions) @ uima-as-docbooks ---
[INFO] 
[INFO] --- build-helper-maven-plugin:3.0.0:parse-version (parse-project-version) @ uima-as-docbooks
---
[INFO] 
[INFO] --- uima-build-helper-maven-plugin:7:parse-date-time (set buildYear and buildMonth)
@ uima-as-docbooks ---
[INFO] 
[INFO] --- maven-remote-resources-plugin:1.5:process (process-resource-bundles) @ uima-as-docbooks
---
[INFO] 
[INFO] --- maven-remote-resources-plugin:1.5:process (default) @ uima-as-docbooks ---
[INFO] 
[INFO] --- maven-antrun-plugin:1.8:run (dup-meta-jar-cleanup) @ uima-as-docbooks ---
[INFO] Executing tasks

main:
[INFO] Executed tasks
[INFO] 
[INFO] --- maven-dependency-plugin:3.0.2:unpack (copyDocbookInfo) @ uima-as-docbooks ---
[INFO] Configured Artifact: org.apache.uima:uima-build-resources:5:jar
[INFO] Downloading: http://repo1.maven.org/eclipse/org/apache/uima/uima-build-resources/5/uima-build-resources-5.pom
[INFO] Downloading: http://repo1.maven.org/maven2/org/apache/uima/uima-build-resources/5/uima-build-resources-5.pom
[INFO] Downloaded: http://repo1.maven.org/maven2/org/apache/uima/uima-build-resources/5/uima-build-resources-5.pom
(4 KB at 36.4 KB/sec)
[INFO] Downloading: http://repo1.maven.org/eclipse/org/apache/uima/parent-pom/5/parent-pom-5.pom
[INFO] Downloading: http://repo1.maven.org/maven2/org/apache/uima/parent-pom/5/parent-pom-5.pom
[INFO] Downloaded: http://repo1.maven.org/maven2/org/apache/uima/parent-pom/5/parent-pom-5.pom
(97 KB at 438.8 KB/sec)
[INFO] Unpacking /home/jenkins/.m2/repository/org/apache/uima/uima-build-resources/5/uima-build-resources-5.jar
to <https://builds.apache.org/job/UIMA-AS/org.apache.uima$uima-as-docbooks/ws/target>
with includes "docbook-shared/**" and excludes ""
[INFO] 
[INFO] --- maven-dependency-plugin:3.0.2:unpack (copyDocbookInfoNextToOlink) @ uima-as-docbooks
---
[INFO] Configured Artifact: org.apache.uima:uima-build-resources:5:jar
[INFO] Unpacking /home/jenkins/.m2/repository/org/apache/uima/uima-build-resources/5/uima-build-resources-5.jar
to /home/jenkins/.m2/repository/org/apache/uima/uima-docbook-olink/1-SNAPSHOT with includes
"docbook-shared/**" and excludes ""
[INFO] 
[INFO] --- maven-dependency-plugin:3.0.2:unpack (getOlink) @ uima-as-docbooks ---
[INFO] Configured Artifact: org.apache.uima:uima-docbook-olink:olink:1-SNAPSHOT:zip
[INFO] Downloading: http://repository.apache.org/snapshots/org/apache/uima/uima-docbook-olink/1-SNAPSHOT/maven-metadata.xml
[INFO] Downloaded: http://repository.apache.org/snapshots/org/apache/uima/uima-docbook-olink/1-SNAPSHOT/maven-metadata.xml
(810 B at 2.1 KB/sec)
[INFO] Downloading: http://repository.apache.org/snapshots/org/apache/uima/uima-docbook-olink/1-SNAPSHOT/uima-docbook-olink-1-20171204.192628-8.pom
[INFO] Downloaded: http://repository.apache.org/snapshots/org/apache/uima/uima-docbook-olink/1-SNAPSHOT/uima-docbook-olink-1-20171204.192628-8.pom
(10 KB at 23.6 KB/sec)
[INFO] Downloading: http://repository.apache.org/snapshots/org/apache/uima/uima-docbook-olink/1-SNAPSHOT/uima-docbook-olink-1-20171204.192628-8-olink.zip
[INFO] Downloaded: http://repository.apache.org/snapshots/org/apache/uima/uima-docbook-olink/1-SNAPSHOT/uima-docbook-olink-1-20171204.192628-8-olink.zip
(147 KB at 226.7 KB/sec)
[INFO] Unpacking /home/jenkins/.m2/repository/org/apache/uima/uima-docbook-olink/1-SNAPSHOT/uima-docbook-olink-1-SNAPSHOT-olink.zip
to /home/jenkins/.m2/repository/org/apache/uima/uima-docbook-olink/1-SNAPSHOT/docbook-olink
with includes "" and excludes ""
[INFO] 
[INFO] --- maven-site-plugin:3.5.1:attach-descriptor (attach-descriptor) @ uima-as-docbooks
---
[INFO] 
[INFO] --- docbkx-maven-plugin:2.0.14:generate-html (html) @ uima-as-docbooks ---
[INFO] Downloading: https://repo.maven.apache.org/maven2/org/docbook/docbook-xml/4.4/docbook-xml-4.4.pom
[INFO] Downloaded: https://repo.maven.apache.org/maven2/org/docbook/docbook-xml/4.4/docbook-xml-4.4.pom
(268 B at 32.7 KB/sec)
[INFO] Downloading: https://repo.maven.apache.org/maven2/antlr/stringtemplate/2.2/stringtemplate-2.2.pom
[INFO] Downloaded: https://repo.maven.apache.org/maven2/antlr/stringtemplate/2.2/stringtemplate-2.2.pom
(350 B at 38.0 KB/sec)
[INFO] Downloading: https://repo.maven.apache.org/maven2/org/apache/xmlgraphics/fop/1.0/fop-1.0.pom
[INFO] Downloaded: https://repo.maven.apache.org/maven2/org/apache/xmlgraphics/fop/1.0/fop-1.0.pom
(6 KB at 63.9 KB/sec)
[INFO] Downloading: https://repo.maven.apache.org/maven2/org/apache/xmlgraphics/xmlgraphics-commons/1.4/xmlgraphics-commons-1.4.pom
[INFO] Downloaded: https://repo.maven.apache.org/maven2/org/apache/xmlgraphics/xmlgraphics-commons/1.4/xmlgraphics-commons-1.4.pom
(4 KB at 364.8 KB/sec)
[INFO] Downloading: https://repo.maven.apache.org/maven2/org/apache/xmlgraphics/batik-svg-dom/1.7/batik-svg-dom-1.7.pom
[INFO] Downloaded: https://repo.maven.apache.org/maven2/org/apache/xmlgraphics/batik-svg-dom/1.7/batik-svg-dom-1.7.pom
(5 KB at 45.8 KB/sec)
[INFO] Downloading: https://repo.maven.apache.org/maven2/org/apache/xmlgraphics/batik-anim/1.7/batik-anim-1.7.pom
[INFO] Downloaded: https://repo.maven.apache.org/maven2/org/apache/xmlgraphics/batik-anim/1.7/batik-anim-1.7.pom
(5 KB at 518.9 KB/sec)
[INFO] Downloading: https://repo.maven.apache.org/maven2/org/apache/xmlgraphics/batik-awt-util/1.7/batik-awt-util-1.7.pom
[INFO] Downloaded: https://repo.maven.apache.org/maven2/org/apache/xmlgraphics/batik-awt-util/1.7/batik-awt-util-1.7.pom
(4 KB at 389.3 KB/sec)
[INFO] Downloading: https://repo.maven.apache.org/maven2/org/apache/xmlgraphics/batik-dom/1.7/batik-dom-1.7.pom
[INFO] Downloaded: https://repo.maven.apache.org/maven2/org/apache/xmlgraphics/batik-dom/1.7/batik-dom-1.7.pom
(4 KB at 567.5 KB/sec)
[INFO] Downloading: https://repo.maven.apache.org/maven2/org/apache/xmlgraphics/batik-xml/1.7/batik-xml-1.7.pom
[INFO] Downloaded: https://repo.maven.apache.org/maven2/org/apache/xmlgraphics/batik-xml/1.7/batik-xml-1.7.pom
(4 KB at 33.9 KB/sec)
[INFO] Downloading: https://repo.maven.apache.org/maven2/org/apache/xmlgraphics/batik-parser/1.7/batik-parser-1.7.pom
[INFO] Downloaded: https://repo.maven.apache.org/maven2/org/apache/xmlgraphics/batik-parser/1.7/batik-parser-1.7.pom
(4 KB at 381.4 KB/sec)
[INFO] Downloading: https://repo.maven.apache.org/maven2/org/apache/xmlgraphics/batik-bridge/1.7/batik-bridge-1.7.pom
[INFO] Downloaded: https://repo.maven.apache.org/maven2/org/apache/xmlgraphics/batik-bridge/1.7/batik-bridge-1.7.pom
(6 KB at 54.1 KB/sec)
[INFO] Downloading: https://repo.maven.apache.org/maven2/org/apache/xmlgraphics/batik-gvt/1.7/batik-gvt-1.7.pom
[INFO] Downloaded: https://repo.maven.apache.org/maven2/org/apache/xmlgraphics/batik-gvt/1.7/batik-gvt-1.7.pom
(4 KB at 297.2 KB/sec)
[INFO] Downloading: https://repo.maven.apache.org/maven2/org/apache/xmlgraphics/batik-script/1.7/batik-script-1.7.pom
[INFO] Downloaded: https://repo.maven.apache.org/maven2/org/apache/xmlgraphics/batik-script/1.7/batik-script-1.7.pom
(5 KB at 401.6 KB/sec)
[INFO] Downloading: https://repo.maven.apache.org/maven2/org/apache/xmlgraphics/batik-js/1.7/batik-js-1.7.pom
[INFO] Downloaded: https://repo.maven.apache.org/maven2/org/apache/xmlgraphics/batik-js/1.7/batik-js-1.7.pom
(4 KB at 298.8 KB/sec)
[INFO] Downloading: https://repo.maven.apache.org/maven2/org/apache/xmlgraphics/batik-transcoder/1.7/batik-transcoder-1.7.pom
[INFO] Downloaded: https://repo.maven.apache.org/maven2/org/apache/xmlgraphics/batik-transcoder/1.7/batik-transcoder-1.7.pom
(6 KB at 59.1 KB/sec)
[INFO] Downloading: https://repo.maven.apache.org/maven2/org/apache/xmlgraphics/batik-svggen/1.7/batik-svggen-1.7.pom
[INFO] Downloaded: https://repo.maven.apache.org/maven2/org/apache/xmlgraphics/batik-svggen/1.7/batik-svggen-1.7.pom
(4 KB at 36.7 KB/sec)
[INFO] Downloading: https://repo.maven.apache.org/maven2/org/apache/xmlgraphics/batik-extension/1.7/batik-extension-1.7.pom
[INFO] Downloaded: https://repo.maven.apache.org/maven2/org/apache/xmlgraphics/batik-extension/1.7/batik-extension-1.7.pom
(5 KB at 512.0 KB/sec)
[INFO] Downloading: https://repo.maven.apache.org/maven2/org/apache/avalon/framework/avalon-framework-api/4.3.1/avalon-framework-api-4.3.1.pom
[INFO] Downloaded: https://repo.maven.apache.org/maven2/org/apache/avalon/framework/avalon-framework-api/4.3.1/avalon-framework-api-4.3.1.pom
(3 KB at 264.2 KB/sec)
[INFO] Downloading: https://repo.maven.apache.org/maven2/org/apache/avalon/avalon-framework/1/avalon-framework-1.pom
[INFO] Downloaded: https://repo.maven.apache.org/maven2/org/apache/avalon/avalon-framework/1/avalon-framework-1.pom
(2 KB at 230.5 KB/sec)
[INFO] Downloading: https://repo.maven.apache.org/maven2/org/apache/excalibur/excalibur/1/excalibur-1.pom
[INFO] Downloaded: https://repo.maven.apache.org/maven2/org/apache/excalibur/excalibur/1/excalibur-1.pom
(8 KB at 972.9 KB/sec)
[INFO] Downloading: https://repo.maven.apache.org/maven2/org/apache/avalon/framework/avalon-framework-impl/4.3.1/avalon-framework-impl-4.3.1.pom
[INFO] Downloaded: https://repo.maven.apache.org/maven2/org/apache/avalon/framework/avalon-framework-impl/4.3.1/avalon-framework-impl-4.3.1.pom
(3 KB at 30.1 KB/sec)
[INFO] Downloading: https://repo.maven.apache.org/maven2/xalan/xalan/2.7.0/xalan-2.7.0.pom
[INFO] Downloaded: https://repo.maven.apache.org/maven2/xalan/xalan/2.7.0/xalan-2.7.0.pom
(491 B at 59.9 KB/sec)
[INFO] Downloading: https://repo.maven.apache.org/maven2/com/agilejava/docbkx/docbkx-maven-base/2.0.14/docbkx-maven-base-2.0.14.pom
[INFO] Downloaded: https://repo.maven.apache.org/maven2/com/agilejava/docbkx/docbkx-maven-base/2.0.14/docbkx-maven-base-2.0.14.pom
(3 KB at 29.4 KB/sec)
[INFO] Downloading: https://repo.maven.apache.org/maven2/javax/servlet/jsp/jsp-api/2.0/jsp-api-2.0.pom
[INFO] Downloaded: https://repo.maven.apache.org/maven2/javax/servlet/jsp/jsp-api/2.0/jsp-api-2.0.pom
(157 B at 1.7 KB/sec)
[INFO] Downloading: https://repo.maven.apache.org/maven2/jaxen/jaxen/1.0-FCS/jaxen-1.0-FCS.pom
[INFO] Downloaded: https://repo.maven.apache.org/maven2/jaxen/jaxen/1.0-FCS/jaxen-1.0-FCS.pom
(146 B at 17.8 KB/sec)
[INFO] Downloading: https://repo.maven.apache.org/maven2/saxpath/saxpath/1.0-FCS/saxpath-1.0-FCS.pom
[INFO] Downloaded: https://repo.maven.apache.org/maven2/saxpath/saxpath/1.0-FCS/saxpath-1.0-FCS.pom
(150 B at 18.3 KB/sec)
[INFO] Downloading: https://repo.maven.apache.org/maven2/xom/xom/1.1/xom-1.1.pom
[INFO] Downloaded: https://repo.maven.apache.org/maven2/xom/xom/1.1/xom-1.1.pom (2 KB at 174.3
KB/sec)
[INFO] Downloading: https://repo.maven.apache.org/maven2/saxon/saxon/6.5.3/saxon-6.5.3.pom
[INFO] Downloaded: https://repo.maven.apache.org/maven2/saxon/saxon/6.5.3/saxon-6.5.3.pom
(144 B at 15.6 KB/sec)
[INFO] Downloading: https://repo.maven.apache.org/maven2/xml-resolver/xml-resolver/1.1/xml-resolver-1.1.pom
[WARNING] Failed to create parent directories for tracking file /home/jenkins/.m2/repository/xml-resolver/xml-resolver/1.1/xml-resolver-1.1.pom.lastUpdated
[INFO] Downloading: https://repo.maven.apache.org/maven2/plexus/plexus-utils/1.0.1/plexus-utils-1.0.1.pom
[INFO] Downloaded: https://repo.maven.apache.org/maven2/plexus/plexus-utils/1.0.1/plexus-utils-1.0.1.pom
(312 B at 38.1 KB/sec)
[INFO] Downloading: https://repo.maven.apache.org/maven2/plexus/plexus-root/1.0/plexus-root-1.0.pom
[INFO] Downloaded: https://repo.maven.apache.org/maven2/plexus/plexus-root/1.0/plexus-root-1.0.pom
(5 KB at 396.8 KB/sec)
[INFO] Downloading: https://repo.maven.apache.org/maven2/commons-io/commons-io/1.1/commons-io-1.1.pom
[INFO] Downloaded: https://repo.maven.apache.org/maven2/commons-io/commons-io/1.1/commons-io-1.1.pom
(6 KB at 666.6 KB/sec)
[INFO] Downloading: https://repo.maven.apache.org/maven2/org/codehaus/plexus/plexus-archiver/1.0-alpha-5/plexus-archiver-1.0-alpha-5.pom
[INFO] Downloaded: https://repo.maven.apache.org/maven2/org/codehaus/plexus/plexus-archiver/1.0-alpha-5/plexus-archiver-1.0-alpha-5.pom
(439 B at 42.9 KB/sec)
[INFO] Downloading: https://repo.maven.apache.org/maven2/org/apache/maven/plugins/maven-antrun-plugin/1.1/maven-antrun-plugin-1.1.pom
[INFO] Downloaded: https://repo.maven.apache.org/maven2/org/apache/maven/plugins/maven-antrun-plugin/1.1/maven-antrun-plugin-1.1.pom
(2 KB at 125.4 KB/sec)
[INFO] Downloading: https://repo.maven.apache.org/maven2/org/apache/maven/plugins/maven-plugin-parent/2.0.1/maven-plugin-parent-2.0.1.pom
[INFO] Downloaded: https://repo.maven.apache.org/maven2/org/apache/maven/plugins/maven-plugin-parent/2.0.1/maven-plugin-parent-2.0.1.pom
(8 KB at 603.9 KB/sec)
[INFO] Downloading: https://repo.maven.apache.org/maven2/ant/ant-launcher/1.6.5/ant-launcher-1.6.5.pom
[INFO] Downloaded: https://repo.maven.apache.org/maven2/ant/ant-launcher/1.6.5/ant-launcher-1.6.5.pom
(149 B at 8.1 KB/sec)
[INFO] Downloading: https://repo.maven.apache.org/maven2/net/sf/xslthl/xslthl/2.0.1/xslthl-2.0.1.pom
[INFO] Downloaded: https://repo.maven.apache.org/maven2/net/sf/xslthl/xslthl/2.0.1/xslthl-2.0.1.pom
(3 KB at 25.3 KB/sec)
[INFO] Downloading: https://repo.maven.apache.org/maven2/net/sf/docbook/docbook-xsl/1.76.1/docbook-xsl-1.76.1.pom
[INFO] Downloaded: https://repo.maven.apache.org/maven2/net/sf/docbook/docbook-xsl/1.76.1/docbook-xsl-1.76.1.pom
(5 KB at 226.1 KB/sec)
[INFO] Downloading: https://repo.maven.apache.org/maven2/net/sf/docbook/docbook/5.0-1/docbook-5.0-1.pom
[INFO] Downloaded: https://repo.maven.apache.org/maven2/net/sf/docbook/docbook/5.0-1/docbook-5.0-1.pom
(3 KB at 27.2 KB/sec)
[INFO] Downloading: https://repo.maven.apache.org/maven2/net/sf/docbook/docbook-xsl-saxon/1.0.0/docbook-xsl-saxon-1.0.0.pom
[INFO] Downloaded: https://repo.maven.apache.org/maven2/net/sf/docbook/docbook-xsl-saxon/1.0.0/docbook-xsl-saxon-1.0.0.pom
(3 KB at 284.3 KB/sec)
[INFO] Downloading: https://repo.maven.apache.org/maven2/net/sf/docbook/docbook/5.0/docbook-5.0.pom
[INFO] Downloaded: https://repo.maven.apache.org/maven2/net/sf/docbook/docbook/5.0/docbook-5.0.pom
(3 KB at 27.3 KB/sec)
[INFO] Downloading: https://repo.maven.apache.org/maven2/net/sf/docbook/docbook-xsl-webhelpindexer/1.0.0/docbook-xsl-webhelpindexer-1.0.0.pom
[INFO] Downloaded: https://repo.maven.apache.org/maven2/net/sf/docbook/docbook-xsl-webhelpindexer/1.0.0/docbook-xsl-webhelpindexer-1.0.0.pom
(4 KB at 409.4 KB/sec)
[INFO] Downloading: https://repo.maven.apache.org/maven2/org/apache/lucene/lucene-core/3.0.0/lucene-core-3.0.0.pom
[INFO] Downloaded: https://repo.maven.apache.org/maven2/org/apache/lucene/lucene-core/3.0.0/lucene-core-3.0.0.pom
(2 KB at 140.2 KB/sec)
[INFO] Downloading: https://repo.maven.apache.org/maven2/org/apache/lucene/lucene-parent/3.0.0/lucene-parent-3.0.0.pom
[INFO] Downloaded: https://repo.maven.apache.org/maven2/org/apache/lucene/lucene-parent/3.0.0/lucene-parent-3.0.0.pom
(4 KB at 277.8 KB/sec)
[INFO] Downloading: https://repo.maven.apache.org/maven2/org/apache/lucene/lucene-analyzers/3.0.0/lucene-analyzers-3.0.0.pom
[INFO] Downloaded: https://repo.maven.apache.org/maven2/org/apache/lucene/lucene-analyzers/3.0.0/lucene-analyzers-3.0.0.pom
(2 KB at 176.1 KB/sec)
[INFO] Downloading: https://repo.maven.apache.org/maven2/org/apache/lucene/lucene-contrib/3.0.0/lucene-contrib-3.0.0.pom
[INFO] Downloaded: https://repo.maven.apache.org/maven2/org/apache/lucene/lucene-contrib/3.0.0/lucene-contrib-3.0.0.pom
(2 KB at 85.4 KB/sec)
[INFO] Downloading: https://repo.maven.apache.org/maven2/org/apache/ant/ant/1.7.0/ant-1.7.0.pom
[INFO] Downloaded: https://repo.maven.apache.org/maven2/org/apache/ant/ant/1.7.0/ant-1.7.0.pom
(10 KB at 433.1 KB/sec)
[INFO] Downloading: https://repo.maven.apache.org/maven2/org/apache/ant/ant-parent/1.7.0/ant-parent-1.7.0.pom
[INFO] Downloaded: https://repo.maven.apache.org/maven2/org/apache/ant/ant-parent/1.7.0/ant-parent-1.7.0.pom
(5 KB at 427.5 KB/sec)
[INFO] Downloading: https://repo.maven.apache.org/maven2/org/apache/ant/ant-launcher/1.7.0/ant-launcher-1.7.0.pom
[INFO] Downloaded: https://repo.maven.apache.org/maven2/org/apache/ant/ant-launcher/1.7.0/ant-launcher-1.7.0.pom
(3 KB at 258.6 KB/sec)
[WARNING] Failed to getClass for com.agilejava.docbkx.maven.DocbkxHtmlMojo
[INFO] ------------------------------------------------------------------------
[INFO] Reactor Summary:
[INFO] 
[INFO] Apache UIMA-AS: uima-as-parent ..................... SUCCESS [ 36.801 s]
[INFO] Apache UIMA-AS: uimaj-as-core ...................... SUCCESS [02:08 min]
[INFO] Apache UIMA-AS: uimaj-as-jms ....................... SUCCESS [ 33.282 s]
[INFO] Apache UIMA-AS: uimaj-as-activemq .................. SUCCESS [38:09 min]
[INFO] Apache UIMA-AS Eclipse Plugin: uimaj-ep-runtime-deployeditor SUCCESS [ 45.291 s]
[INFO] Apache UIMA-AS Eclipse Plugin: uimaj-ep-deployeditor SUCCESS [02:10 min]
[INFO] Apache UIMA AS: uimaj-as-osgi-runtime .............. SUCCESS [ 20.086 s]
[INFO] Apache UIMA-AS: uimaj-as-camel ..................... SUCCESS [ 29.280 s]
[INFO] Apache UIMA Eclipse: uimaj-eclipse-feature-deployeditor SUCCESS [ 10.970 s]
[INFO] Apache UIMA-AS Aggregate: aggregate-uima-as-eclipse-plugins SUCCESS [  7.219 s]
[INFO] Apache UIMA-AS: uima-as-docbooks ................... FAILURE [  7.712 s]
[INFO] Apache UIMA-AS Aggregate: aggregate-uima-as ........ SKIPPED
[INFO] Apache UIMA-AS: uima-as ............................ SKIPPED
[INFO] ------------------------------------------------------------------------
[INFO] BUILD FAILURE
[INFO] ------------------------------------------------------------------------
[INFO] Total time: 46:20 min
[INFO] Finished at: 2018-01-08T19:58:37+01:00
[INFO] Final Memory: 141M/950M
[INFO] ------------------------------------------------------------------------
[ERROR] Failed to execute goal com.agilejava.docbkx:docbkx-maven-plugin:2.0.14:generate-html
(html) on project uima-as-docbooks: Execution html of goal com.agilejava.docbkx:docbkx-maven-plugin:2.0.14:generate-html
failed: Plugin com.agilejava.docbkx:docbkx-maven-plugin:2.0.14 or one of its dependencies
could not be resolved: Failed to collect dependencies at com.agilejava.docbkx:docbkx-maven-plugin:jar:2.0.14
-> com.agilejava.docbkx:docbkx-maven-base:jar:2.0.14 -> xml-resolver:xml-resolver:jar:1.1:
Failed to read artifact descriptor for xml-resolver:xml-resolver:jar:1.1: Could not transfer
artifact xml-resolver:xml-resolver:pom:1.1 from/to central (https://repo.maven.apache.org/maven2):
/home/jenkins/.m2/repository/xml-resolver/xml-resolver/1.1/xml-resolver-1.1.pom.part.lock
(No such file or directory) -> [Help 1]
[ERROR] 
[ERROR] To see the full stack trace of the errors, re-run Maven with the -e switch.
[ERROR] Re-run Maven using the -X switch to enable full debug logging.
[ERROR] 
[ERROR] For more information about the errors and possible solutions, please read the following
articles:
[ERROR] [Help 1] http://cwiki.apache.org/confluence/display/MAVEN/PluginResolutionException
[ERROR] 
[ERROR] After correcting the problems, you can resume the build with the command
[ERROR]   mvn <goals> -rf :uima-as-docbooks

Mime
View raw message