uima-dev mailing list archives

Site index · List index
Message view « Date » · « Thread »
Top « Date » · « Thread »
From Apache Jenkins Server <jenk...@builds.apache.org>
Subject Build failed in Jenkins: UIMA-v3-sdk #338
Date Thu, 11 Jan 2018 18:32:29 GMT
See <https://builds.apache.org/job/UIMA-v3-sdk/338/display/redirect?page=changes>

Changes:

[schor] [UIMA-5664] add new semibuiltin

[schor] [UIMA-5664] add new semibuiltin

[schor] [UIMA-5664][UIMA-5698] add new semibuiltin def, and some error msgs

------------------------------------------
[...truncated 371.24 KB...]
[INFO] 
[INFO] --- maven-surefire-plugin:2.20.1:test (default-test) @ uimaj-test-util ---
[JENKINS] Recording test results
[INFO] 
[INFO] --- maven-antrun-plugin:1.8:run (dup-meta-jar-cleanup) @ uimaj-test-util ---
[INFO] Executing tasks

main:
[INFO] Executed tasks
[INFO] 
[INFO] --- jacoco-maven-plugin:0.8.0:report (default-report) @ uimaj-test-util ---
[INFO] Skipping JaCoCo execution due to missing execution data file.
[PMD] No report found for mojo report
[INFO] 
[INFO] --- maven-jar-plugin:3.0.2:jar (default-jar) @ uimaj-test-util ---
[INFO] Building jar: F:\jenkins\jenkins-slave\workspace\UIMA-v3-sdk\uimaj-test-util\target\uimaj-test-util-3.0.1-beta-SNAPSHOT.jar
[INFO] 
[INFO] --- maven-site-plugin:3.5.1:attach-descriptor (attach-descriptor) @ uimaj-test-util
---
[INFO] 
[INFO] --- findbugs-maven-plugin:3.0.5:findbugs (default) @ uimaj-test-util ---
[INFO] Fork Value is true
     [java] Warnings generated: 25
[INFO] Done FindBugs Analysis....
[FINDBUGS] Searching for all files in F:\jenkins\jenkins-slave\workspace\UIMA-v3-sdk\uimaj-test-util\target
that match the pattern findbugsXml.xml
[FINDBUGS] Parsing 1 file in F:\jenkins\jenkins-slave\workspace\UIMA-v3-sdk\uimaj-test-util\target
[FINDBUGS] Successfully parsed file F:\jenkins\jenkins-slave\workspace\UIMA-v3-sdk\uimaj-test-util\target\findbugsXml.xml
of module Apache UIMA Base: uimaj-test-util: JUnit utilities with 25 unique warnings and 0
duplicates.
[FINDBUGS] Computing warning deltas based on reference build #337
[INFO] 
[INFO] --- maven-pmd-plugin:3.8:cpd (default) @ uimaj-test-util ---
[DRY] Searching for all files in F:\jenkins\jenkins-slave\workspace\UIMA-v3-sdk\uimaj-test-util\target
that match the pattern cpd.xml
[DRY] Parsing 1 file in F:\jenkins\jenkins-slave\workspace\UIMA-v3-sdk\uimaj-test-util\target
[DRY] Successfully parsed file F:\jenkins\jenkins-slave\workspace\UIMA-v3-sdk\uimaj-test-util\target\cpd.xml
of module Apache UIMA Base: uimaj-test-util: JUnit utilities with 2 unique warnings and 0
duplicates.
[DRY] Computing warning deltas based on reference build #337
[INFO] 
[INFO] --- maven-pmd-plugin:3.8:pmd (default) @ uimaj-test-util ---
[PMD] Searching for all files in F:\jenkins\jenkins-slave\workspace\UIMA-v3-sdk\uimaj-test-util\target
that match the pattern pmd.xml
[PMD] Parsing 1 file in F:\jenkins\jenkins-slave\workspace\UIMA-v3-sdk\uimaj-test-util\target
[PMD] Successfully parsed file F:\jenkins\jenkins-slave\workspace\UIMA-v3-sdk\uimaj-test-util\target\pmd.xml
of module Apache UIMA Base: uimaj-test-util: JUnit utilities with 12 unique warnings and 0
duplicates.
[PMD] Computing warning deltas based on reference build #337
[INFO] 
[INFO] --- jacoco-maven-plugin:0.8.0:check (default-check) @ uimaj-test-util ---
[INFO] Skipping JaCoCo execution due to missing execution data file:F:\jenkins\jenkins-slave\workspace\UIMA-v3-sdk\uimaj-test-util\target\jacoco.exec
[INFO] 
[INFO] --- maven-install-plugin:2.5.2:install (default-install) @ uimaj-test-util ---
[INFO] Installing F:\jenkins\jenkins-slave\workspace\UIMA-v3-sdk\uimaj-test-util\target\uimaj-test-util-3.0.1-beta-SNAPSHOT.jar
to f:\jenkins\jenkins-slave\maven-repositories\0\org\apache\uima\uimaj-test-util\3.0.1-beta-SNAPSHOT\uimaj-test-util-3.0.1-beta-SNAPSHOT.jar
[INFO] Installing F:\jenkins\jenkins-slave\workspace\UIMA-v3-sdk\uimaj-test-util\pom.xml to
f:\jenkins\jenkins-slave\maven-repositories\0\org\apache\uima\uimaj-test-util\3.0.1-beta-SNAPSHOT\uimaj-test-util-3.0.1-beta-SNAPSHOT.pom
[INFO] 
[INFO] >>> maven-dependency-plugin:3.0.2:analyze (default-cli) > test-compile
@ uimaj-test-util >>>
[INFO] 
[INFO] --- maven-enforcer-plugin:3.0.0-M1:enforce (enforce-versions) @ uimaj-test-util ---
[INFO] 
[INFO] --- build-helper-maven-plugin:3.0.0:parse-version (parse-project-version) @ uimaj-test-util
---
[INFO] 
[INFO] --- uima-build-helper-maven-plugin:7:parse-date-time (set buildYear and buildMonth)
@ uimaj-test-util ---
[INFO] 
[INFO] --- jacoco-maven-plugin:0.8.0:prepare-agent (default-prepare-agent) @ uimaj-test-util
---
[INFO] jacoco.argLine set to -javaagent:f:\\jenkins\\jenkins-slave\\maven-repositories\\0\\org\\jacoco\\org.jacoco.agent\\0.8.0\\org.jacoco.agent-0.8.0-runtime.jar=destfile=F:\\jenkins\\jenkins-slave\\workspace\\UIMA-v3-sdk\\uimaj-test-util\\target\\jacoco.exec,excludes=**/org/apache/uima/examples/SourceDocumentInformation*:**/org/apache/uima/examples/SourceDocumentInformation_Type*
[INFO] 
[INFO] --- maven-remote-resources-plugin:1.5:process (process-resource-bundles) @ uimaj-test-util
---
[INFO] 
[INFO] --- maven-remote-resources-plugin:1.5:process (default) @ uimaj-test-util ---
[INFO] 
[INFO] --- maven-resources-plugin:3.0.2:resources (default-resources) @ uimaj-test-util ---
[INFO] Using 'UTF-8' encoding to copy filtered resources.
[INFO] Copying 0 resource
[INFO] Copying 3 resources
[INFO] Copying 3 resources
[INFO] Copying 3 resources
[INFO] Copying 3 resources
[INFO] 
[INFO] --- maven-compiler-plugin:3.7.0:compile (default-compile) @ uimaj-test-util ---
[INFO] Nothing to compile - all classes are up to date
[INFO] 
[INFO] --- maven-resources-plugin:3.0.2:testResources (default-testResources) @ uimaj-test-util
---
[INFO] Using 'UTF-8' encoding to copy filtered resources.
[INFO] skip non existing resourceDirectory F:\jenkins\jenkins-slave\workspace\UIMA-v3-sdk\uimaj-test-util\src\test\resources
[INFO] Copying 3 resources
[INFO] Copying 3 resources
[INFO] Copying 3 resources
[INFO] Copying 3 resources
[INFO] 
[INFO] --- maven-compiler-plugin:3.7.0:testCompile (default-testCompile) @ uimaj-test-util
---
[INFO] Nothing to compile - all classes are up to date
[WARNING] Failed to getClass for org.apache.maven.plugins.dependency.analyze.AnalyzeMojo
[INFO] 
[INFO] <<< maven-dependency-plugin:3.0.2:analyze (default-cli) < test-compile
@ uimaj-test-util <<<
[INFO] 
[INFO] --- maven-dependency-plugin:3.0.2:analyze (default-cli) @ uimaj-test-util ---
[WARNING] Unused declared dependencies found:
[WARNING]    xmlunit:xmlunit:jar:1.6:compile
[WARNING]    com.github.stephenc.findbugs:findbugs-annotations:jar:1.3.9-1:provided
[INFO]                                                                         
[INFO] ------------------------------------------------------------------------
[INFO] Building Apache UIMA Base: uimaj-core 3.0.1-beta-SNAPSHOT
[INFO] ------------------------------------------------------------------------
[INFO] 
[INFO] --- maven-clean-plugin:3.0.0:clean (default-clean) @ uimaj-core ---
[TASKS] Scanning folder 'F:\jenkins\jenkins-slave\workspace\UIMA-v3-sdk\uimaj-core' for files
matching the pattern '**/*.java' - excludes: 
[TASKS] Found 946 files to scan for tasks
Found 58 open tasks.
[TASKS] Computing warning deltas based on reference build #337
[INFO] 
[INFO] --- maven-enforcer-plugin:3.0.0-M1:enforce (enforce-versions) @ uimaj-core ---
[INFO] 
[INFO] --- build-helper-maven-plugin:3.0.0:parse-version (parse-project-version) @ uimaj-core
---
[INFO] 
[INFO] --- uima-build-helper-maven-plugin:7:parse-date-time (set buildYear and buildMonth)
@ uimaj-core ---
[INFO] 
[INFO] --- jacoco-maven-plugin:0.8.0:prepare-agent (default-prepare-agent) @ uimaj-core ---
[INFO] jacoco.argLine set to -javaagent:f:\\jenkins\\jenkins-slave\\maven-repositories\\0\\org\\jacoco\\org.jacoco.agent\\0.8.0\\org.jacoco.agent-0.8.0-runtime.jar=destfile=F:\\jenkins\\jenkins-slave\\workspace\\UIMA-v3-sdk\\uimaj-core\\target\\jacoco.exec,excludes=**/org/apache/uima/examples/SourceDocumentInformation*:**/org/apache/uima/examples/SourceDocumentInformation_Type*
[INFO] 
[INFO] --- maven-resources-plugin:3.0.2:copy-resources (setVersions) @ uimaj-core ---
[INFO] Using 'UTF-8' encoding to copy filtered resources.
[INFO] Copying 1 resource
[INFO] 
[INFO] --- build-helper-maven-plugin:3.0.0:add-source (addVersionSrc) @ uimaj-core ---
[INFO] Source directory: F:\jenkins\jenkins-slave\workspace\UIMA-v3-sdk\uimaj-core\target\generated-sources\releaseVersion
added.
[INFO] 
[INFO] --- maven-remote-resources-plugin:1.5:process (process-resource-bundles) @ uimaj-core
---
[INFO] 
[INFO] --- maven-remote-resources-plugin:1.5:process (default) @ uimaj-core ---
[INFO] 
[INFO] --- maven-resources-plugin:3.0.2:resources (default-resources) @ uimaj-core ---
[INFO] Using 'UTF-8' encoding to copy filtered resources.
[INFO] Copying 16 resources
[INFO] Copying 3 resources
[INFO] Copying 3 resources
[INFO] 
[INFO] --- maven-compiler-plugin:3.7.0:compile (default-compile) @ uimaj-core ---
[INFO] Changes detected - recompiling the module!
[INFO] Compiling 746 source files to F:\jenkins\jenkins-slave\workspace\UIMA-v3-sdk\uimaj-core\target\classes
[INFO] /F:/jenkins/jenkins-slave/workspace/UIMA-v3-sdk/uimaj-core/src/main/java/org/apache/uima/util/XMLParser.java:
Some input files use or override a deprecated API.
[INFO] /F:/jenkins/jenkins-slave/workspace/UIMA-v3-sdk/uimaj-core/src/main/java/org/apache/uima/util/XMLParser.java:
Recompile with -Xlint:deprecation for details.
[INFO] /F:/jenkins/jenkins-slave/workspace/UIMA-v3-sdk/uimaj-core/src/main/java/org/apache/uima/cas/CAS.java:
Some input files use unchecked or unsafe operations.
[INFO] /F:/jenkins/jenkins-slave/workspace/UIMA-v3-sdk/uimaj-core/src/main/java/org/apache/uima/cas/CAS.java:
Recompile with -Xlint:unchecked for details.
[INFO] -------------------------------------------------------------
[ERROR] COMPILATION ERROR : 
[INFO] -------------------------------------------------------------
[ERROR] /F:/jenkins/jenkins-slave/workspace/UIMA-v3-sdk/uimaj-core/src/main/java/org/apache/uima/jcas/cas/Int2FS.java:[80,31]
wrong number of type arguments; required 1
[ERROR] /F:/jenkins/jenkins-slave/workspace/UIMA-v3-sdk/uimaj-core/src/main/java/org/apache/uima/jcas/cas/Int2FS.java:[288,41]
wrong number of type arguments; required 1
[ERROR] /F:/jenkins/jenkins-slave/workspace/UIMA-v3-sdk/uimaj-core/src/main/java/org/apache/uima/jcas/cas/Int2FS.java:[113,32]
wrong number of type arguments; required 1
[ERROR] /F:/jenkins/jenkins-slave/workspace/UIMA-v3-sdk/uimaj-core/src/main/java/org/apache/uima/jcas/cas/Int2FS.java:[125,32]
wrong number of type arguments; required 1
[ERROR] /F:/jenkins/jenkins-slave/workspace/UIMA-v3-sdk/uimaj-core/src/main/java/org/apache/uima/jcas/cas/Int2FS.java:[141,32]
wrong number of type arguments; required 1
[INFO] 5 errors 
[INFO] -------------------------------------------------------------
[INFO]                                                                         
[INFO] ------------------------------------------------------------------------
[INFO] Skipping Apache UIMA Java SDK: uimaj
[INFO] This project has been banned from the build due to previous failures.
[INFO] ------------------------------------------------------------------------
[INFO] ------------------------------------------------------------------------
[INFO] Reactor Summary:
[INFO] 
[INFO] Apache UIMA Java SDK: uimaj-parent ................. SUCCESS [ 26.068 s]
[INFO] Apache UIMA Base: uimaj-test-util: JUnit utilities . SUCCESS [ 49.351 s]
[INFO] Apache UIMA Base: uimaj-core ....................... FAILURE [ 15.205 s]
[INFO] Apache UIMA Base: jVinci: Vinci Transport Library .. SKIPPED
[INFO] Apache UIMA Base: uimaj-adapter-vinci: Vinci Adapter SKIPPED
[INFO] Apache UIMA Base: uimaj-cpe: Collection Processing Engine SKIPPED
[INFO] Apache UIMA Base: uimaj-document-annotation ........ SKIPPED
[INFO] Apache UIMA Base: uimaj-tools: Tools ............... SKIPPED
[INFO] Apache UIMA Base: uimaj-v3migration-jcas ........... SKIPPED
[INFO] Apache UIMA Base: uimaj-examples: SDK Examples ..... SKIPPED
[INFO] Apache UIMA Base: uimaj-adapter-soap: SOAP Adapter . SKIPPED
[INFO] Apache UIMA Base: uimaj-component-test-util: for JUnit SKIPPED
[INFO] Apache UIMA Eclipse: uimaj-ep-debug ................ SKIPPED
[INFO] Apache UIMA Eclipse: uimaj-ep-jcasgen .............. SKIPPED
[INFO] Apache UIMA Eclipse: uimaj-ep-configurator: Descriptor Editor SKIPPED
[INFO] Apache UIMA Eclipse: uimaj-ep-pear-packager ........ SKIPPED
[INFO] Apache UIMA Eclipse: uimaj-ep-launcher ............. SKIPPED
[INFO] Apache UIMA Eclipse: uimaj-ep-cas-editor ........... SKIPPED
[INFO] Apache UIMA Eclipse: uimaj-ep-cas-editor-ide ....... SKIPPED
[INFO] Apache UIMA Eclipse: uimaj-ep-runtime .............. SKIPPED
[INFO] Apache UIMA Eclipse: uimaj-eclipse-feature-tools ... SKIPPED
[INFO] Apache UIMA Eclipse: uimaj-eclipse-feature-runtime . SKIPPED
[INFO] Apache UIMA Aggregate: aggregate-uimaj-eclipse-plugins SKIPPED
[INFO] Apache UIMA SDK Documentation - overview and setup . SKIPPED
[INFO] Apache UIMA SDK Documentation - references ......... SKIPPED
[INFO] Apache UIMA SDK Documentation - tools .............. SKIPPED
[INFO] Apache UIMA SDK Documentation - tutorials and user's guides SKIPPED
[INFO] Apache UIMA SDK Documentation - Version 3 user's guide SKIPPED
[INFO] Apache UIMA Aggregate: aggregate-uimaj-docbooks .... SKIPPED
[INFO] Apache UIMA Maven: PearPackagingMavenPlugin ........ SKIPPED
[INFO] Apache UIMA Maven: jcasgen-maven-plugin ............ SKIPPED
[INFO] Apache UIMA Base: uimaj-bootstrap .................. SKIPPED
[INFO] Apache UIMA Aggregate: aggregate-uimaj ............. SKIPPED
[INFO] Apache UIMA Base: uimaj-json: JSON ................. SKIPPED
[INFO] Apache UIMA Java SDK: uimaj ........................ SKIPPED
[INFO] ------------------------------------------------------------------------
[INFO] BUILD FAILURE
[INFO] ------------------------------------------------------------------------
[INFO] Total time: 01:45 min
[INFO] Finished at: 2018-01-11T18:32:07+00:00
[INFO] Final Memory: 79M/796M
[INFO] ------------------------------------------------------------------------
[ERROR] Failed to execute goal org.apache.maven.plugins:maven-compiler-plugin:3.7.0:compile
(default-compile) on project uimaj-core: Compilation failure: Compilation failure:
[ERROR] /F:/jenkins/jenkins-slave/workspace/UIMA-v3-sdk/uimaj-core/src/main/java/org/apache/uima/jcas/cas/Int2FS.java:[80,31]
wrong number of type arguments; required 1
[ERROR] /F:/jenkins/jenkins-slave/workspace/UIMA-v3-sdk/uimaj-core/src/main/java/org/apache/uima/jcas/cas/Int2FS.java:[288,41]
wrong number of type arguments; required 1
[ERROR] /F:/jenkins/jenkins-slave/workspace/UIMA-v3-sdk/uimaj-core/src/main/java/org/apache/uima/jcas/cas/Int2FS.java:[113,32]
wrong number of type arguments; required 1
[ERROR] /F:/jenkins/jenkins-slave/workspace/UIMA-v3-sdk/uimaj-core/src/main/java/org/apache/uima/jcas/cas/Int2FS.java:[125,32]
wrong number of type arguments; required 1
[ERROR] /F:/jenkins/jenkins-slave/workspace/UIMA-v3-sdk/uimaj-core/src/main/java/org/apache/uima/jcas/cas/Int2FS.java:[141,32]
wrong number of type arguments; required 1
[ERROR] -> [Help 1]
[ERROR] 
[ERROR] To see the full stack trace of the errors, re-run Maven with the -e switch.
[ERROR] Re-run Maven using the -X switch to enable full debug logging.
[ERROR] 
[ERROR] For more information about the errors and possible solutions, please read the following
articles:
[ERROR] [Help 1] http://cwiki.apache.org/confluence/display/MAVEN/MojoFailureException
[ERROR] 
[ERROR] After correcting the problems, you can resume the build with the command
[ERROR]   mvn <goals> -rf :uimaj-core
[JENKINS] Archiving F:\jenkins\jenkins-slave\workspace\UIMA-v3-sdk\uimaj-eclipse-feature-runtime\pom.xml
to org.apache.uima/uimaj-eclipse-feature-runtime/3.0.1-beta-SNAPSHOT/uimaj-eclipse-feature-runtime-3.0.1-beta-SNAPSHOT.pom
[JENKINS] Archiving F:\jenkins\jenkins-slave\workspace\UIMA-v3-sdk\uimaj-ep-launcher\pom.xml
to org.apache.uima/uimaj-ep-launcher/3.0.1-beta-SNAPSHOT/uimaj-ep-launcher-3.0.1-beta-SNAPSHOT.pom
[JENKINS] Archiving F:\jenkins\jenkins-slave\workspace\UIMA-v3-sdk\uimaj-eclipse-feature-tools\pom.xml
to org.apache.uima/uimaj-eclipse-feature-tools/3.0.1-beta-SNAPSHOT/uimaj-eclipse-feature-tools-3.0.1-beta-SNAPSHOT.pom
[JENKINS] Archiving F:\jenkins\jenkins-slave\workspace\UIMA-v3-sdk\uimaj-bootstrap\pom.xml
to org.apache.uima/uimaj-bootstrap/3.0.1-beta-SNAPSHOT/uimaj-bootstrap-3.0.1-beta-SNAPSHOT.pom
[JENKINS] Archiving F:\jenkins\jenkins-slave\workspace\UIMA-v3-sdk\aggregate-uimaj-eclipse-plugins\pom.xml
to org.apache.uima/aggregate-uimaj-eclipse-plugins/3.0.1-beta-SNAPSHOT/aggregate-uimaj-eclipse-plugins-3.0.1-beta-SNAPSHOT.pom
[JENKINS] Archiving F:\jenkins\jenkins-slave\workspace\UIMA-v3-sdk\uimaj-core\pom.xml to org.apache.uima/uimaj-core/3.0.1-beta-SNAPSHOT/uimaj-core-3.0.1-beta-SNAPSHOT.pom
[JENKINS] Archiving F:\jenkins\jenkins-slave\workspace\UIMA-v3-sdk\uimaj-component-test-util\pom.xml
to org.apache.uima/uimaj-component-test-util/3.0.1-beta-SNAPSHOT/uimaj-component-test-util-3.0.1-beta-SNAPSHOT.pom
[JENKINS] Archiving F:\jenkins\jenkins-slave\workspace\UIMA-v3-sdk\aggregate-uimaj-docbooks\pom.xml
to org.apache.uima/aggregate-uimaj-docbooks/3.0.1-beta-SNAPSHOT/aggregate-uimaj-docbooks-3.0.1-beta-SNAPSHOT.pom
[JENKINS] Archiving F:\jenkins\jenkins-slave\workspace\UIMA-v3-sdk\uima-docbook-tools\pom.xml
to org.apache.uima/uima-docbook-tools/3.0.1-beta-SNAPSHOT/uima-docbook-tools-3.0.1-beta-SNAPSHOT.pom
[JENKINS] Archiving F:\jenkins\jenkins-slave\workspace\UIMA-v3-sdk\uimaj-document-annotation\pom.xml
to org.apache.uima/uimaj-document-annotation/3.0.1-beta-SNAPSHOT/uimaj-document-annotation-3.0.1-beta-SNAPSHOT.pom
[JENKINS] Archiving F:\jenkins\jenkins-slave\workspace\UIMA-v3-sdk\jVinci\pom.xml to org.apache.uima/jVinci/3.0.1-beta-SNAPSHOT/jVinci-3.0.1-beta-SNAPSHOT.pom
[JENKINS] Archiving F:\jenkins\jenkins-slave\workspace\UIMA-v3-sdk\uimaj-ep-configurator\pom.xml
to org.apache.uima/uimaj-ep-configurator/3.0.1-beta-SNAPSHOT/uimaj-ep-configurator-3.0.1-beta-SNAPSHOT.pom
[JENKINS] Archiving F:\jenkins\jenkins-slave\workspace\UIMA-v3-sdk\uimaj-examples\pom.xml
to org.apache.uima/uimaj-examples/3.0.1-beta-SNAPSHOT/uimaj-examples-3.0.1-beta-SNAPSHOT.pom
[JENKINS] Archiving F:\jenkins\jenkins-slave\workspace\UIMA-v3-sdk\uimaj-adapter-vinci\pom.xml
to org.apache.uima/uimaj-adapter-vinci/3.0.1-beta-SNAPSHOT/uimaj-adapter-vinci-3.0.1-beta-SNAPSHOT.pom
[JENKINS] Archiving F:\jenkins\jenkins-slave\workspace\UIMA-v3-sdk\PearPackagingMavenPlugin\pom.xml
to org.apache.uima/PearPackagingMavenPlugin/3.0.1-beta-SNAPSHOT/PearPackagingMavenPlugin-3.0.1-beta-SNAPSHOT.pom
[JENKINS] Archiving F:\jenkins\jenkins-slave\workspace\UIMA-v3-sdk\uimaj-ep-cas-editor-ide\pom.xml
to org.apache.uima/uimaj-ep-cas-editor-ide/3.0.1-beta-SNAPSHOT/uimaj-ep-cas-editor-ide-3.0.1-beta-SNAPSHOT.pom
[JENKINS] Archiving F:\jenkins\jenkins-slave\workspace\UIMA-v3-sdk\uimaj-test-util\pom.xml
to org.apache.uima/uimaj-test-util/3.0.1-beta-SNAPSHOT/uimaj-test-util-3.0.1-beta-SNAPSHOT.pom
[JENKINS] Archiving F:\jenkins\jenkins-slave\workspace\UIMA-v3-sdk\uimaj-test-util\target\uimaj-test-util-3.0.1-beta-SNAPSHOT.jar
to org.apache.uima/uimaj-test-util/3.0.1-beta-SNAPSHOT/uimaj-test-util-3.0.1-beta-SNAPSHOT.jar
[JENKINS] Archiving F:\jenkins\jenkins-slave\workspace\UIMA-v3-sdk\uimaj-ep-runtime\pom.xml
to org.apache.uima/uimaj-ep-runtime/3.0.1-beta-SNAPSHOT/uimaj-ep-runtime-3.0.1-beta-SNAPSHOT.pom
[JENKINS] Archiving F:\jenkins\jenkins-slave\workspace\UIMA-v3-sdk\uimaj-ep-debug\pom.xml
to org.apache.uima/uimaj-ep-debug/3.0.1-beta-SNAPSHOT/uimaj-ep-debug-3.0.1-beta-SNAPSHOT.pom
[JENKINS] Archiving F:\jenkins\jenkins-slave\workspace\UIMA-v3-sdk\uimaj-ep-cas-editor\pom.xml
to org.apache.uima/uimaj-ep-cas-editor/3.0.1-beta-SNAPSHOT/uimaj-ep-cas-editor-3.0.1-beta-SNAPSHOT.pom
[JENKINS] Archiving F:\jenkins\jenkins-slave\workspace\UIMA-v3-sdk\aggregate-uimaj\pom.xml
to org.apache.uima/aggregate-uimaj/3.0.1-beta-SNAPSHOT/aggregate-uimaj-3.0.1-beta-SNAPSHOT.pom
[JENKINS] Archiving F:\jenkins\jenkins-slave\workspace\UIMA-v3-sdk\uimaj-parent\pom.xml to
org.apache.uima/uimaj-parent/3.0.1-beta-SNAPSHOT/uimaj-parent-3.0.1-beta-SNAPSHOT.pom
[JENKINS] Archiving F:\jenkins\jenkins-slave\workspace\UIMA-v3-sdk\jcasgen-maven-plugin\pom.xml
to org.apache.uima/jcasgen-maven-plugin/3.0.1-beta-SNAPSHOT/jcasgen-maven-plugin-3.0.1-beta-SNAPSHOT.pom
[JENKINS] Archiving <https://builds.apache.org/job/UIMA-v3-sdk/ws/pom.xml> to org.apache.uima/uimaj/3.0.1-beta-SNAPSHOT/uimaj-3.0.1-beta-SNAPSHOT.pom
[JENKINS] Archiving F:\jenkins\jenkins-slave\workspace\UIMA-v3-sdk\uimaj-ep-jcasgen\pom.xml
to org.apache.uima/uimaj-ep-jcasgen/3.0.1-beta-SNAPSHOT/uimaj-ep-jcasgen-3.0.1-beta-SNAPSHOT.pom
[JENKINS] Archiving F:\jenkins\jenkins-slave\workspace\UIMA-v3-sdk\uimaj-json\pom.xml to org.apache.uima/uimaj-json/3.0.1-beta-SNAPSHOT/uimaj-json-3.0.1-beta-SNAPSHOT.pom
[JENKINS] Archiving F:\jenkins\jenkins-slave\workspace\UIMA-v3-sdk\uimaj-v3migration-jcas\pom.xml
to org.apache.uima/uimaj-v3migration-jcas/3.0.1-beta-SNAPSHOT/uimaj-v3migration-jcas-3.0.1-beta-SNAPSHOT.pom
[JENKINS] Archiving F:\jenkins\jenkins-slave\workspace\UIMA-v3-sdk\uimaj-tools\pom.xml to
org.apache.uima/uimaj-tools/3.0.1-beta-SNAPSHOT/uimaj-tools-3.0.1-beta-SNAPSHOT.pom
[JENKINS] Archiving F:\jenkins\jenkins-slave\workspace\UIMA-v3-sdk\uima-docbook-tutorials-and-users-guides\pom.xml
to org.apache.uima/uima-docbook-tutorials-and-users-guides/3.0.1-beta-SNAPSHOT/uima-docbook-tutorials-and-users-guides-3.0.1-beta-SNAPSHOT.pom
[JENKINS] Archiving F:\jenkins\jenkins-slave\workspace\UIMA-v3-sdk\uimaj-adapter-soap\pom.xml
to org.apache.uima/uimaj-adapter-soap/3.0.1-beta-SNAPSHOT/uimaj-adapter-soap-3.0.1-beta-SNAPSHOT.pom
[JENKINS] Archiving F:\jenkins\jenkins-slave\workspace\UIMA-v3-sdk\uima-docbook-v3-users-guide\pom.xml
to org.apache.uima/uima-docbook-v3-users-guide/3.0.1-beta-SNAPSHOT/uima-docbook-v3-users-guide-3.0.1-beta-SNAPSHOT.pom
[JENKINS] Archiving F:\jenkins\jenkins-slave\workspace\UIMA-v3-sdk\uimaj-ep-pear-packager\pom.xml
to org.apache.uima/uimaj-ep-pear-packager/3.0.1-beta-SNAPSHOT/uimaj-ep-pear-packager-3.0.1-beta-SNAPSHOT.pom
[JENKINS] Archiving F:\jenkins\jenkins-slave\workspace\UIMA-v3-sdk\uima-docbook-overview-and-setup\pom.xml
to org.apache.uima/uima-docbook-overview-and-setup/3.0.1-beta-SNAPSHOT/uima-docbook-overview-and-setup-3.0.1-beta-SNAPSHOT.pom
[JENKINS] Archiving F:\jenkins\jenkins-slave\workspace\UIMA-v3-sdk\uima-docbook-references\pom.xml
to org.apache.uima/uima-docbook-references/3.0.1-beta-SNAPSHOT/uima-docbook-references-3.0.1-beta-SNAPSHOT.pom
[JENKINS] Archiving F:\jenkins\jenkins-slave\workspace\UIMA-v3-sdk\uimaj-cpe\pom.xml to org.apache.uima/uimaj-cpe/3.0.1-beta-SNAPSHOT/uimaj-cpe-3.0.1-beta-SNAPSHOT.pom
channel stopped
[WARNINGS] Skipping publisher since build result is FAILURE

Mime
View raw message