uima-dev mailing list archives

Site index · List index
Message view « Date » · « Thread »
Top « Date » · « Thread »
From Apache Jenkins Server <jenk...@builds.apache.org>
Subject Build failed in Jenkins: UIMA-DUCC » Apache UIMA DUCC: uima-ducc-container #1348
Date Tue, 01 May 2018 13:53:52 GMT
See <https://builds.apache.org/job/UIMA-DUCC/org.apache.uima$uima-ducc-container/1348/display/redirect>

------------------------------------------
[INFO]                                                                         
[INFO] ------------------------------------------------------------------------
[INFO] Building Apache UIMA DUCC: uima-ducc-container 2.2.3-SNAPSHOT
[INFO] ------------------------------------------------------------------------
[WARNING] The POM for org.eclipse.m2e:lifecycle-mapping:jar:1.0.0 is missing, no dependency
information available
[WARNING] Failed to retrieve plugin descriptor for org.eclipse.m2e:lifecycle-mapping:1.0.0:
Plugin org.eclipse.m2e:lifecycle-mapping:1.0.0 or one of its dependencies could not be resolved:
Failure to find org.eclipse.m2e:lifecycle-mapping:jar:1.0.0 in https://repo.maven.apache.org/maven2
was cached in the local repository, resolution will not be reattempted until the update interval
of central has elapsed or updates are forced
[WARNING] The POM for org.eclipse.m2e:lifecycle-mapping:jar:1.0.0 is missing, no dependency
information available
[WARNING] Failed to retrieve plugin descriptor for org.eclipse.m2e:lifecycle-mapping:1.0.0:
Plugin org.eclipse.m2e:lifecycle-mapping:1.0.0 or one of its dependencies could not be resolved:
Failure to find org.eclipse.m2e:lifecycle-mapping:jar:1.0.0 in https://repo.maven.apache.org/maven2
was cached in the local repository, resolution will not be reattempted until the update interval
of central has elapsed or updates are forced
[WARNING] The POM for org.eclipse.m2e:lifecycle-mapping:jar:1.0.0 is missing, no dependency
information available
[WARNING] Failed to retrieve plugin descriptor for org.eclipse.m2e:lifecycle-mapping:1.0.0:
Plugin org.eclipse.m2e:lifecycle-mapping:1.0.0 or one of its dependencies could not be resolved:
Failure to find org.eclipse.m2e:lifecycle-mapping:jar:1.0.0 in https://repo.maven.apache.org/maven2
was cached in the local repository, resolution will not be reattempted until the update interval
of central has elapsed or updates are forced
[WARNING] The POM for org.eclipse.m2e:lifecycle-mapping:jar:1.0.0 is missing, no dependency
information available
[WARNING] Failed to retrieve plugin descriptor for org.eclipse.m2e:lifecycle-mapping:1.0.0:
Plugin org.eclipse.m2e:lifecycle-mapping:1.0.0 or one of its dependencies could not be resolved:
Failure to find org.eclipse.m2e:lifecycle-mapping:jar:1.0.0 in https://repo.maven.apache.org/maven2
was cached in the local repository, resolution will not be reattempted until the update interval
of central has elapsed or updates are forced
[INFO] 
[INFO] --- maven-clean-plugin:2.5:clean (default-clean) @ uima-ducc-container ---
[TASKS] Scanning folder '<https://builds.apache.org/job/UIMA-DUCC/org.apache.uima$uima-ducc-container/ws/'>
for files matching the pattern '**/*.java' - excludes: 
[TASKS] Found 183 files to scan for tasks
Found 18 open tasks.
[TASKS] Computing warning deltas based on reference build #1345
[INFO] 
[INFO] --- maven-enforcer-plugin:1.3.1:enforce (enforce-versions) @ uima-ducc-container ---
[INFO] 
[INFO] --- build-helper-maven-plugin:1.8:parse-version (parse-project-version) @ uima-ducc-container
---
[INFO] 
[INFO] --- uima-build-helper-maven-plugin:7:parse-date-time (set buildYear and buildMonth)
@ uima-ducc-container ---
[INFO] 
[INFO] --- buildnumber-maven-plugin:1.4:create (default) @ uima-ducc-container ---
[INFO] Executing: /bin/sh -c cd '<https://builds.apache.org/job/UIMA-DUCC/org.apache.uima$uima-ducc-container/ws/'>
&& 'svn' '--non-interactive' 'info'
[INFO] Working directory: <https://builds.apache.org/job/UIMA-DUCC/org.apache.uima$uima-ducc-container/ws/>
[INFO] Storing buildNumber: 1830682 at timestamp: 1525182748574
[INFO] Executing: /bin/sh -c cd '<https://builds.apache.org/job/UIMA-DUCC/org.apache.uima$uima-ducc-container/ws/'>
&& 'svn' '--non-interactive' 'info'
[INFO] Working directory: <https://builds.apache.org/job/UIMA-DUCC/org.apache.uima$uima-ducc-container/ws/>
[INFO] Storing buildScmBranch: trunk
[INFO] 
[INFO] --- maven-remote-resources-plugin:1.5:process (default) @ uima-ducc-container ---
[INFO] 
[INFO] --- maven-resources-plugin:2.6:resources (default-resources) @ uima-ducc-container
---
[INFO] Using 'UTF-8' encoding to copy filtered resources.
[INFO] Copying 0 resource
[INFO] Copying 3 resources
[INFO] 
[INFO] --- maven-compiler-plugin:3.1:compile (default-compile) @ uima-ducc-container ---
[INFO] Changes detected - recompiling the module!
[INFO] Compiling 157 source files to <https://builds.apache.org/job/UIMA-DUCC/org.apache.uima$uima-ducc-container/ws/target/classes>
[INFO] -------------------------------------------------------------
[ERROR] COMPILATION ERROR : 
[INFO] -------------------------------------------------------------
[ERROR] <https://builds.apache.org/job/UIMA-DUCC/org.apache.uima$uima-ducc-container/ws/src/main/java/org/apache/uima/ducc/container/sd/task/iface/TaskAllocatorCallbackListener.java>:[23,16]
cannot find symbol
  symbol:   class ITask
  location: interface org.apache.uima.ducc.container.sd.task.iface.TaskAllocatorCallbackListener
[ERROR] <https://builds.apache.org/job/UIMA-DUCC/org.apache.uima$uima-ducc-container/ws/src/main/java/org/apache/uima/ducc/container/sd/task/DuccServiceTaskProtocolHandler.java>:[38,52]
cannot find symbol
  symbol:   class ITask
  location: package org.apache.uima.ducc.container.sd.task.iface
[ERROR] <https://builds.apache.org/job/UIMA-DUCC/org.apache.uima$uima-ducc-container/ws/src/main/java/org/apache/uima/ducc/container/sd/task/TestTaskAllocatorCallbackListener.java>:[33,52]
cannot find symbol
  symbol:   class ITask
  location: package org.apache.uima.ducc.container.sd.task.iface
[ERROR] <https://builds.apache.org/job/UIMA-DUCC/org.apache.uima$uima-ducc-container/ws/src/main/java/org/apache/uima/ducc/container/sd/task/TestTaskAllocatorCallbackListener.java>:[63,16]
cannot find symbol
  symbol:   class ITask
  location: class org.apache.uima.ducc.container.sd.task.TestTaskAllocatorCallbackListener
[ERROR] <https://builds.apache.org/job/UIMA-DUCC/org.apache.uima$uima-ducc-container/ws/src/main/java/org/apache/uima/ducc/container/sd/task/DuccServiceTaskProtocolHandler.java>:[140,17]
cannot find symbol
  symbol:   class ITask
  location: class org.apache.uima.ducc.container.sd.task.DuccServiceTaskProtocolHandler
[ERROR] <https://builds.apache.org/job/UIMA-DUCC/org.apache.uima$uima-ducc-container/ws/src/main/java/org/apache/uima/ducc/container/sd/task/TestTaskAllocatorCallbackListener.java>:[94,28]
cannot find symbol
  symbol:   class SimpleTask
  location: class org.apache.uima.ducc.container.sd.task.TestTaskAllocatorCallbackListener
[INFO] 6 errors 
[INFO] -------------------------------------------------------------

Mime
View raw message