uima-dev mailing list archives

Site index · List index
Message view « Date » · « Thread »
Top « Date » · « Thread »
From Apache Jenkins Server <jenk...@builds.apache.org>
Subject Build failed in Jenkins: UIMA-DUCC #1362
Date Mon, 07 May 2018 14:54:58 GMT
See <https://builds.apache.org/job/UIMA-DUCC/1362/display/redirect?page=changes>

Changes:

[cwiklik] UIMA-5756 moved from container project

[cwiklik] UIMA-5756 moved files from container project

[cwiklik] UIMA-5756 moved files from container project

[cwiklik] UIMA-5756 moved files form container project

------------------------------------------
[...truncated 348.82 KB...]
pending job termination
pending processes termination
permits to force thread terminations
plist
process count
publishing state
received
releasing
removed queue
retry
retry attempts exhausted
running
seqNo
shares
size zero request ignored
terminate
terminate driver thread
terminating thread
thread
threads-per-share
UIMA-AS
unable to create user log appender
user log
work item monitor class
foobar
Tests run: 1, Failures: 0, Errors: 0, Skipped: 0, Time elapsed: 0.034 sec - in org.apache.uima.ducc.common.test.MessagesTest
Running org.apache.uima.ducc.common.test.SizeTest
Tests run: 1, Failures: 0, Errors: 0, Skipped: 0, Time elapsed: 0.004 sec - in org.apache.uima.ducc.common.test.SizeTest
Running org.apache.uima.ducc.common.test.CryptoTest
Tests run: 1, Failures: 0, Errors: 0, Skipped: 0, Time elapsed: 0.43 sec - in org.apache.uima.ducc.common.test.CryptoTest
 INFO | Cobertura: Loaded information on 372 classes.
 INFO | Cobertura: Saved information on 372 classes.

Results :

Tests run: 9, Failures: 0, Errors: 0, Skipped: 0

[JENKINS] Recording test results
[INFO] 
[INFO] <<< cobertura-maven-plugin:2.7:cobertura (default-cli) < [cobertura]test
@ uima-ducc-common <<<
[INFO] 
[INFO] --- cobertura-maven-plugin:2.7:cobertura (default-cli) @ uima-ducc-common ---
[INFO] Cobertura 2.1.1 - GNU GPL License (NO WARRANTY) - See COPYRIGHT file
[INFO] Cobertura: Loaded information on 372 classes.
Report time: 1289ms

[INFO] Cobertura Report generation was successful.
[INFO]                                                                         
[INFO] ------------------------------------------------------------------------
[INFO] Building Apache UIMA DUCC: uima-ducc-pullservice 2.2.3-SNAPSHOT
[INFO] ------------------------------------------------------------------------
[INFO] 
[INFO] --- maven-clean-plugin:2.5:clean (default-clean) @ uima-ducc-pullservice ---
[TASKS] Scanning folder '<https://builds.apache.org/job/UIMA-DUCC/ws/trunk/uima-ducc-pullservice'>
for files matching the pattern '**/*.java' - excludes: 
[TASKS] Found 97 files to scan for tasks
Found 22 open tasks.
[TASKS] Computing warning deltas based on reference build #1361
[INFO] 
[INFO] --- maven-enforcer-plugin:1.3.1:enforce (enforce-versions) @ uima-ducc-pullservice
---
[INFO] 
[INFO] --- build-helper-maven-plugin:1.8:parse-version (parse-project-version) @ uima-ducc-pullservice
---
[INFO] 
[INFO] --- uima-build-helper-maven-plugin:7:parse-date-time (set buildYear and buildMonth)
@ uima-ducc-pullservice ---
[INFO] 
[INFO] --- buildnumber-maven-plugin:1.4:create (default) @ uima-ducc-pullservice ---
[INFO] Executing: /bin/sh -c cd '<https://builds.apache.org/job/UIMA-DUCC/ws/trunk/uima-ducc-pullservice'>
&& 'svn' '--non-interactive' 'info'
[INFO] Working directory: <https://builds.apache.org/job/UIMA-DUCC/ws/trunk/uima-ducc-pullservice>
[INFO] Storing buildNumber: 1831104 at timestamp: 1525704832950
[INFO] Executing: /bin/sh -c cd '<https://builds.apache.org/job/UIMA-DUCC/ws/trunk/uima-ducc-pullservice'>
&& 'svn' '--non-interactive' 'info'
[INFO] Working directory: <https://builds.apache.org/job/UIMA-DUCC/ws/trunk/uima-ducc-pullservice>
[INFO] Storing buildScmBranch: trunk
[INFO] 
[INFO] --- maven-remote-resources-plugin:1.5:process (default) @ uima-ducc-pullservice ---
[INFO] 
[INFO] --- maven-resources-plugin:2.6:resources (default-resources) @ uima-ducc-pullservice
---
[INFO] Using 'UTF-8' encoding to copy filtered resources.
[INFO] skip non existing resourceDirectory <https://builds.apache.org/job/UIMA-DUCC/ws/trunk/uima-ducc-pullservice/src/main/resources>
[INFO] Copying 3 resources
[INFO] 
[INFO] --- maven-compiler-plugin:3.1:compile (default-compile) @ uima-ducc-pullservice ---
[INFO] Changes detected - recompiling the module!
[INFO] Compiling 93 source files to <https://builds.apache.org/job/UIMA-DUCC/ws/trunk/uima-ducc-pullservice/target/classes>
[INFO] -------------------------------------------------------------
[WARNING] COMPILATION WARNING : 
[INFO] -------------------------------------------------------------
[WARNING] <https://builds.apache.org/job/UIMA-DUCC/ws/trunk/uima-ducc-pullservice/src/main/java/org/apache/uima/ducc/ps/service/processor/uima/utils/UimaResultDefaultSerializer.java>:
<https://builds.apache.org/job/UIMA-DUCC/ws/trunk/uima-ducc-pullservice/src/main/java/org/apache/uima/ducc/ps/service/processor/uima/utils/UimaResultDefaultSerializer.java>
uses unchecked or unsafe operations.
[WARNING] <https://builds.apache.org/job/UIMA-DUCC/ws/trunk/uima-ducc-pullservice/src/main/java/org/apache/uima/ducc/ps/service/processor/uima/utils/UimaResultDefaultSerializer.java>:
Recompile with -Xlint:unchecked for details.
[INFO] 2 warnings 
[INFO] -------------------------------------------------------------
[INFO] -------------------------------------------------------------
[ERROR] COMPILATION ERROR : 
[INFO] -------------------------------------------------------------
[ERROR] <https://builds.apache.org/job/UIMA-DUCC/ws/trunk/uima-ducc-pullservice/src/main/java/org/apache/uima/ducc/container/sd/task/TestTaskAllocatorCallbackListener.java>:[32,52]
cannot find symbol
  symbol:   class ITask
  location: package org.apache.uima.ducc.container.sd.task.iface
[ERROR] <https://builds.apache.org/job/UIMA-DUCC/ws/trunk/uima-ducc-pullservice/src/main/java/org/apache/uima/ducc/container/sd/task/iface/TaskAllocatorCallbackListener.java>:[22,48]
package org.apache.uima.ducc.container.net.iface does not exist
[ERROR] <https://builds.apache.org/job/UIMA-DUCC/ws/trunk/uima-ducc-pullservice/src/main/java/org/apache/uima/ducc/container/sd/task/TestTaskAllocatorCallbackListener.java>:[62,16]
cannot find symbol
  symbol:   class ITask
  location: class org.apache.uima.ducc.container.sd.task.TestTaskAllocatorCallbackListener
[ERROR] <https://builds.apache.org/job/UIMA-DUCC/ws/trunk/uima-ducc-pullservice/src/main/java/org/apache/uima/ducc/container/sd/task/iface/TaskAllocatorCallbackListener.java>:[26,58]
cannot find symbol
  symbol:   class IPerformanceMetrics
  location: interface org.apache.uima.ducc.container.sd.task.iface.TaskAllocatorCallbackListener
[ERROR] <https://builds.apache.org/job/UIMA-DUCC/ws/trunk/uima-ducc-pullservice/src/main/java/org/apache/uima/ducc/container/sd/task/SimpleTask.java>:[23,52]
cannot find symbol
  symbol:   class ITask
  location: package org.apache.uima.ducc.container.sd.task.iface
[ERROR] <https://builds.apache.org/job/UIMA-DUCC/ws/trunk/uima-ducc-pullservice/src/main/java/org/apache/uima/ducc/container/sd/task/SimpleTask.java>:[25,36]
cannot find symbol
  symbol: class ITask
[ERROR] <https://builds.apache.org/job/UIMA-DUCC/ws/trunk/uima-ducc-pullservice/src/main/java/org/apache/uima/ducc/container/sd/task/DuccServiceTaskProtocolHandler.java>:[35,52]
cannot find symbol
  symbol:   class ITask
  location: package org.apache.uima.ducc.container.sd.task.iface
[ERROR] <https://builds.apache.org/job/UIMA-DUCC/ws/trunk/uima-ducc-pullservice/src/main/java/org/apache/uima/ducc/container/sd/task/iface/TaskProtocolHandler.java>:[24,48]
package org.apache.uima.ducc.container.net.iface does not exist
[ERROR] <https://builds.apache.org/job/UIMA-DUCC/ws/trunk/uima-ducc-pullservice/src/main/java/org/apache/uima/ducc/container/sd/task/iface/TaskProtocolHandler.java>:[33,25]
cannot find symbol
  symbol:   class IMetaCasTransaction
  location: interface org.apache.uima.ducc.container.sd.task.iface.TaskProtocolHandler
[ERROR] <https://builds.apache.org/job/UIMA-DUCC/ws/trunk/uima-ducc-pullservice/src/main/java/org/apache/uima/ducc/container/sd/task/TestTaskAllocatorCallbackListener.java>:[44,8]
org.apache.uima.ducc.container.sd.task.TestTaskAllocatorCallbackListener is not abstract and
does not override abstract method onTaskFailure(org.apache.uima.ducc.container.sd.task.iface.TaskConsumer,java.lang.String)
in org.apache.uima.ducc.container.sd.task.iface.TaskAllocatorCallbackListener
[ERROR] <https://builds.apache.org/job/UIMA-DUCC/ws/trunk/uima-ducc-pullservice/src/main/java/org/apache/uima/ducc/container/sd/task/SimpleTask.java>:[36,9]
method does not override or implement a method from a supertype
[ERROR] <https://builds.apache.org/job/UIMA-DUCC/ws/trunk/uima-ducc-pullservice/src/main/java/org/apache/uima/ducc/container/sd/task/SimpleTask.java>:[41,9]
method does not override or implement a method from a supertype
[ERROR] <https://builds.apache.org/job/UIMA-DUCC/ws/trunk/uima-ducc-pullservice/src/main/java/org/apache/uima/ducc/container/sd/task/DuccServiceTaskProtocolHandler.java>:[142,17]
cannot find symbol
  symbol:   class ITask
  location: class org.apache.uima.ducc.container.sd.task.DuccServiceTaskProtocolHandler
[ERROR] <https://builds.apache.org/job/UIMA-DUCC/ws/trunk/uima-ducc-pullservice/src/main/java/org/apache/uima/ducc/container/sd/task/DuccServiceTaskProtocolHandler.java>:[149,45]
cannot find symbol
  symbol:   method getTask(org.apache.uima.ducc.container.sd.task.iface.TaskConsumer)
  location: variable taskAllocator of type org.apache.uima.ducc.container.sd.task.iface.TaskAllocatorCallbackListener
[ERROR] <https://builds.apache.org/job/UIMA-DUCC/ws/trunk/uima-ducc-pullservice/src/main/java/org/apache/uima/ducc/container/sd/task/DuccServiceTaskProtocolHandler.java>:[198,38]
method onTaskFailure in interface org.apache.uima.ducc.container.sd.task.iface.TaskAllocatorCallbackListener
cannot be applied to given types;
  required: org.apache.uima.ducc.container.sd.task.iface.TaskConsumer,java.lang.String
  found: org.apache.uima.ducc.container.sd.task.iface.TaskConsumer,java.lang.String,java.lang.String
  reason: actual and formal argument lists differ in length
[ERROR] <https://builds.apache.org/job/UIMA-DUCC/ws/trunk/uima-ducc-pullservice/src/main/java/org/apache/uima/ducc/container/sd/task/DuccServiceTaskProtocolHandler.java>:[206,38]
method onTaskSuccess in interface org.apache.uima.ducc.container.sd.task.iface.TaskAllocatorCallbackListener
cannot be applied to given types;
  required: org.apache.uima.ducc.container.sd.task.iface.TaskConsumer,IPerformanceMetrics
  found: org.apache.uima.ducc.container.sd.task.iface.TaskConsumer,java.lang.String,java.lang.String
  reason: actual and formal argument lists differ in length
[INFO] 16 errors 
[INFO] -------------------------------------------------------------
[INFO] ------------------------------------------------------------------------
[INFO] Reactor Summary:
[INFO] 
[INFO] Apache UIMA DUCC: uima-ducc-parent ................. SUCCESS [01:32 min]
[INFO] Apache UIMA DUCC: uima-ducc-user ................... SUCCESS [02:58 min]
[INFO] Apache UIMA DUCC: uima-ducc-common ................. SUCCESS [01:55 min]
[INFO] Apache UIMA DUCC: uima-ducc-pullservice ............ FAILURE [ 12.368 s]
[INFO] Apache UIMA DUCC: uima-ducc-container .............. SKIPPED
[INFO] Apache UIMA DUCC: uima-ducc-transport .............. SKIPPED
[INFO] Apache UIMA DUCC: uima-ducc-cli .................... SKIPPED
[INFO] Apache UIMA DUCC: uima-ducc-pm ..................... SKIPPED
[INFO] Apache UIMA DUCC: uima-ducc-rm ..................... SKIPPED
[INFO] Apache UIMA DUCC: uima-ducc-sm ..................... SKIPPED
[INFO] Apache UIMA DUCC: uima-ducc-database ............... SKIPPED
[INFO] Apache UIMA DUCC: uima-ducc-orchestrator ........... SKIPPED
[INFO] Apache UIMA DUCC: uima-ducc-agent .................. SKIPPED
[INFO] Apache UIMA DUCC: uima-ducc-duccdocs ............... SKIPPED
[INFO] Apache UIMA DUCC: uima-ducc-web .................... SKIPPED
[INFO] Apache UIMA DUCC: uima-ducc-examples ............... SKIPPED
[INFO] Apache UIMA DUCC: uima-ducc-spawn .................. SKIPPED
[INFO] Apache UIMA-DUCC: uima-ducc ........................ SKIPPED
[INFO] ------------------------------------------------------------------------
[INFO] BUILD FAILURE
[INFO] ------------------------------------------------------------------------
[INFO] Total time: 07:17 min
[INFO] Finished at: 2018-05-07T14:54:12+00:00
[INFO] Final Memory: 115M/927M
[INFO] ------------------------------------------------------------------------
[ERROR] Failed to execute goal org.apache.maven.plugins:maven-compiler-plugin:3.1:compile
(default-compile) on project uima-ducc-pullservice: Compilation failure: Compilation failure:
[ERROR] <https://builds.apache.org/job/UIMA-DUCC/ws/trunk/uima-ducc-pullservice/src/main/java/org/apache/uima/ducc/container/sd/task/TestTaskAllocatorCallbackListener.java>:[32,52]
cannot find symbol
[ERROR] symbol:   class ITask
[ERROR] location: package org.apache.uima.ducc.container.sd.task.iface
[ERROR] <https://builds.apache.org/job/UIMA-DUCC/ws/trunk/uima-ducc-pullservice/src/main/java/org/apache/uima/ducc/container/sd/task/iface/TaskAllocatorCallbackListener.java>:[22,48]
package org.apache.uima.ducc.container.net.iface does not exist
[ERROR] <https://builds.apache.org/job/UIMA-DUCC/ws/trunk/uima-ducc-pullservice/src/main/java/org/apache/uima/ducc/container/sd/task/TestTaskAllocatorCallbackListener.java>:[62,16]
cannot find symbol
[ERROR] symbol:   class ITask
[ERROR] location: class org.apache.uima.ducc.container.sd.task.TestTaskAllocatorCallbackListener
[ERROR] <https://builds.apache.org/job/UIMA-DUCC/ws/trunk/uima-ducc-pullservice/src/main/java/org/apache/uima/ducc/container/sd/task/iface/TaskAllocatorCallbackListener.java>:[26,58]
cannot find symbol
[ERROR] symbol:   class IPerformanceMetrics
[ERROR] location: interface org.apache.uima.ducc.container.sd.task.iface.TaskAllocatorCallbackListener
[ERROR] <https://builds.apache.org/job/UIMA-DUCC/ws/trunk/uima-ducc-pullservice/src/main/java/org/apache/uima/ducc/container/sd/task/SimpleTask.java>:[23,52]
cannot find symbol
[ERROR] symbol:   class ITask
[ERROR] location: package org.apache.uima.ducc.container.sd.task.iface
[ERROR] <https://builds.apache.org/job/UIMA-DUCC/ws/trunk/uima-ducc-pullservice/src/main/java/org/apache/uima/ducc/container/sd/task/SimpleTask.java>:[25,36]
cannot find symbol
[ERROR] symbol: class ITask
[ERROR] <https://builds.apache.org/job/UIMA-DUCC/ws/trunk/uima-ducc-pullservice/src/main/java/org/apache/uima/ducc/container/sd/task/DuccServiceTaskProtocolHandler.java>:[35,52]
cannot find symbol
[ERROR] symbol:   class ITask
[ERROR] location: package org.apache.uima.ducc.container.sd.task.iface
[ERROR] <https://builds.apache.org/job/UIMA-DUCC/ws/trunk/uima-ducc-pullservice/src/main/java/org/apache/uima/ducc/container/sd/task/iface/TaskProtocolHandler.java>:[24,48]
package org.apache.uima.ducc.container.net.iface does not exist
[ERROR] <https://builds.apache.org/job/UIMA-DUCC/ws/trunk/uima-ducc-pullservice/src/main/java/org/apache/uima/ducc/container/sd/task/iface/TaskProtocolHandler.java>:[33,25]
cannot find symbol
[ERROR] symbol:   class IMetaCasTransaction
[ERROR] location: interface org.apache.uima.ducc.container.sd.task.iface.TaskProtocolHandler
[ERROR] <https://builds.apache.org/job/UIMA-DUCC/ws/trunk/uima-ducc-pullservice/src/main/java/org/apache/uima/ducc/container/sd/task/TestTaskAllocatorCallbackListener.java>:[44,8]
org.apache.uima.ducc.container.sd.task.TestTaskAllocatorCallbackListener is not abstract and
does not override abstract method onTaskFailure(org.apache.uima.ducc.container.sd.task.iface.TaskConsumer,java.lang.String)
in org.apache.uima.ducc.container.sd.task.iface.TaskAllocatorCallbackListener
[ERROR] <https://builds.apache.org/job/UIMA-DUCC/ws/trunk/uima-ducc-pullservice/src/main/java/org/apache/uima/ducc/container/sd/task/SimpleTask.java>:[36,9]
method does not override or implement a method from a supertype
[ERROR] <https://builds.apache.org/job/UIMA-DUCC/ws/trunk/uima-ducc-pullservice/src/main/java/org/apache/uima/ducc/container/sd/task/SimpleTask.java>:[41,9]
method does not override or implement a method from a supertype
[ERROR] <https://builds.apache.org/job/UIMA-DUCC/ws/trunk/uima-ducc-pullservice/src/main/java/org/apache/uima/ducc/container/sd/task/DuccServiceTaskProtocolHandler.java>:[142,17]
cannot find symbol
[ERROR] symbol:   class ITask
[ERROR] location: class org.apache.uima.ducc.container.sd.task.DuccServiceTaskProtocolHandler
[ERROR] <https://builds.apache.org/job/UIMA-DUCC/ws/trunk/uima-ducc-pullservice/src/main/java/org/apache/uima/ducc/container/sd/task/DuccServiceTaskProtocolHandler.java>:[149,45]
cannot find symbol
[ERROR] symbol:   method getTask(org.apache.uima.ducc.container.sd.task.iface.TaskConsumer)
[ERROR] location: variable taskAllocator of type org.apache.uima.ducc.container.sd.task.iface.TaskAllocatorCallbackListener
[ERROR] <https://builds.apache.org/job/UIMA-DUCC/ws/trunk/uima-ducc-pullservice/src/main/java/org/apache/uima/ducc/container/sd/task/DuccServiceTaskProtocolHandler.java>:[198,38]
method onTaskFailure in interface org.apache.uima.ducc.container.sd.task.iface.TaskAllocatorCallbackListener
cannot be applied to given types;
[ERROR] required: org.apache.uima.ducc.container.sd.task.iface.TaskConsumer,java.lang.String
[ERROR] found: org.apache.uima.ducc.container.sd.task.iface.TaskConsumer,java.lang.String,java.lang.String
[ERROR] reason: actual and formal argument lists differ in length
[ERROR] <https://builds.apache.org/job/UIMA-DUCC/ws/trunk/uima-ducc-pullservice/src/main/java/org/apache/uima/ducc/container/sd/task/DuccServiceTaskProtocolHandler.java>:[206,38]
method onTaskSuccess in interface org.apache.uima.ducc.container.sd.task.iface.TaskAllocatorCallbackListener
cannot be applied to given types;
[ERROR] required: org.apache.uima.ducc.container.sd.task.iface.TaskConsumer,IPerformanceMetrics
[ERROR] found: org.apache.uima.ducc.container.sd.task.iface.TaskConsumer,java.lang.String,java.lang.String
[ERROR] reason: actual and formal argument lists differ in length
[ERROR] -> [Help 1]
[ERROR] 
[ERROR] To see the full stack trace of the errors, re-run Maven with the -e switch.
[ERROR] Re-run Maven using the -X switch to enable full debug logging.
[ERROR] 
[ERROR] For more information about the errors and possible solutions, please read the following
articles:
[ERROR] [Help 1] http://cwiki.apache.org/confluence/display/MAVEN/MojoFailureException
[ERROR] 
[ERROR] After correcting the problems, you can resume the build with the command
[ERROR]   mvn <goals> -rf :uima-ducc-pullservice
[JENKINS] Archiving <https://builds.apache.org/job/UIMA-DUCC/ws/trunk/uima-ducc-sm/pom.xml>
to org.apache.uima/uima-ducc-sm/2.2.3-SNAPSHOT/uima-ducc-sm-2.2.3-SNAPSHOT.pom
[Fast Archiver] No artifacts from UIMA-DUCC » Apache UIMA DUCC: uima-ducc-sm #1360 to compare,
so performing full copy of artifacts
[JENKINS] Archiving <https://builds.apache.org/job/UIMA-DUCC/ws/trunk/uima-ducc-parent/pom.xml>
to org.apache.uima/uima-ducc-parent/2.2.3-SNAPSHOT/uima-ducc-parent-2.2.3-SNAPSHOT.pom
[Fast Archiver] No artifacts from UIMA-DUCC » Apache UIMA DUCC: uima-ducc-parent #1361 to
compare, so performing full copy of artifacts
[JENKINS] Archiving <https://builds.apache.org/job/UIMA-DUCC/ws/trunk/uima-ducc-duccdocs/pom.xml>
to org.apache.uima/uima-ducc-duccdocs/2.2.3-SNAPSHOT/uima-ducc-duccdocs-2.2.3-SNAPSHOT.pom
[Fast Archiver] No artifacts from UIMA-DUCC » Apache UIMA DUCC: uima-ducc-duccdocs #1360
to compare, so performing full copy of artifacts
[JENKINS] Archiving <https://builds.apache.org/job/UIMA-DUCC/ws/trunk/uima-ducc-pullservice/pom.xml>
to org.apache.uima/uima-ducc-pullservice/2.2.3-SNAPSHOT/uima-ducc-pullservice-2.2.3-SNAPSHOT.pom
[Fast Archiver] No artifacts from UIMA-DUCC » Apache UIMA DUCC: uima-ducc-pullservice #1361
to compare, so performing full copy of artifacts
[JENKINS] Archiving <https://builds.apache.org/job/UIMA-DUCC/ws/trunk/uima-ducc-pm/pom.xml>
to org.apache.uima/uima-ducc-pm/2.2.3-SNAPSHOT/uima-ducc-pm-2.2.3-SNAPSHOT.pom
[Fast Archiver] No artifacts from UIMA-DUCC » Apache UIMA DUCC: uima-ducc-pm #1360 to compare,
so performing full copy of artifacts
[JENKINS] Archiving <https://builds.apache.org/job/UIMA-DUCC/ws/trunk/uima-ducc-database/pom.xml>
to org.apache.uima/uima-ducc-database/2.2.3-SNAPSHOT/uima-ducc-database-2.2.3-SNAPSHOT.pom
[Fast Archiver] No artifacts from UIMA-DUCC » Apache UIMA DUCC: uima-ducc-database #1360
to compare, so performing full copy of artifacts
[JENKINS] Archiving <https://builds.apache.org/job/UIMA-DUCC/ws/trunk/uima-ducc-rm/pom.xml>
to org.apache.uima/uima-ducc-rm/2.2.3-SNAPSHOT/uima-ducc-rm-2.2.3-SNAPSHOT.pom
[Fast Archiver] No artifacts from UIMA-DUCC » Apache UIMA DUCC: uima-ducc-rm #1360 to compare,
so performing full copy of artifacts
[JENKINS] Archiving <https://builds.apache.org/job/UIMA-DUCC/ws/trunk/uima-ducc-examples/pom.xml>
to org.apache.uima/uima-ducc-examples/2.2.3-SNAPSHOT/uima-ducc-examples-2.2.3-SNAPSHOT.pom
[JENKINS] Archiving <https://builds.apache.org/job/UIMA-DUCC/ws/trunk/uima-ducc-web/pom.xml>
to org.apache.uima/uima-ducc-web/2.2.3-SNAPSHOT/uima-ducc-web-2.2.3-SNAPSHOT.pom
[Fast Archiver] No artifacts from UIMA-DUCC » Apache UIMA DUCC: uima-ducc-web #1360 to compare,
so performing full copy of artifacts
[JENKINS] Archiving <https://builds.apache.org/job/UIMA-DUCC/ws/trunk/uima-ducc-container/pom.xml>
to org.apache.uima/uima-ducc-container/2.2.3-SNAPSHOT/uima-ducc-container-2.2.3-SNAPSHOT.pom
[Fast Archiver] No artifacts from UIMA-DUCC » Apache UIMA DUCC: uima-ducc-container #1361
to compare, so performing full copy of artifacts
[JENKINS] Archiving <https://builds.apache.org/job/UIMA-DUCC/ws/trunk/uima-ducc-spawn/pom.xml>
to org.apache.uima/uima-ducc-spawn/2.2.3-SNAPSHOT/uima-ducc-spawn-2.2.3-SNAPSHOT.pom
[JENKINS] Archiving <https://builds.apache.org/job/UIMA-DUCC/ws/trunk/uima-ducc-common/pom.xml>
to org.apache.uima/uima-ducc-common/2.2.3-SNAPSHOT/uima-ducc-common-2.2.3-SNAPSHOT.pom
[JENKINS] Archiving <https://builds.apache.org/job/UIMA-DUCC/ws/trunk/uima-ducc-common/target/uima-ducc-common-2.2.3-SNAPSHOT.jar>
to org.apache.uima/uima-ducc-common/2.2.3-SNAPSHOT/uima-ducc-common-2.2.3-SNAPSHOT.jar
[Fast Archiver] No artifacts from UIMA-DUCC » Apache UIMA DUCC: uima-ducc-common #1361 to
compare, so performing full copy of artifacts
[JENKINS] Archiving <https://builds.apache.org/job/UIMA-DUCC/ws/trunk/pom.xml> to org.apache.uima/uima-ducc/2.2.3-SNAPSHOT/uima-ducc-2.2.3-SNAPSHOT.pom
[JENKINS] Archiving <https://builds.apache.org/job/UIMA-DUCC/ws/trunk/uima-ducc-agent/pom.xml>
to org.apache.uima/uima-ducc-agent/2.2.3-SNAPSHOT/uima-ducc-agent-2.2.3-SNAPSHOT.pom
[Fast Archiver] No artifacts from UIMA-DUCC » Apache UIMA DUCC: uima-ducc-agent #1360 to
compare, so performing full copy of artifacts
[JENKINS] Archiving <https://builds.apache.org/job/UIMA-DUCC/ws/trunk/uima-ducc-user/pom.xml>
to org.apache.uima/uima-ducc-user/2.2.3-SNAPSHOT/uima-ducc-user-2.2.3-SNAPSHOT.pom
[JENKINS] Archiving <https://builds.apache.org/job/UIMA-DUCC/ws/trunk/uima-ducc-user/target/uima-ducc-user-2.2.3-SNAPSHOT.jar>
to org.apache.uima/uima-ducc-user/2.2.3-SNAPSHOT/uima-ducc-user-2.2.3-SNAPSHOT.jar
[Fast Archiver] No artifacts from UIMA-DUCC » Apache UIMA DUCC: uima-ducc-user #1361 to compare,
so performing full copy of artifacts
[JENKINS] Archiving <https://builds.apache.org/job/UIMA-DUCC/ws/trunk/uima-ducc-orchestrator/pom.xml>
to org.apache.uima/uima-ducc-orchestrator/2.2.3-SNAPSHOT/uima-ducc-orchestrator-2.2.3-SNAPSHOT.pom
[Fast Archiver] No artifacts from UIMA-DUCC » Apache UIMA DUCC: uima-ducc-orchestrator #1360
to compare, so performing full copy of artifacts
[JENKINS] Archiving <https://builds.apache.org/job/UIMA-DUCC/ws/trunk/uima-ducc-transport/pom.xml>
to org.apache.uima/uima-ducc-transport/2.2.3-SNAPSHOT/uima-ducc-transport-2.2.3-SNAPSHOT.pom
[Fast Archiver] No artifacts from UIMA-DUCC » Apache UIMA DUCC: uima-ducc-transport #1361
to compare, so performing full copy of artifacts
[JENKINS] Archiving <https://builds.apache.org/job/UIMA-DUCC/ws/trunk/uima-ducc-cli/pom.xml>
to org.apache.uima/uima-ducc-cli/2.2.3-SNAPSHOT/uima-ducc-cli-2.2.3-SNAPSHOT.pom
[Fast Archiver] No artifacts from UIMA-DUCC » Apache UIMA DUCC: uima-ducc-cli #1361 to compare,
so performing full copy of artifacts
Sending e-mails to: dev@uima.apache.org
channel stopped
[WARNINGS] Skipping publisher since build result is FAILURE

Mime
View raw message