uima-dev mailing list archives

Site index · List index
Message view « Date » · « Thread »
Top « Date » · « Thread »
From Apache Jenkins Server <jenk...@builds.apache.org>
Subject Build failed in Jenkins: UIMA-DUCC #1347
Date Tue, 01 May 2018 13:38:44 GMT
See <https://builds.apache.org/job/UIMA-DUCC/1347/display/redirect?page=changes>

Changes:

[cwiklik] UIMA-5756 added examples

[cwiklik] UIMA-5756 removed setErrorHandler()

[cwiklik] UIMA-5756 added httpclient and httpcore as dependencies

------------------------------------------
[...truncated 337.96 KB...]
UIMA-AS
unable to create user log appender
user log
work item monitor class
foobar
and away we go
CAS.id
CAS.size
changing core pool size to
client initialization complete
client initialization failed
client initialization in progress
client terminated
client termination failed
client terminating
collection reader initialization failed
creating driver thread
default
driver begin
driver end
driver init
enter
exit
file
from
host
invalid
job.broker
job.queue
kill thread for
no
not found
log directory
log directory (default)
pending job termination
pending processes termination
permits to force thread terminations
plist
process count
publishing state
received
releasing
removed queue
retry
retry attempts exhausted
running
seqNo
shares
size zero request ignored
terminate
terminate driver thread
terminating thread
thread
threads-per-share
UIMA-AS
unable to create user log appender
user log
work item monitor class
foobar
and away we go
CAS.id
CAS.size
changing core pool size to
client initialization complete
client initialization failed
client initialization in progress
client terminated
client termination failed
client terminating
collection reader initialization failed
creating driver thread
default
driver begin
driver end
driver init
enter
exit
file
from
host
invalid
job.broker
job.queue
kill thread for
no
not found
log directory
log directory (default)
pending job termination
pending processes termination
permits to force thread terminations
plist
process count
publishing state
received
releasing
removed queue
retry
retry attempts exhausted
running
seqNo
shares
size zero request ignored
terminate
terminate driver thread
terminating thread
thread
threads-per-share
UIMA-AS
unable to create user log appender
user log
work item monitor class
foobar
Tests run: 1, Failures: 0, Errors: 0, Skipped: 0, Time elapsed: 0.213 sec - in org.apache.uima.ducc.common.test.MessagesTest
Running org.apache.uima.ducc.common.test.CryptoTest
Tests run: 1, Failures: 0, Errors: 0, Skipped: 0, Time elapsed: 0.565 sec - in org.apache.uima.ducc.common.test.CryptoTest
Running org.apache.uima.ducc.common.test.SizeTest
Tests run: 1, Failures: 0, Errors: 0, Skipped: 0, Time elapsed: 0.002 sec - in org.apache.uima.ducc.common.test.SizeTest
Running org.apache.uima.ducc.common.test.MonitorInfoTest
Tests run: 6, Failures: 0, Errors: 0, Skipped: 0, Time elapsed: 0.004 sec - in org.apache.uima.ducc.common.test.MonitorInfoTest
 INFO | Cobertura: Loaded information on 372 classes.
 INFO | Cobertura: Saved information on 372 classes.

Results :

Tests run: 9, Failures: 0, Errors: 0, Skipped: 0

[JENKINS] Recording test results
[INFO] 
[INFO] <<< cobertura-maven-plugin:2.7:cobertura (default-cli) < [cobertura]test
@ uima-ducc-common <<<
[INFO] 
[INFO] --- cobertura-maven-plugin:2.7:cobertura (default-cli) @ uima-ducc-common ---
[INFO] Cobertura 2.1.1 - GNU GPL License (NO WARRANTY) - See COPYRIGHT file
[INFO] Cobertura: Loaded information on 372 classes.
Report time: 1192ms

[INFO] Cobertura Report generation was successful.
[INFO]                                                                         
[INFO] ------------------------------------------------------------------------
[INFO] Building Apache UIMA DUCC: uima-ducc-pullservice 2.2.3-SNAPSHOT
[INFO] ------------------------------------------------------------------------
[INFO] 
[INFO] --- maven-clean-plugin:2.5:clean (default-clean) @ uima-ducc-pullservice ---
[INFO] Deleting <https://builds.apache.org/job/UIMA-DUCC/ws/trunk/uima-ducc-pullservice/target>
[TASKS] Scanning folder '<https://builds.apache.org/job/UIMA-DUCC/ws/trunk/uima-ducc-pullservice'>
for files matching the pattern '**/*.java' - excludes: 
[TASKS] Found 77 files to scan for tasks
Found 14 open tasks.
[INFO] 
[INFO] --- maven-enforcer-plugin:1.3.1:enforce (enforce-versions) @ uima-ducc-pullservice
---
[INFO] 
[INFO] --- build-helper-maven-plugin:1.8:parse-version (parse-project-version) @ uima-ducc-pullservice
---
[INFO] 
[INFO] --- uima-build-helper-maven-plugin:7:parse-date-time (set buildYear and buildMonth)
@ uima-ducc-pullservice ---
[INFO] 
[INFO] --- buildnumber-maven-plugin:1.4:create (default) @ uima-ducc-pullservice ---
[INFO] Executing: /bin/sh -c cd '<https://builds.apache.org/job/UIMA-DUCC/ws/trunk/uima-ducc-pullservice'>
&& 'svn' '--non-interactive' 'info'
[INFO] Working directory: <https://builds.apache.org/job/UIMA-DUCC/ws/trunk/uima-ducc-pullservice>
[INFO] Storing buildNumber: 1830680 at timestamp: 1525181820589
[INFO] Executing: /bin/sh -c cd '<https://builds.apache.org/job/UIMA-DUCC/ws/trunk/uima-ducc-pullservice'>
&& 'svn' '--non-interactive' 'info'
[INFO] Working directory: <https://builds.apache.org/job/UIMA-DUCC/ws/trunk/uima-ducc-pullservice>
[INFO] Storing buildScmBranch: trunk
[INFO] 
[INFO] --- maven-remote-resources-plugin:1.5:process (default) @ uima-ducc-pullservice ---
[INFO] 
[INFO] --- maven-resources-plugin:2.6:resources (default-resources) @ uima-ducc-pullservice
---
[INFO] Using 'UTF-8' encoding to copy filtered resources.
[INFO] skip non existing resourceDirectory <https://builds.apache.org/job/UIMA-DUCC/ws/trunk/uima-ducc-pullservice/src/main/resources>
[INFO] Copying 3 resources
[INFO] 
[INFO] --- maven-compiler-plugin:3.1:compile (default-compile) @ uima-ducc-pullservice ---
[INFO] Changes detected - recompiling the module!
[INFO] Compiling 73 source files to <https://builds.apache.org/job/UIMA-DUCC/ws/trunk/uima-ducc-pullservice/target/classes>
[INFO] -------------------------------------------------------------
[WARNING] COMPILATION WARNING : 
[INFO] -------------------------------------------------------------
[WARNING] <https://builds.apache.org/job/UIMA-DUCC/ws/trunk/uima-ducc-pullservice/src/main/java/org/apache/uima/ducc/ps/service/processor/uima/utils/UimaResultDefaultSerializer.java>:
<https://builds.apache.org/job/UIMA-DUCC/ws/trunk/uima-ducc-pullservice/src/main/java/org/apache/uima/ducc/ps/service/processor/uima/utils/UimaResultDefaultSerializer.java>
uses unchecked or unsafe operations.
[WARNING] <https://builds.apache.org/job/UIMA-DUCC/ws/trunk/uima-ducc-pullservice/src/main/java/org/apache/uima/ducc/ps/service/processor/uima/utils/UimaResultDefaultSerializer.java>:
Recompile with -Xlint:unchecked for details.
[INFO] 2 warnings 
[INFO] -------------------------------------------------------------
[INFO] -------------------------------------------------------------
[ERROR] COMPILATION ERROR : 
[INFO] -------------------------------------------------------------
[ERROR] <https://builds.apache.org/job/UIMA-DUCC/ws/trunk/uima-ducc-pullservice/src/main/java/org/apache/uima/ducc/ps/service/processor/uima/UimaServiceProcessor.java>:[255,9]
method does not override or implement a method from a supertype
[INFO] 1 error
[INFO] -------------------------------------------------------------
[INFO] ------------------------------------------------------------------------
[INFO] Reactor Summary:
[INFO] 
[INFO] Apache UIMA DUCC: uima-ducc-parent ................. SUCCESS [01:44 min]
[INFO] Apache UIMA DUCC: uima-ducc-user ................... SUCCESS [03:28 min]
[INFO] Apache UIMA DUCC: uima-ducc-common ................. SUCCESS [02:08 min]
[INFO] Apache UIMA DUCC: uima-ducc-pullservice ............ FAILURE [ 12.459 s]
[INFO] Apache UIMA DUCC: uima-ducc-container .............. SKIPPED
[INFO] Apache UIMA DUCC: uima-ducc-transport .............. SKIPPED
[INFO] Apache UIMA DUCC: uima-ducc-cli .................... SKIPPED
[INFO] Apache UIMA DUCC: uima-ducc-pm ..................... SKIPPED
[INFO] Apache UIMA DUCC: uima-ducc-rm ..................... SKIPPED
[INFO] Apache UIMA DUCC: uima-ducc-sm ..................... SKIPPED
[INFO] Apache UIMA DUCC: uima-ducc-database ............... SKIPPED
[INFO] Apache UIMA DUCC: uima-ducc-orchestrator ........... SKIPPED
[INFO] Apache UIMA DUCC: uima-ducc-agent .................. SKIPPED
[INFO] Apache UIMA DUCC: uima-ducc-duccdocs ............... SKIPPED
[INFO] Apache UIMA DUCC: uima-ducc-web .................... SKIPPED
[INFO] Apache UIMA DUCC: uima-ducc-examples ............... SKIPPED
[INFO] Apache UIMA DUCC: uima-ducc-spawn .................. SKIPPED
[INFO] Apache UIMA-DUCC: uima-ducc ........................ SKIPPED
[INFO] ------------------------------------------------------------------------
[INFO] BUILD FAILURE
[INFO] ------------------------------------------------------------------------
[INFO] Total time: 08:19 min
[INFO] Finished at: 2018-05-01T13:37:24+00:00
[INFO] Final Memory: 102M/1147M
[INFO] ------------------------------------------------------------------------
[ERROR] Failed to execute goal org.apache.maven.plugins:maven-compiler-plugin:3.1:compile
(default-compile) on project uima-ducc-pullservice: Compilation failure
[ERROR] <https://builds.apache.org/job/UIMA-DUCC/ws/trunk/uima-ducc-pullservice/src/main/java/org/apache/uima/ducc/ps/service/processor/uima/UimaServiceProcessor.java>:[255,9]
method does not override or implement a method from a supertype
[ERROR] -> [Help 1]
[ERROR] 
[ERROR] To see the full stack trace of the errors, re-run Maven with the -e switch.
[ERROR] Re-run Maven using the -X switch to enable full debug logging.
[ERROR] 
[ERROR] For more information about the errors and possible solutions, please read the following
articles:
[ERROR] [Help 1] http://cwiki.apache.org/confluence/display/MAVEN/MojoFailureException
[ERROR] 
[ERROR] After correcting the problems, you can resume the build with the command
[ERROR]   mvn <goals> -rf :uima-ducc-pullservice
[JENKINS] Archiving <https://builds.apache.org/job/UIMA-DUCC/ws/trunk/uima-ducc-sm/pom.xml>
to org.apache.uima/uima-ducc-sm/2.2.3-SNAPSHOT/uima-ducc-sm-2.2.3-SNAPSHOT.pom
[JENKINS] Archiving <https://builds.apache.org/job/UIMA-DUCC/ws/trunk/uima-ducc-parent/pom.xml>
to org.apache.uima/uima-ducc-parent/2.2.3-SNAPSHOT/uima-ducc-parent-2.2.3-SNAPSHOT.pom
[JENKINS] Archiving <https://builds.apache.org/job/UIMA-DUCC/ws/trunk/uima-ducc-duccdocs/pom.xml>
to org.apache.uima/uima-ducc-duccdocs/2.2.3-SNAPSHOT/uima-ducc-duccdocs-2.2.3-SNAPSHOT.pom
[JENKINS] Archiving <https://builds.apache.org/job/UIMA-DUCC/ws/trunk/uima-ducc-pullservice/pom.xml>
to org.apache.uima/uima-ducc-pullservice/2.2.3-SNAPSHOT/uima-ducc-pullservice-2.2.3-SNAPSHOT.pom
[Fast Archiver] No prior successful build to compare, so performing full copy of artifacts
[JENKINS] Archiving <https://builds.apache.org/job/UIMA-DUCC/ws/trunk/uima-ducc-pm/pom.xml>
to org.apache.uima/uima-ducc-pm/2.2.3-SNAPSHOT/uima-ducc-pm-2.2.3-SNAPSHOT.pom
[JENKINS] Archiving <https://builds.apache.org/job/UIMA-DUCC/ws/trunk/uima-ducc-database/pom.xml>
to org.apache.uima/uima-ducc-database/2.2.3-SNAPSHOT/uima-ducc-database-2.2.3-SNAPSHOT.pom
[JENKINS] Archiving <https://builds.apache.org/job/UIMA-DUCC/ws/trunk/uima-ducc-rm/pom.xml>
to org.apache.uima/uima-ducc-rm/2.2.3-SNAPSHOT/uima-ducc-rm-2.2.3-SNAPSHOT.pom
[JENKINS] Archiving <https://builds.apache.org/job/UIMA-DUCC/ws/trunk/uima-ducc-examples/pom.xml>
to org.apache.uima/uima-ducc-examples/2.2.3-SNAPSHOT/uima-ducc-examples-2.2.3-SNAPSHOT.pom
[JENKINS] Archiving <https://builds.apache.org/job/UIMA-DUCC/ws/trunk/uima-ducc-web/pom.xml>
to org.apache.uima/uima-ducc-web/2.2.3-SNAPSHOT/uima-ducc-web-2.2.3-SNAPSHOT.pom
[JENKINS] Archiving <https://builds.apache.org/job/UIMA-DUCC/ws/trunk/uima-ducc-container/pom.xml>
to org.apache.uima/uima-ducc-container/2.2.3-SNAPSHOT/uima-ducc-container-2.2.3-SNAPSHOT.pom
[JENKINS] Archiving <https://builds.apache.org/job/UIMA-DUCC/ws/trunk/uima-ducc-spawn/pom.xml>
to org.apache.uima/uima-ducc-spawn/2.2.3-SNAPSHOT/uima-ducc-spawn-2.2.3-SNAPSHOT.pom
[JENKINS] Archiving <https://builds.apache.org/job/UIMA-DUCC/ws/trunk/uima-ducc-common/pom.xml>
to org.apache.uima/uima-ducc-common/2.2.3-SNAPSHOT/uima-ducc-common-2.2.3-SNAPSHOT.pom
[JENKINS] Archiving <https://builds.apache.org/job/UIMA-DUCC/ws/trunk/uima-ducc-common/target/uima-ducc-common-2.2.3-SNAPSHOT.jar>
to org.apache.uima/uima-ducc-common/2.2.3-SNAPSHOT/uima-ducc-common-2.2.3-SNAPSHOT.jar
[JENKINS] Archiving <https://builds.apache.org/job/UIMA-DUCC/ws/trunk/pom.xml> to org.apache.uima/uima-ducc/2.2.3-SNAPSHOT/uima-ducc-2.2.3-SNAPSHOT.pom
[JENKINS] Archiving <https://builds.apache.org/job/UIMA-DUCC/ws/trunk/uima-ducc-agent/pom.xml>
to org.apache.uima/uima-ducc-agent/2.2.3-SNAPSHOT/uima-ducc-agent-2.2.3-SNAPSHOT.pom
[JENKINS] Archiving <https://builds.apache.org/job/UIMA-DUCC/ws/trunk/uima-ducc-user/pom.xml>
to org.apache.uima/uima-ducc-user/2.2.3-SNAPSHOT/uima-ducc-user-2.2.3-SNAPSHOT.pom
[JENKINS] Archiving <https://builds.apache.org/job/UIMA-DUCC/ws/trunk/uima-ducc-user/target/uima-ducc-user-2.2.3-SNAPSHOT.jar>
to org.apache.uima/uima-ducc-user/2.2.3-SNAPSHOT/uima-ducc-user-2.2.3-SNAPSHOT.jar
[JENKINS] Archiving <https://builds.apache.org/job/UIMA-DUCC/ws/trunk/uima-ducc-orchestrator/pom.xml>
to org.apache.uima/uima-ducc-orchestrator/2.2.3-SNAPSHOT/uima-ducc-orchestrator-2.2.3-SNAPSHOT.pom
[JENKINS] Archiving <https://builds.apache.org/job/UIMA-DUCC/ws/trunk/uima-ducc-transport/pom.xml>
to org.apache.uima/uima-ducc-transport/2.2.3-SNAPSHOT/uima-ducc-transport-2.2.3-SNAPSHOT.pom
[JENKINS] Archiving <https://builds.apache.org/job/UIMA-DUCC/ws/trunk/uima-ducc-cli/pom.xml>
to org.apache.uima/uima-ducc-cli/2.2.3-SNAPSHOT/uima-ducc-cli-2.2.3-SNAPSHOT.pom
Sending e-mails to: dev@uima.apache.org
channel stopped
[WARNINGS] Skipping publisher since build result is FAILURE

Mime
View raw message