uima-dev mailing list archives

Site index · List index
Message view « Date » · « Thread »
Top « Date » · « Thread »
From Apache Jenkins Server <jenk...@builds.apache.org>
Subject Build failed in Jenkins: UIMA-DUCC #1369
Date Mon, 14 May 2018 13:22:35 GMT
See <https://builds.apache.org/job/UIMA-DUCC/1369/display/redirect>

------------------------------------------
Started by user cwiklik
[EnvInject] - Loading node environment variables.
Building remotely on H30 (ubuntu xenial) in workspace <https://builds.apache.org/job/UIMA-DUCC/ws/>
Updating https://svn.apache.org/repos/asf/uima/uima-ducc/trunk at revision '2018-05-14T13:22:24.721
+0000'
At revision 1831565

No changes for https://svn.apache.org/repos/asf/uima/uima-ducc/trunk since the previous build
Parsing POMs
ERROR: Failed to parse POMs
java.io.IOException: remote file operation failed: <https://builds.apache.org/job/UIMA-DUCC/ws/trunk>
at hudson.remoting.Channel@4dacd08e:H30: hudson.remoting.ProxyException: hudson.maven.MavenModuleSetBuild$MavenExecutionException:
org.apache.maven.project.ProjectBuildingException: Some problems were encountered while processing
the POMs:
[WARNING] 'dependencies.dependency.exclusions.exclusion.groupId' for org.apache.uima:uima-ducc-common:jar
with value '*' does not match a valid id pattern. @ line 68, column 14
[WARNING] 'dependencies.dependency.exclusions.exclusion.artifactId' for org.apache.uima:uima-ducc-common:jar
with value '*' does not match a valid id pattern. @ line 69, column 17
[WARNING] 'dependencies.dependency.exclusions.exclusion.groupId' for org.apache.uima:uima-ducc-transport:jar
with value '*' does not match a valid id pattern. @ line 80, column 14
[WARNING] 'dependencies.dependency.exclusions.exclusion.artifactId' for org.apache.uima:uima-ducc-transport:jar
with value '*' does not match a valid id pattern. @ line 81, column 17
[WARNING] 'dependencies.dependency.exclusions.exclusion.groupId' for org.apache.uima:uima-ducc-user:jar
with value '*' does not match a valid id pattern. @ line 91, column 14
[WARNING] 'dependencies.dependency.exclusions.exclusion.artifactId' for org.apache.uima:uima-ducc-user:jar
with value '*' does not match a valid id pattern. @ line 92, column 17
[ERROR] 'dependencies.dependency.version' for org.apache.uima:uimaj-examples:jar is missing.
@ line 39, column 17

	at hudson.FilePath.act(FilePath.java:993)
	at hudson.FilePath.act(FilePath.java:975)
	at hudson.maven.MavenModuleSetBuild$MavenModuleSetBuildExecution.parsePoms(MavenModuleSetBuild.java:986)
	at hudson.maven.MavenModuleSetBuild$MavenModuleSetBuildExecution.doRun(MavenModuleSetBuild.java:691)
	at hudson.model.AbstractBuild$AbstractBuildExecution.run(AbstractBuild.java:504)
	at hudson.model.Run.execute(Run.java:1724)
	at hudson.maven.MavenModuleSetBuild.run(MavenModuleSetBuild.java:543)
	at hudson.model.ResourceController.execute(ResourceController.java:97)
	at hudson.model.Executor.run(Executor.java:429)
Caused by: hudson.remoting.ProxyException: hudson.maven.MavenModuleSetBuild$MavenExecutionException:
org.apache.maven.project.ProjectBuildingException: Some problems were encountered while processing
the POMs:
[WARNING] 'dependencies.dependency.exclusions.exclusion.groupId' for org.apache.uima:uima-ducc-common:jar
with value '*' does not match a valid id pattern. @ line 68, column 14
[WARNING] 'dependencies.dependency.exclusions.exclusion.artifactId' for org.apache.uima:uima-ducc-common:jar
with value '*' does not match a valid id pattern. @ line 69, column 17
[WARNING] 'dependencies.dependency.exclusions.exclusion.groupId' for org.apache.uima:uima-ducc-transport:jar
with value '*' does not match a valid id pattern. @ line 80, column 14
[WARNING] 'dependencies.dependency.exclusions.exclusion.artifactId' for org.apache.uima:uima-ducc-transport:jar
with value '*' does not match a valid id pattern. @ line 81, column 17
[WARNING] 'dependencies.dependency.exclusions.exclusion.groupId' for org.apache.uima:uima-ducc-user:jar
with value '*' does not match a valid id pattern. @ line 91, column 14
[WARNING] 'dependencies.dependency.exclusions.exclusion.artifactId' for org.apache.uima:uima-ducc-user:jar
with value '*' does not match a valid id pattern. @ line 92, column 17
[ERROR] 'dependencies.dependency.version' for org.apache.uima:uimaj-examples:jar is missing.
@ line 39, column 17

	at hudson.maven.MavenModuleSetBuild$PomParser.invoke(MavenModuleSetBuild.java:1391)
	at hudson.maven.MavenModuleSetBuild$PomParser.invoke(MavenModuleSetBuild.java:1125)
	at hudson.FilePath$FileCallableWrapper.call(FilePath.java:2760)
	at hudson.remoting.UserRequest.perform(UserRequest.java:207)
	at hudson.remoting.UserRequest.perform(UserRequest.java:53)
	at hudson.remoting.Request$2.run(Request.java:358)
	at hudson.remoting.InterceptingExecutorService$1.call(InterceptingExecutorService.java:72)
	at java.util.concurrent.FutureTask.run(FutureTask.java:266)
	at java.util.concurrent.ThreadPoolExecutor.runWorker(ThreadPoolExecutor.java:1142)
	at java.util.concurrent.ThreadPoolExecutor$Worker.run(ThreadPoolExecutor.java:617)
	at java.lang.Thread.run(Thread.java:748)
	Suppressed: hudson.remoting.Channel$CallSiteStackTrace: Remote call to H30
		at hudson.remoting.Channel.attachCallSiteStackTrace(Channel.java:1693)
		at hudson.remoting.UserResponse.retrieve(UserRequest.java:310)
		at hudson.remoting.Channel.call(Channel.java:908)
		at hudson.FilePath.act(FilePath.java:986)
		at hudson.FilePath.act(FilePath.java:975)
		at hudson.maven.MavenModuleSetBuild$MavenModuleSetBuildExecution.parsePoms(MavenModuleSetBuild.java:986)
		at hudson.maven.MavenModuleSetBuild$MavenModuleSetBuildExecution.doRun(MavenModuleSetBuild.java:691)
		at hudson.model.AbstractBuild$AbstractBuildExecution.run(AbstractBuild.java:504)
		at hudson.model.Run.execute(Run.java:1724)
		at hudson.maven.MavenModuleSetBuild.run(MavenModuleSetBuild.java:543)
		at hudson.model.ResourceController.execute(ResourceController.java:97)
		at hudson.model.Executor.run(Executor.java:429)
Caused by: hudson.remoting.ProxyException: org.apache.maven.project.ProjectBuildingException:
Some problems were encountered while processing the POMs:
[WARNING] 'dependencies.dependency.exclusions.exclusion.groupId' for org.apache.uima:uima-ducc-common:jar
with value '*' does not match a valid id pattern. @ line 68, column 14
[WARNING] 'dependencies.dependency.exclusions.exclusion.artifactId' for org.apache.uima:uima-ducc-common:jar
with value '*' does not match a valid id pattern. @ line 69, column 17
[WARNING] 'dependencies.dependency.exclusions.exclusion.groupId' for org.apache.uima:uima-ducc-transport:jar
with value '*' does not match a valid id pattern. @ line 80, column 14
[WARNING] 'dependencies.dependency.exclusions.exclusion.artifactId' for org.apache.uima:uima-ducc-transport:jar
with value '*' does not match a valid id pattern. @ line 81, column 17
[WARNING] 'dependencies.dependency.exclusions.exclusion.groupId' for org.apache.uima:uima-ducc-user:jar
with value '*' does not match a valid id pattern. @ line 91, column 14
[WARNING] 'dependencies.dependency.exclusions.exclusion.artifactId' for org.apache.uima:uima-ducc-user:jar
with value '*' does not match a valid id pattern. @ line 92, column 17
[ERROR] 'dependencies.dependency.version' for org.apache.uima:uimaj-examples:jar is missing.
@ line 39, column 17

	at org.apache.maven.project.DefaultProjectBuilder.build(DefaultProjectBuilder.java:364)
	at hudson.maven.MavenEmbedder.buildProjects(MavenEmbedder.java:361)
	at hudson.maven.MavenEmbedder.readProjects(MavenEmbedder.java:331)
	at hudson.maven.MavenModuleSetBuild$PomParser.invoke(MavenModuleSetBuild.java:1328)
	... 10 more
[WARNINGS] Skipping publisher since build result is FAILURE

Mime
View raw message