uima-dev mailing list archives

Site index · List index
Message view « Date » · « Thread »
Top « Date » · « Thread »
From Apache Jenkins Server <jenk...@builds.apache.org>
Subject Build failed in Jenkins: UIMA-DUCC #1348
Date Tue, 01 May 2018 13:54:13 GMT
See <https://builds.apache.org/job/UIMA-DUCC/1348/display/redirect?page=changes>

Changes:

[cwiklik] UIMA-5756 removed override for setErrorHandler

------------------------------------------
[...truncated 61.91 KB...]
[INFO] --- maven-resources-plugin:2.6:testResources (default-testResources) @ uima-ducc-pullservice
---
[INFO] Using 'UTF-8' encoding to copy filtered resources.
[INFO] skip non existing resourceDirectory <https://builds.apache.org/job/UIMA-DUCC/ws/trunk/uima-ducc-pullservice/src/test/resources>
[INFO] Copying 3 resources
[INFO] 
[INFO] --- maven-compiler-plugin:3.1:testCompile (default-testCompile) @ uima-ducc-pullservice
---
[INFO] Changes detected - recompiling the module!
[INFO] Compiling 4 source files to <https://builds.apache.org/job/UIMA-DUCC/ws/trunk/uima-ducc-pullservice/target/test-classes>
[INFO] 
[INFO] --- maven-surefire-plugin:2.16:test (default-test) @ uima-ducc-pullservice ---
[JENKINS] Recording test results
[INFO] 
[INFO] --- maven-antrun-plugin:1.7:run (dup-meta-jar-cleanup) @ uima-ducc-pullservice ---
[INFO] Executing tasks

main:
[INFO] Executed tasks
[INFO] 
[INFO] --- maven-jar-plugin:2.3.2:jar (default-jar) @ uima-ducc-pullservice ---
[INFO] Building jar: <https://builds.apache.org/job/UIMA-DUCC/ws/trunk/uima-ducc-pullservice/target/uima-ducc-pullservice-2.2.3-SNAPSHOT.jar>
[INFO] 
[INFO] --- maven-site-plugin:3.3:attach-descriptor (attach-descriptor) @ uima-ducc-pullservice
---
[INFO] 
[INFO] --- maven-install-plugin:2.5.1:install (default-install) @ uima-ducc-pullservice ---
[INFO] Installing <https://builds.apache.org/job/UIMA-DUCC/ws/trunk/uima-ducc-pullservice/target/uima-ducc-pullservice-2.2.3-SNAPSHOT.jar>
to /home/jenkins/jenkins-slave/maven-repositories/0/org/apache/uima/uima-ducc-pullservice/2.2.3-SNAPSHOT/uima-ducc-pullservice-2.2.3-SNAPSHOT.jar
[INFO] Installing <https://builds.apache.org/job/UIMA-DUCC/ws/trunk/uima-ducc-pullservice/pom.xml>
to /home/jenkins/jenkins-slave/maven-repositories/0/org/apache/uima/uima-ducc-pullservice/2.2.3-SNAPSHOT/uima-ducc-pullservice-2.2.3-SNAPSHOT.pom
[INFO] 
[INFO] --- maven-pmd-plugin:3.8:pmd (default-cli) @ uima-ducc-pullservice ---
[PMD] Searching for all files in <https://builds.apache.org/job/UIMA-DUCC/ws/trunk/uima-ducc-pullservice/target>
that match the pattern pmd.xml
[PMD] Parsing 1 file in <https://builds.apache.org/job/UIMA-DUCC/ws/trunk/uima-ducc-pullservice/target>
[PMD] Successfully parsed file <https://builds.apache.org/job/UIMA-DUCC/ws/trunk/uima-ducc-pullservice/target/pmd.xml>
of module Apache UIMA DUCC: uima-ducc-pullservice with 130 unique warnings and 0 duplicates.
[INFO] 
[INFO] --- maven-pmd-plugin:3.8:cpd (default-cli) @ uima-ducc-pullservice ---
[DRY] Searching for all files in <https://builds.apache.org/job/UIMA-DUCC/ws/trunk/uima-ducc-pullservice/target>
that match the pattern cpd.xml
[DRY] Parsing 1 file in <https://builds.apache.org/job/UIMA-DUCC/ws/trunk/uima-ducc-pullservice/target>
[DRY] Successfully parsed file <https://builds.apache.org/job/UIMA-DUCC/ws/trunk/uima-ducc-pullservice/target/cpd.xml>
of module Apache UIMA DUCC: uima-ducc-pullservice with 0 unique warnings and 0 duplicates.
[INFO] 
[INFO] --- findbugs-maven-plugin:3.0.5:findbugs (default-cli) @ uima-ducc-pullservice ---
[INFO] Fork Value is true
     [java] Warnings generated: 24
[INFO] Done FindBugs Analysis....
[FINDBUGS] Searching for all files in <https://builds.apache.org/job/UIMA-DUCC/ws/trunk/uima-ducc-pullservice/target>
that match the pattern findbugsXml.xml
[FINDBUGS] Parsing 1 file in <https://builds.apache.org/job/UIMA-DUCC/ws/trunk/uima-ducc-pullservice/target>
[FINDBUGS] Successfully parsed file <https://builds.apache.org/job/UIMA-DUCC/ws/trunk/uima-ducc-pullservice/target/findbugsXml.xml>
of module Apache UIMA DUCC: uima-ducc-pullservice with 24 unique warnings and 0 duplicates.
[INFO] 
[INFO] >>> cobertura-maven-plugin:2.7:cobertura (default-cli) > [cobertura]test
@ uima-ducc-pullservice >>>
[INFO] 
[INFO] --- maven-enforcer-plugin:1.3.1:enforce (enforce-versions) @ uima-ducc-pullservice
---
[INFO] 
[INFO] --- build-helper-maven-plugin:1.8:parse-version (parse-project-version) @ uima-ducc-pullservice
---
[INFO] 
[INFO] --- uima-build-helper-maven-plugin:7:parse-date-time (set buildYear and buildMonth)
@ uima-ducc-pullservice ---
[INFO] 
[INFO] --- buildnumber-maven-plugin:1.4:create (default) @ uima-ducc-pullservice ---
[INFO] Executing: /bin/sh -c cd '<https://builds.apache.org/job/UIMA-DUCC/ws/trunk/uima-ducc-pullservice'>
&& 'svn' '--non-interactive' 'info'
[INFO] Working directory: <https://builds.apache.org/job/UIMA-DUCC/ws/trunk/uima-ducc-pullservice>
[INFO] Storing buildNumber: 1830682 at timestamp: 1525182714428
[INFO] Executing: /bin/sh -c cd '<https://builds.apache.org/job/UIMA-DUCC/ws/trunk/uima-ducc-pullservice'>
&& 'svn' '--non-interactive' 'info'
[INFO] Working directory: <https://builds.apache.org/job/UIMA-DUCC/ws/trunk/uima-ducc-pullservice>
[INFO] Storing buildScmBranch: trunk
[INFO] 
[INFO] --- maven-remote-resources-plugin:1.5:process (default) @ uima-ducc-pullservice ---
[INFO] 
[INFO] --- maven-resources-plugin:2.6:resources (default-resources) @ uima-ducc-pullservice
---
[INFO] Using 'UTF-8' encoding to copy filtered resources.
[INFO] skip non existing resourceDirectory <https://builds.apache.org/job/UIMA-DUCC/ws/trunk/uima-ducc-pullservice/src/main/resources>
[INFO] Copying 3 resources
[INFO] Copying 3 resources
[INFO] 
[INFO] --- maven-compiler-plugin:3.1:compile (default-compile) @ uima-ducc-pullservice ---
[INFO] Nothing to compile - all classes are up to date
[INFO] 
[INFO] --- cobertura-maven-plugin:2.7:instrument (default-cli) @ uima-ducc-pullservice ---
[INFO] Cobertura 2.1.1 - GNU GPL License (NO WARRANTY) - See COPYRIGHT file
[INFO] Cobertura: Saved information on 93 classes.
[INFO] Cobertura: Saved information on 93 classes.

[INFO] Instrumentation was successful.
[INFO] NOT adding cobertura ser file to attached artifacts list.
[INFO] 
[INFO] --- maven-resources-plugin:2.6:testResources (default-testResources) @ uima-ducc-pullservice
---
[INFO] Using 'UTF-8' encoding to copy filtered resources.
[INFO] skip non existing resourceDirectory <https://builds.apache.org/job/UIMA-DUCC/ws/trunk/uima-ducc-pullservice/src/test/resources>
[INFO] Copying 3 resources
[INFO] Copying 3 resources
[INFO] 
[INFO] --- maven-compiler-plugin:3.1:testCompile (default-testCompile) @ uima-ducc-pullservice
---
[INFO] Nothing to compile - all classes are up to date
[INFO] 
[INFO] --- maven-surefire-plugin:2.16:test (default-test) @ uima-ducc-pullservice ---
[JENKINS] Recording test results
[INFO] 
[INFO] <<< cobertura-maven-plugin:2.7:cobertura (default-cli) < [cobertura]test
@ uima-ducc-pullservice <<<
[INFO] 
[INFO] --- cobertura-maven-plugin:2.7:cobertura (default-cli) @ uima-ducc-pullservice ---
[INFO] Cobertura 2.1.1 - GNU GPL License (NO WARRANTY) - See COPYRIGHT file
[INFO] Cobertura: Loaded information on 93 classes.
Report time: 575ms

[INFO] Cobertura Report generation was successful.
[INFO]                                                                         
[INFO] ------------------------------------------------------------------------
[INFO] Building Apache UIMA DUCC: uima-ducc-container 2.2.3-SNAPSHOT
[INFO] ------------------------------------------------------------------------
[WARNING] The POM for org.eclipse.m2e:lifecycle-mapping:jar:1.0.0 is missing, no dependency
information available
[WARNING] Failed to retrieve plugin descriptor for org.eclipse.m2e:lifecycle-mapping:1.0.0:
Plugin org.eclipse.m2e:lifecycle-mapping:1.0.0 or one of its dependencies could not be resolved:
Failure to find org.eclipse.m2e:lifecycle-mapping:jar:1.0.0 in https://repo.maven.apache.org/maven2
was cached in the local repository, resolution will not be reattempted until the update interval
of central has elapsed or updates are forced
[WARNING] The POM for org.eclipse.m2e:lifecycle-mapping:jar:1.0.0 is missing, no dependency
information available
[WARNING] Failed to retrieve plugin descriptor for org.eclipse.m2e:lifecycle-mapping:1.0.0:
Plugin org.eclipse.m2e:lifecycle-mapping:1.0.0 or one of its dependencies could not be resolved:
Failure to find org.eclipse.m2e:lifecycle-mapping:jar:1.0.0 in https://repo.maven.apache.org/maven2
was cached in the local repository, resolution will not be reattempted until the update interval
of central has elapsed or updates are forced
[WARNING] The POM for org.eclipse.m2e:lifecycle-mapping:jar:1.0.0 is missing, no dependency
information available
[WARNING] Failed to retrieve plugin descriptor for org.eclipse.m2e:lifecycle-mapping:1.0.0:
Plugin org.eclipse.m2e:lifecycle-mapping:1.0.0 or one of its dependencies could not be resolved:
Failure to find org.eclipse.m2e:lifecycle-mapping:jar:1.0.0 in https://repo.maven.apache.org/maven2
was cached in the local repository, resolution will not be reattempted until the update interval
of central has elapsed or updates are forced
[WARNING] The POM for org.eclipse.m2e:lifecycle-mapping:jar:1.0.0 is missing, no dependency
information available
[WARNING] Failed to retrieve plugin descriptor for org.eclipse.m2e:lifecycle-mapping:1.0.0:
Plugin org.eclipse.m2e:lifecycle-mapping:1.0.0 or one of its dependencies could not be resolved:
Failure to find org.eclipse.m2e:lifecycle-mapping:jar:1.0.0 in https://repo.maven.apache.org/maven2
was cached in the local repository, resolution will not be reattempted until the update interval
of central has elapsed or updates are forced
[INFO] 
[INFO] --- maven-clean-plugin:2.5:clean (default-clean) @ uima-ducc-container ---
[TASKS] Scanning folder '<https://builds.apache.org/job/UIMA-DUCC/ws/trunk/uima-ducc-container'>
for files matching the pattern '**/*.java' - excludes: 
[TASKS] Found 183 files to scan for tasks
Found 18 open tasks.
[TASKS] Computing warning deltas based on reference build #1345
[INFO] 
[INFO] --- maven-enforcer-plugin:1.3.1:enforce (enforce-versions) @ uima-ducc-container ---
[INFO] 
[INFO] --- build-helper-maven-plugin:1.8:parse-version (parse-project-version) @ uima-ducc-container
---
[INFO] 
[INFO] --- uima-build-helper-maven-plugin:7:parse-date-time (set buildYear and buildMonth)
@ uima-ducc-container ---
[INFO] 
[INFO] --- buildnumber-maven-plugin:1.4:create (default) @ uima-ducc-container ---
[INFO] Executing: /bin/sh -c cd '<https://builds.apache.org/job/UIMA-DUCC/ws/trunk/uima-ducc-container'>
&& 'svn' '--non-interactive' 'info'
[INFO] Working directory: <https://builds.apache.org/job/UIMA-DUCC/ws/trunk/uima-ducc-container>
[INFO] Storing buildNumber: 1830682 at timestamp: 1525182748574
[INFO] Executing: /bin/sh -c cd '<https://builds.apache.org/job/UIMA-DUCC/ws/trunk/uima-ducc-container'>
&& 'svn' '--non-interactive' 'info'
[INFO] Working directory: <https://builds.apache.org/job/UIMA-DUCC/ws/trunk/uima-ducc-container>
[INFO] Storing buildScmBranch: trunk
[INFO] 
[INFO] --- maven-remote-resources-plugin:1.5:process (default) @ uima-ducc-container ---
[INFO] 
[INFO] --- maven-resources-plugin:2.6:resources (default-resources) @ uima-ducc-container
---
[INFO] Using 'UTF-8' encoding to copy filtered resources.
[INFO] Copying 0 resource
[INFO] Copying 3 resources
[INFO] 
[INFO] --- maven-compiler-plugin:3.1:compile (default-compile) @ uima-ducc-container ---
[INFO] Changes detected - recompiling the module!
[INFO] Compiling 157 source files to <https://builds.apache.org/job/UIMA-DUCC/ws/trunk/uima-ducc-container/target/classes>
[INFO] -------------------------------------------------------------
[ERROR] COMPILATION ERROR : 
[INFO] -------------------------------------------------------------
[ERROR] <https://builds.apache.org/job/UIMA-DUCC/ws/trunk/uima-ducc-container/src/main/java/org/apache/uima/ducc/container/sd/task/iface/TaskAllocatorCallbackListener.java>:[23,16]
cannot find symbol
  symbol:   class ITask
  location: interface org.apache.uima.ducc.container.sd.task.iface.TaskAllocatorCallbackListener
[ERROR] <https://builds.apache.org/job/UIMA-DUCC/ws/trunk/uima-ducc-container/src/main/java/org/apache/uima/ducc/container/sd/task/DuccServiceTaskProtocolHandler.java>:[38,52]
cannot find symbol
  symbol:   class ITask
  location: package org.apache.uima.ducc.container.sd.task.iface
[ERROR] <https://builds.apache.org/job/UIMA-DUCC/ws/trunk/uima-ducc-container/src/main/java/org/apache/uima/ducc/container/sd/task/TestTaskAllocatorCallbackListener.java>:[33,52]
cannot find symbol
  symbol:   class ITask
  location: package org.apache.uima.ducc.container.sd.task.iface
[ERROR] <https://builds.apache.org/job/UIMA-DUCC/ws/trunk/uima-ducc-container/src/main/java/org/apache/uima/ducc/container/sd/task/TestTaskAllocatorCallbackListener.java>:[63,16]
cannot find symbol
  symbol:   class ITask
  location: class org.apache.uima.ducc.container.sd.task.TestTaskAllocatorCallbackListener
[ERROR] <https://builds.apache.org/job/UIMA-DUCC/ws/trunk/uima-ducc-container/src/main/java/org/apache/uima/ducc/container/sd/task/DuccServiceTaskProtocolHandler.java>:[140,17]
cannot find symbol
  symbol:   class ITask
  location: class org.apache.uima.ducc.container.sd.task.DuccServiceTaskProtocolHandler
[ERROR] <https://builds.apache.org/job/UIMA-DUCC/ws/trunk/uima-ducc-container/src/main/java/org/apache/uima/ducc/container/sd/task/TestTaskAllocatorCallbackListener.java>:[94,28]
cannot find symbol
  symbol:   class SimpleTask
  location: class org.apache.uima.ducc.container.sd.task.TestTaskAllocatorCallbackListener
[INFO] 6 errors 
[INFO] -------------------------------------------------------------
[INFO] ------------------------------------------------------------------------
[INFO] Reactor Summary:
[INFO] 
[INFO] Apache UIMA DUCC: uima-ducc-parent ................. SUCCESS [01:40 min]
[INFO] Apache UIMA DUCC: uima-ducc-user ................... SUCCESS [03:14 min]
[INFO] Apache UIMA DUCC: uima-ducc-common ................. SUCCESS [02:10 min]
[INFO] Apache UIMA DUCC: uima-ducc-pullservice ............ SUCCESS [01:12 min]
[INFO] Apache UIMA DUCC: uima-ducc-container .............. FAILURE [ 14.858 s]
[INFO] Apache UIMA DUCC: uima-ducc-transport .............. SKIPPED
[INFO] Apache UIMA DUCC: uima-ducc-cli .................... SKIPPED
[INFO] Apache UIMA DUCC: uima-ducc-pm ..................... SKIPPED
[INFO] Apache UIMA DUCC: uima-ducc-rm ..................... SKIPPED
[INFO] Apache UIMA DUCC: uima-ducc-sm ..................... SKIPPED
[INFO] Apache UIMA DUCC: uima-ducc-database ............... SKIPPED
[INFO] Apache UIMA DUCC: uima-ducc-orchestrator ........... SKIPPED
[INFO] Apache UIMA DUCC: uima-ducc-agent .................. SKIPPED
[INFO] Apache UIMA DUCC: uima-ducc-duccdocs ............... SKIPPED
[INFO] Apache UIMA DUCC: uima-ducc-web .................... SKIPPED
[INFO] Apache UIMA DUCC: uima-ducc-examples ............... SKIPPED
[INFO] Apache UIMA DUCC: uima-ducc-spawn .................. SKIPPED
[INFO] Apache UIMA-DUCC: uima-ducc ........................ SKIPPED
[INFO] ------------------------------------------------------------------------
[INFO] BUILD FAILURE
[INFO] ------------------------------------------------------------------------
[INFO] Total time: 09:31 min
[INFO] Finished at: 2018-05-01T13:52:55+00:00
[INFO] Final Memory: 101M/1149M
[INFO] ------------------------------------------------------------------------
[ERROR] Failed to execute goal org.apache.maven.plugins:maven-compiler-plugin:3.1:compile
(default-compile) on project uima-ducc-container: Compilation failure: Compilation failure:
[ERROR] <https://builds.apache.org/job/UIMA-DUCC/ws/trunk/uima-ducc-container/src/main/java/org/apache/uima/ducc/container/sd/task/iface/TaskAllocatorCallbackListener.java>:[23,16]
cannot find symbol
[ERROR] symbol:   class ITask
[ERROR] location: interface org.apache.uima.ducc.container.sd.task.iface.TaskAllocatorCallbackListener
[ERROR] <https://builds.apache.org/job/UIMA-DUCC/ws/trunk/uima-ducc-container/src/main/java/org/apache/uima/ducc/container/sd/task/DuccServiceTaskProtocolHandler.java>:[38,52]
cannot find symbol
[ERROR] symbol:   class ITask
[ERROR] location: package org.apache.uima.ducc.container.sd.task.iface
[ERROR] <https://builds.apache.org/job/UIMA-DUCC/ws/trunk/uima-ducc-container/src/main/java/org/apache/uima/ducc/container/sd/task/TestTaskAllocatorCallbackListener.java>:[33,52]
cannot find symbol
[ERROR] symbol:   class ITask
[ERROR] location: package org.apache.uima.ducc.container.sd.task.iface
[ERROR] <https://builds.apache.org/job/UIMA-DUCC/ws/trunk/uima-ducc-container/src/main/java/org/apache/uima/ducc/container/sd/task/TestTaskAllocatorCallbackListener.java>:[63,16]
cannot find symbol
[ERROR] symbol:   class ITask
[ERROR] location: class org.apache.uima.ducc.container.sd.task.TestTaskAllocatorCallbackListener
[ERROR] <https://builds.apache.org/job/UIMA-DUCC/ws/trunk/uima-ducc-container/src/main/java/org/apache/uima/ducc/container/sd/task/DuccServiceTaskProtocolHandler.java>:[140,17]
cannot find symbol
[ERROR] symbol:   class ITask
[ERROR] location: class org.apache.uima.ducc.container.sd.task.DuccServiceTaskProtocolHandler
[ERROR] <https://builds.apache.org/job/UIMA-DUCC/ws/trunk/uima-ducc-container/src/main/java/org/apache/uima/ducc/container/sd/task/TestTaskAllocatorCallbackListener.java>:[94,28]
cannot find symbol
[ERROR] symbol:   class SimpleTask
[ERROR] location: class org.apache.uima.ducc.container.sd.task.TestTaskAllocatorCallbackListener
[ERROR] -> [Help 1]
[ERROR] 
[ERROR] To see the full stack trace of the errors, re-run Maven with the -e switch.
[ERROR] Re-run Maven using the -X switch to enable full debug logging.
[ERROR] 
[ERROR] For more information about the errors and possible solutions, please read the following
articles:
[ERROR] [Help 1] http://cwiki.apache.org/confluence/display/MAVEN/MojoFailureException
[ERROR] 
[ERROR] After correcting the problems, you can resume the build with the command
[ERROR]   mvn <goals> -rf :uima-ducc-container
[JENKINS] Archiving <https://builds.apache.org/job/UIMA-DUCC/ws/trunk/uima-ducc-sm/pom.xml>
to org.apache.uima/uima-ducc-sm/2.2.3-SNAPSHOT/uima-ducc-sm-2.2.3-SNAPSHOT.pom
[JENKINS] Archiving <https://builds.apache.org/job/UIMA-DUCC/ws/trunk/uima-ducc-parent/pom.xml>
to org.apache.uima/uima-ducc-parent/2.2.3-SNAPSHOT/uima-ducc-parent-2.2.3-SNAPSHOT.pom
[JENKINS] Archiving <https://builds.apache.org/job/UIMA-DUCC/ws/trunk/uima-ducc-duccdocs/pom.xml>
to org.apache.uima/uima-ducc-duccdocs/2.2.3-SNAPSHOT/uima-ducc-duccdocs-2.2.3-SNAPSHOT.pom
[JENKINS] Archiving <https://builds.apache.org/job/UIMA-DUCC/ws/trunk/uima-ducc-pullservice/pom.xml>
to org.apache.uima/uima-ducc-pullservice/2.2.3-SNAPSHOT/uima-ducc-pullservice-2.2.3-SNAPSHOT.pom
[JENKINS] Archiving <https://builds.apache.org/job/UIMA-DUCC/ws/trunk/uima-ducc-pullservice/target/uima-ducc-pullservice-2.2.3-SNAPSHOT.jar>
to org.apache.uima/uima-ducc-pullservice/2.2.3-SNAPSHOT/uima-ducc-pullservice-2.2.3-SNAPSHOT.jar
[Fast Archiver] No prior successful build to compare, so performing full copy of artifacts
[JENKINS] Archiving <https://builds.apache.org/job/UIMA-DUCC/ws/trunk/uima-ducc-pm/pom.xml>
to org.apache.uima/uima-ducc-pm/2.2.3-SNAPSHOT/uima-ducc-pm-2.2.3-SNAPSHOT.pom
[JENKINS] Archiving <https://builds.apache.org/job/UIMA-DUCC/ws/trunk/uima-ducc-database/pom.xml>
to org.apache.uima/uima-ducc-database/2.2.3-SNAPSHOT/uima-ducc-database-2.2.3-SNAPSHOT.pom
[JENKINS] Archiving <https://builds.apache.org/job/UIMA-DUCC/ws/trunk/uima-ducc-rm/pom.xml>
to org.apache.uima/uima-ducc-rm/2.2.3-SNAPSHOT/uima-ducc-rm-2.2.3-SNAPSHOT.pom
[JENKINS] Archiving <https://builds.apache.org/job/UIMA-DUCC/ws/trunk/uima-ducc-examples/pom.xml>
to org.apache.uima/uima-ducc-examples/2.2.3-SNAPSHOT/uima-ducc-examples-2.2.3-SNAPSHOT.pom
[JENKINS] Archiving <https://builds.apache.org/job/UIMA-DUCC/ws/trunk/uima-ducc-web/pom.xml>
to org.apache.uima/uima-ducc-web/2.2.3-SNAPSHOT/uima-ducc-web-2.2.3-SNAPSHOT.pom
[JENKINS] Archiving <https://builds.apache.org/job/UIMA-DUCC/ws/trunk/uima-ducc-container/pom.xml>
to org.apache.uima/uima-ducc-container/2.2.3-SNAPSHOT/uima-ducc-container-2.2.3-SNAPSHOT.pom
[JENKINS] Archiving <https://builds.apache.org/job/UIMA-DUCC/ws/trunk/uima-ducc-spawn/pom.xml>
to org.apache.uima/uima-ducc-spawn/2.2.3-SNAPSHOT/uima-ducc-spawn-2.2.3-SNAPSHOT.pom
[JENKINS] Archiving <https://builds.apache.org/job/UIMA-DUCC/ws/trunk/uima-ducc-common/pom.xml>
to org.apache.uima/uima-ducc-common/2.2.3-SNAPSHOT/uima-ducc-common-2.2.3-SNAPSHOT.pom
[JENKINS] Archiving <https://builds.apache.org/job/UIMA-DUCC/ws/trunk/uima-ducc-common/target/uima-ducc-common-2.2.3-SNAPSHOT.jar>
to org.apache.uima/uima-ducc-common/2.2.3-SNAPSHOT/uima-ducc-common-2.2.3-SNAPSHOT.jar
[JENKINS] Archiving <https://builds.apache.org/job/UIMA-DUCC/ws/trunk/pom.xml> to org.apache.uima/uima-ducc/2.2.3-SNAPSHOT/uima-ducc-2.2.3-SNAPSHOT.pom
[JENKINS] Archiving <https://builds.apache.org/job/UIMA-DUCC/ws/trunk/uima-ducc-agent/pom.xml>
to org.apache.uima/uima-ducc-agent/2.2.3-SNAPSHOT/uima-ducc-agent-2.2.3-SNAPSHOT.pom
[JENKINS] Archiving <https://builds.apache.org/job/UIMA-DUCC/ws/trunk/uima-ducc-user/pom.xml>
to org.apache.uima/uima-ducc-user/2.2.3-SNAPSHOT/uima-ducc-user-2.2.3-SNAPSHOT.pom
[JENKINS] Archiving <https://builds.apache.org/job/UIMA-DUCC/ws/trunk/uima-ducc-user/target/uima-ducc-user-2.2.3-SNAPSHOT.jar>
to org.apache.uima/uima-ducc-user/2.2.3-SNAPSHOT/uima-ducc-user-2.2.3-SNAPSHOT.jar
[JENKINS] Archiving <https://builds.apache.org/job/UIMA-DUCC/ws/trunk/uima-ducc-orchestrator/pom.xml>
to org.apache.uima/uima-ducc-orchestrator/2.2.3-SNAPSHOT/uima-ducc-orchestrator-2.2.3-SNAPSHOT.pom
[JENKINS] Archiving <https://builds.apache.org/job/UIMA-DUCC/ws/trunk/uima-ducc-transport/pom.xml>
to org.apache.uima/uima-ducc-transport/2.2.3-SNAPSHOT/uima-ducc-transport-2.2.3-SNAPSHOT.pom
[JENKINS] Archiving <https://builds.apache.org/job/UIMA-DUCC/ws/trunk/uima-ducc-cli/pom.xml>
to org.apache.uima/uima-ducc-cli/2.2.3-SNAPSHOT/uima-ducc-cli-2.2.3-SNAPSHOT.pom
Sending e-mails to: dev@uima.apache.org
Sending e-mails to: dev@uima.apache.org
channel stopped
[WARNINGS] Skipping publisher since build result is FAILURE

Mime
View raw message