uima-dev mailing list archives

Site index · List index
Message view « Date » · « Thread »
Top « Date » · « Thread »
From Apache Jenkins Server <jenk...@builds.apache.org>
Subject Build failed in Jenkins: UIMA-Ruta-v3 » Apache UIMA Ruta: ruta-core #47
Date Sat, 07 Jul 2018 23:49:30 GMT
See <https://builds.apache.org/job/UIMA-Ruta-v3/org.apache.uima$ruta-core/47/display/redirect>

------------------------------------------
[INFO]                                                                         
[INFO] ------------------------------------------------------------------------
[INFO] Building Apache UIMA Ruta: ruta-core 3.0.0-SNAPSHOT
[INFO] ------------------------------------------------------------------------
[INFO] Downloading: http://repository.apache.org/snapshots/org/apache/uima/uimafit-core/3.0.0-SNAPSHOT/maven-metadata.xml
[INFO] Downloaded: http://repository.apache.org/snapshots/org/apache/uima/uimafit-core/3.0.0-SNAPSHOT/maven-metadata.xml
(780 B at 2.6 KB/sec)
[INFO] Downloading: http://repository.apache.org/snapshots/org/apache/uima/uimafit-core/3.0.0-SNAPSHOT/uimafit-core-3.0.0-20180707.234019-74.pom
[INFO] Downloaded: http://repository.apache.org/snapshots/org/apache/uima/uimafit-core/3.0.0-SNAPSHOT/uimafit-core-3.0.0-20180707.234019-74.pom
(7 KB at 21.3 KB/sec)
[INFO] Downloading: http://repository.apache.org/snapshots/org/apache/uima/uimafit-parent/3.0.0-SNAPSHOT/maven-metadata.xml
[INFO] Downloaded: http://repository.apache.org/snapshots/org/apache/uima/uimafit-parent/3.0.0-SNAPSHOT/maven-metadata.xml
(608 B at 2.1 KB/sec)
[INFO] Downloading: http://repository.apache.org/snapshots/org/apache/uima/uimafit-parent/3.0.0-SNAPSHOT/uimafit-parent-3.0.0-20180707.234109-72.pom
[INFO] Downloaded: http://repository.apache.org/snapshots/org/apache/uima/uimafit-parent/3.0.0-SNAPSHOT/uimafit-parent-3.0.0-20180707.234109-72.pom
(14 KB at 46.9 KB/sec)
[INFO] Downloading: http://repository.apache.org/snapshots/org/apache/uima/uimafit-core/3.0.0-SNAPSHOT/uimafit-core-3.0.0-20180707.234019-74.jar
[INFO] Downloaded: http://repository.apache.org/snapshots/org/apache/uima/uimafit-core/3.0.0-SNAPSHOT/uimafit-core-3.0.0-20180707.234019-74.jar
(168 KB at 347.5 KB/sec)
[INFO] 
[INFO] --- maven-clean-plugin:2.5:clean (default-clean) @ ruta-core ---
[TASKS] Scanning folder '<https://builds.apache.org/job/UIMA-Ruta-v3/org.apache.uima$ruta-core/ws/'>
for files matching the pattern '**/*.java' - excludes: 
[TASKS] Found 490 files to scan for tasks
Found 67 open tasks.
[TASKS] Computing warning deltas based on reference build #46
[INFO] 
[INFO] --- maven-enforcer-plugin:1.3.1:enforce (enforce-versions) @ ruta-core ---
[INFO] 
[INFO] --- build-helper-maven-plugin:1.8:parse-version (parse-project-version) @ ruta-core
---
[INFO] 
[INFO] --- uima-build-helper-maven-plugin:7:parse-date-time (set buildYear and buildMonth)
@ ruta-core ---
[INFO] 
[INFO] --- antlr3-maven-plugin:3.5.2:antlr (run antlr) @ ruta-core ---
[INFO] ANTLR: Processing source directory <https://builds.apache.org/job/UIMA-Ruta-v3/org.apache.uima$ruta-core/ws/src/main/antlr3>
ANTLR Parser Generator  Version 3.5.2
Output file <https://builds.apache.org/job/UIMA-Ruta-v3/org.apache.uima$ruta-core/ws/target/generated-sources/antlr3/org/apache/uima/ruta/parser/RutaLexer.java>
does not exist: must build <https://builds.apache.org/job/UIMA-Ruta-v3/org.apache.uima$ruta-core/ws/src/main/antlr3/org/apache/uima/ruta/parser/RutaLexer.g>
org/apache/uima/ruta/parser/RutaLexer.g
Output file <https://builds.apache.org/job/UIMA-Ruta-v3/org.apache.uima$ruta-core/ws/target/generated-sources/antlr3/org/apache/uima/ruta/parser/RutaParser.java>
does not exist: must build <https://builds.apache.org/job/UIMA-Ruta-v3/org.apache.uima$ruta-core/ws/src/main/antlr3/org/apache/uima/ruta/parser/RutaParser.g>
org/apache/uima/ruta/parser/RutaParser.g
[INFO] 
[INFO] --- build-helper-maven-plugin:1.8:add-source (add-source) @ ruta-core ---
[INFO] Source directory: <https://builds.apache.org/job/UIMA-Ruta-v3/org.apache.uima$ruta-core/ws/target/generated-sources/antlr3>
added.
[INFO] 
[INFO] --- maven-remote-resources-plugin:1.5:process (default) @ ruta-core ---
[INFO] 
[INFO] --- maven-resources-plugin:2.6:resources (default-resources) @ ruta-core ---
[INFO] Using 'UTF-8' encoding to copy filtered resources.
[INFO] Copying 14 resources
[INFO] Copying 3 resources
[INFO] 
[INFO] --- maven-compiler-plugin:3.1:compile (default-compile) @ ruta-core ---
[INFO] Changes detected - recompiling the module!
[INFO] Compiling 307 source files to <https://builds.apache.org/job/UIMA-Ruta-v3/org.apache.uima$ruta-core/ws/target/classes>
[INFO] -------------------------------------------------------------
[WARNING] COMPILATION WARNING : 
[INFO] -------------------------------------------------------------
[WARNING] <https://builds.apache.org/job/UIMA-Ruta-v3/org.apache.uima$ruta-core/ws/src/main/java/org/apache/uima/ruta/engine/Ruta.java>:
<https://builds.apache.org/job/UIMA-Ruta-v3/org.apache.uima$ruta-core/ws/src/main/java/org/apache/uima/ruta/engine/Ruta.java>
uses or overrides a deprecated API.
[WARNING] <https://builds.apache.org/job/UIMA-Ruta-v3/org.apache.uima$ruta-core/ws/src/main/java/org/apache/uima/ruta/engine/Ruta.java>:
Recompile with -Xlint:deprecation for details.
[WARNING] <https://builds.apache.org/job/UIMA-Ruta-v3/org.apache.uima$ruta-core/ws/target/generated-sources/antlr3/org/apache/uima/ruta/parser/RutaParser.java>:
Some input files use unchecked or unsafe operations.
[WARNING] <https://builds.apache.org/job/UIMA-Ruta-v3/org.apache.uima$ruta-core/ws/target/generated-sources/antlr3/org/apache/uima/ruta/parser/RutaParser.java>:
Recompile with -Xlint:unchecked for details.
[INFO] 4 warnings 
[INFO] -------------------------------------------------------------
[INFO] -------------------------------------------------------------
[ERROR] COMPILATION ERROR : 
[INFO] -------------------------------------------------------------
[ERROR] <https://builds.apache.org/job/UIMA-Ruta-v3/org.apache.uima$ruta-core/ws/src/main/java/org/apache/uima/ruta/RutaStream.java>:[1033,56]
no suitable method found for createStringArray(org.apache.uima.cas.CAS,java.util.List<java.lang.String>)
    method org.apache.uima.fit.util.FSCollectionFactory.createStringArray(org.apache.uima.jcas.JCas,java.util.Collection<java.lang.String>)
is not applicable
      (argument mismatch; org.apache.uima.cas.CAS cannot be converted to org.apache.uima.jcas.JCas)
    method org.apache.uima.fit.util.FSCollectionFactory.createStringArray(org.apache.uima.jcas.JCas,java.lang.String...)
is not applicable
      (argument mismatch; org.apache.uima.cas.CAS cannot be converted to org.apache.uima.jcas.JCas)
[ERROR] <https://builds.apache.org/job/UIMA-Ruta-v3/org.apache.uima$ruta-core/ws/src/main/java/org/apache/uima/ruta/RutaStream.java>:[1038,50]
no suitable method found for createStringArray(org.apache.uima.cas.CAS,java.lang.String[])
    method org.apache.uima.fit.util.FSCollectionFactory.createStringArray(org.apache.uima.jcas.JCas,java.util.Collection<java.lang.String>)
is not applicable
      (argument mismatch; org.apache.uima.cas.CAS cannot be converted to org.apache.uima.jcas.JCas)
    method org.apache.uima.fit.util.FSCollectionFactory.createStringArray(org.apache.uima.jcas.JCas,java.lang.String...)
is not applicable
      (argument mismatch; org.apache.uima.cas.CAS cannot be converted to org.apache.uima.jcas.JCas)
[ERROR] <https://builds.apache.org/job/UIMA-Ruta-v3/org.apache.uima$ruta-core/ws/src/main/java/org/apache/uima/ruta/RutaStream.java>:[1060,47]
no suitable method found for createIntArray(org.apache.uima.cas.CAS,int[])
    method org.apache.uima.fit.util.FSCollectionFactory.createIntArray(org.apache.uima.jcas.JCas,java.util.Collection<java.lang.Integer>)
is not applicable
      (argument mismatch; org.apache.uima.cas.CAS cannot be converted to org.apache.uima.jcas.JCas)
    method org.apache.uima.fit.util.FSCollectionFactory.createIntArray(org.apache.uima.jcas.JCas,int...)
is not applicable
      (argument mismatch; org.apache.uima.cas.CAS cannot be converted to org.apache.uima.jcas.JCas)
[ERROR] <https://builds.apache.org/job/UIMA-Ruta-v3/org.apache.uima$ruta-core/ws/src/main/java/org/apache/uima/ruta/RutaStream.java>:[1065,47]
no suitable method found for createIntArray(org.apache.uima.cas.CAS,int[])
    method org.apache.uima.fit.util.FSCollectionFactory.createIntArray(org.apache.uima.jcas.JCas,java.util.Collection<java.lang.Integer>)
is not applicable
      (argument mismatch; org.apache.uima.cas.CAS cannot be converted to org.apache.uima.jcas.JCas)
    method org.apache.uima.fit.util.FSCollectionFactory.createIntArray(org.apache.uima.jcas.JCas,int...)
is not applicable
      (argument mismatch; org.apache.uima.cas.CAS cannot be converted to org.apache.uima.jcas.JCas)
[ERROR] <https://builds.apache.org/job/UIMA-Ruta-v3/org.apache.uima$ruta-core/ws/src/main/java/org/apache/uima/ruta/RutaStream.java>:[1078,50]
no suitable method found for createDoubleArray(org.apache.uima.cas.CAS,double[])
    method org.apache.uima.fit.util.FSCollectionFactory.createDoubleArray(org.apache.uima.jcas.JCas,java.util.Collection<java.lang.Double>)
is not applicable
      (argument mismatch; org.apache.uima.cas.CAS cannot be converted to org.apache.uima.jcas.JCas)
    method org.apache.uima.fit.util.FSCollectionFactory.createDoubleArray(org.apache.uima.jcas.JCas,double...)
is not applicable
      (argument mismatch; org.apache.uima.cas.CAS cannot be converted to org.apache.uima.jcas.JCas)
[ERROR] <https://builds.apache.org/job/UIMA-Ruta-v3/org.apache.uima$ruta-core/ws/src/main/java/org/apache/uima/ruta/RutaStream.java>:[1083,50]
no suitable method found for createDoubleArray(org.apache.uima.cas.CAS,double[])
    method org.apache.uima.fit.util.FSCollectionFactory.createDoubleArray(org.apache.uima.jcas.JCas,java.util.Collection<java.lang.Double>)
is not applicable
      (argument mismatch; org.apache.uima.cas.CAS cannot be converted to org.apache.uima.jcas.JCas)
    method org.apache.uima.fit.util.FSCollectionFactory.createDoubleArray(org.apache.uima.jcas.JCas,double...)
is not applicable
      (argument mismatch; org.apache.uima.cas.CAS cannot be converted to org.apache.uima.jcas.JCas)
[ERROR] <https://builds.apache.org/job/UIMA-Ruta-v3/org.apache.uima$ruta-core/ws/src/main/java/org/apache/uima/ruta/RutaStream.java>:[1097,49]
no suitable method found for createFloatArray(org.apache.uima.cas.CAS,float[])
    method org.apache.uima.fit.util.FSCollectionFactory.createFloatArray(org.apache.uima.jcas.JCas,java.util.Collection<java.lang.Float>)
is not applicable
      (argument mismatch; org.apache.uima.cas.CAS cannot be converted to org.apache.uima.jcas.JCas)
    method org.apache.uima.fit.util.FSCollectionFactory.createFloatArray(org.apache.uima.jcas.JCas,float...)
is not applicable
      (argument mismatch; org.apache.uima.cas.CAS cannot be converted to org.apache.uima.jcas.JCas)
[ERROR] <https://builds.apache.org/job/UIMA-Ruta-v3/org.apache.uima$ruta-core/ws/src/main/java/org/apache/uima/ruta/RutaStream.java>:[1102,49]
no suitable method found for createFloatArray(org.apache.uima.cas.CAS,float[])
    method org.apache.uima.fit.util.FSCollectionFactory.createFloatArray(org.apache.uima.jcas.JCas,java.util.Collection<java.lang.Float>)
is not applicable
      (argument mismatch; org.apache.uima.cas.CAS cannot be converted to org.apache.uima.jcas.JCas)
    method org.apache.uima.fit.util.FSCollectionFactory.createFloatArray(org.apache.uima.jcas.JCas,float...)
is not applicable
      (argument mismatch; org.apache.uima.cas.CAS cannot be converted to org.apache.uima.jcas.JCas)
[ERROR] <https://builds.apache.org/job/UIMA-Ruta-v3/org.apache.uima$ruta-core/ws/src/main/java/org/apache/uima/ruta/RutaStream.java>:[1116,51]
no suitable method found for createBooleanArray(org.apache.uima.cas.CAS,java.util.List<java.lang.Boolean>)
    method org.apache.uima.fit.util.FSCollectionFactory.createBooleanArray(org.apache.uima.jcas.JCas,java.util.Collection<java.lang.Boolean>)
is not applicable
      (argument mismatch; org.apache.uima.cas.CAS cannot be converted to org.apache.uima.jcas.JCas)
    method org.apache.uima.fit.util.FSCollectionFactory.createBooleanArray(org.apache.uima.jcas.JCas,boolean...)
is not applicable
      (argument mismatch; org.apache.uima.cas.CAS cannot be converted to org.apache.uima.jcas.JCas)
[ERROR] <https://builds.apache.org/job/UIMA-Ruta-v3/org.apache.uima$ruta-core/ws/src/main/java/org/apache/uima/ruta/RutaStream.java>:[1121,51]
no suitable method found for createBooleanArray(org.apache.uima.cas.CAS,boolean[])
    method org.apache.uima.fit.util.FSCollectionFactory.createBooleanArray(org.apache.uima.jcas.JCas,java.util.Collection<java.lang.Boolean>)
is not applicable
      (argument mismatch; org.apache.uima.cas.CAS cannot be converted to org.apache.uima.jcas.JCas)
    method org.apache.uima.fit.util.FSCollectionFactory.createBooleanArray(org.apache.uima.jcas.JCas,boolean...)
is not applicable
      (argument mismatch; org.apache.uima.cas.CAS cannot be converted to org.apache.uima.jcas.JCas)
[INFO] 10 errors 
[INFO] -------------------------------------------------------------

Mime
View raw message