uima-dev mailing list archives

Site index · List index
Message view « Date » · « Thread »
Top « Date » · « Thread »
From Apache Jenkins Server <jenk...@builds.apache.org>
Subject Build failed in Jenkins: UIMA-Ruta-v3 » Apache UIMA Ruta: ruta-core #53
Date Wed, 25 Jul 2018 13:21:45 GMT
See <https://builds.apache.org/job/UIMA-Ruta-v3/org.apache.uima$ruta-core/53/display/redirect>

------------------------------------------
[...truncated 3.02 KB...]
[INFO] Downloaded: http://repo1.maven.org/maven2/xmlunit/xmlunit/1.6/xmlunit-1.6.pom (3 KB
at 65.1 KB/sec)
[INFO] Downloading: http://repo1.maven.org/eclipse/org/apache/commons/commons-lang3/3.4/commons-lang3-3.4.pom
[INFO] Downloading: http://repo1.maven.org/maven2/org/apache/commons/commons-lang3/3.4/commons-lang3-3.4.pom
[INFO] Downloaded: http://repo1.maven.org/maven2/org/apache/commons/commons-lang3/3.4/commons-lang3-3.4.pom
(22 KB at 1031.6 KB/sec)
[INFO] Downloading: http://repo1.maven.org/eclipse/org/apache/commons/commons-parent/37/commons-parent-37.pom
[INFO] Downloading: http://repo1.maven.org/maven2/org/apache/commons/commons-parent/37/commons-parent-37.pom
[INFO] Downloaded: http://repo1.maven.org/maven2/org/apache/commons/commons-parent/37/commons-parent-37.pom
(62 KB at 2367.9 KB/sec)
[INFO] Downloading: http://repository.apache.org/snapshots/org/apache/uima/uimafit-core/3.0.0-SNAPSHOT/maven-metadata.xml
[INFO] Downloaded: http://repository.apache.org/snapshots/org/apache/uima/uimafit-core/3.0.0-SNAPSHOT/maven-metadata.xml
(780 B at 2.4 KB/sec)
[INFO] Downloading: http://repository.apache.org/snapshots/org/apache/uima/uimafit-core/3.0.0-SNAPSHOT/uimafit-core-3.0.0-20180725.131408-80.pom
[INFO] Downloaded: http://repository.apache.org/snapshots/org/apache/uima/uimafit-core/3.0.0-SNAPSHOT/uimafit-core-3.0.0-20180725.131408-80.pom
(7 KB at 22.6 KB/sec)
[INFO] Downloading: http://repository.apache.org/snapshots/org/apache/uima/uimafit-parent/3.0.0-SNAPSHOT/maven-metadata.xml
[INFO] Downloaded: http://repository.apache.org/snapshots/org/apache/uima/uimafit-parent/3.0.0-SNAPSHOT/maven-metadata.xml
(608 B at 2.0 KB/sec)
[INFO] Downloading: http://repository.apache.org/snapshots/org/apache/uima/uimafit-parent/3.0.0-SNAPSHOT/uimafit-parent-3.0.0-20180725.131500-78.pom
[INFO] Downloaded: http://repository.apache.org/snapshots/org/apache/uima/uimafit-parent/3.0.0-SNAPSHOT/uimafit-parent-3.0.0-20180725.131500-78.pom
(14 KB at 47.1 KB/sec)
[INFO] Downloading: http://repo1.maven.org/eclipse/commons-lang/commons-lang/2.6/commons-lang-2.6.pom
[INFO] Downloading: http://repo1.maven.org/maven2/commons-lang/commons-lang/2.6/commons-lang-2.6.pom
[INFO] Downloaded: http://repo1.maven.org/maven2/commons-lang/commons-lang/2.6/commons-lang-2.6.pom
(18 KB at 776.5 KB/sec)
[INFO] Downloading: http://repo1.maven.org/eclipse/org/apache/commons/commons-parent/17/commons-parent-17.pom
[INFO] Downloading: http://repo1.maven.org/maven2/org/apache/commons/commons-parent/17/commons-parent-17.pom
[INFO] Downloaded: http://repo1.maven.org/maven2/org/apache/commons/commons-parent/17/commons-parent-17.pom
(31 KB at 1384.3 KB/sec)
[INFO] Downloading: http://repo1.maven.org/eclipse/org/apache/uima/uimaj-core/3.0.0/uimaj-core-3.0.0.pom
[INFO] Downloading: http://repo1.maven.org/maven2/org/apache/uima/uimaj-core/3.0.0/uimaj-core-3.0.0.pom
[INFO] Downloaded: http://repo1.maven.org/maven2/org/apache/uima/uimaj-core/3.0.0/uimaj-core-3.0.0.pom
(14 KB at 507.5 KB/sec)
[INFO] Downloading: http://repo1.maven.org/eclipse/org/apache/uima/uimaj-parent/3.0.0/uimaj-parent-3.0.0.pom
[INFO] Downloading: http://repo1.maven.org/maven2/org/apache/uima/uimaj-parent/3.0.0/uimaj-parent-3.0.0.pom
[INFO] Downloaded: http://repo1.maven.org/maven2/org/apache/uima/uimaj-parent/3.0.0/uimaj-parent-3.0.0.pom
(18 KB at 776.5 KB/sec)
[INFO] Downloading: http://repo1.maven.org/eclipse/org/apache/uima/parent-pom/11/parent-pom-11.pom
[INFO] Downloading: http://repo1.maven.org/maven2/org/apache/uima/parent-pom/11/parent-pom-11.pom
[INFO] Downloaded: http://repo1.maven.org/maven2/org/apache/uima/parent-pom/11/parent-pom-11.pom
(123 KB at 3720.5 KB/sec)
[INFO] Downloading: http://repo1.maven.org/eclipse/org/springframework/spring-core/3.2.16.RELEASE/spring-core-3.2.16.RELEASE.pom
[INFO] Downloading: http://repo1.maven.org/maven2/org/springframework/spring-core/3.2.16.RELEASE/spring-core-3.2.16.RELEASE.pom
[INFO] Downloaded: http://repo1.maven.org/maven2/org/springframework/spring-core/3.2.16.RELEASE/spring-core-3.2.16.RELEASE.pom
(3 KB at 131.3 KB/sec)
[INFO] Downloading: http://repo1.maven.org/eclipse/commons-logging/commons-logging/1.1.3/commons-logging-1.1.3.pom
[INFO] Downloading: http://repo1.maven.org/maven2/commons-logging/commons-logging/1.1.3/commons-logging-1.1.3.pom
[INFO] Downloaded: http://repo1.maven.org/maven2/commons-logging/commons-logging/1.1.3/commons-logging-1.1.3.pom
(18 KB at 896.1 KB/sec)
[INFO] Downloading: http://repo1.maven.org/eclipse/org/apache/commons/commons-parent/28/commons-parent-28.pom
[INFO] Downloading: http://repo1.maven.org/maven2/org/apache/commons/commons-parent/28/commons-parent-28.pom
[INFO] Downloaded: http://repo1.maven.org/maven2/org/apache/commons/commons-parent/28/commons-parent-28.pom
(49 KB at 2040.6 KB/sec)
[INFO] Downloading: http://repo1.maven.org/eclipse/org/springframework/spring-context/3.2.16.RELEASE/spring-context-3.2.16.RELEASE.pom
[INFO] Downloading: http://repo1.maven.org/maven2/org/springframework/spring-context/3.2.16.RELEASE/spring-context-3.2.16.RELEASE.pom
[INFO] Downloaded: http://repo1.maven.org/maven2/org/springframework/spring-context/3.2.16.RELEASE/spring-context-3.2.16.RELEASE.pom
(5 KB at 282.1 KB/sec)
[INFO] Downloading: http://repo1.maven.org/eclipse/org/springframework/spring-beans/3.2.16.RELEASE/spring-beans-3.2.16.RELEASE.pom
[INFO] Downloading: http://repo1.maven.org/maven2/org/springframework/spring-beans/3.2.16.RELEASE/spring-beans-3.2.16.RELEASE.pom
[INFO] Downloaded: http://repo1.maven.org/maven2/org/springframework/spring-beans/3.2.16.RELEASE/spring-beans-3.2.16.RELEASE.pom
(2 KB at 112.0 KB/sec)
[INFO] Downloading: http://repo1.maven.org/eclipse/org/springframework/spring-expression/3.2.16.RELEASE/spring-expression-3.2.16.RELEASE.pom
[INFO] Downloading: http://repo1.maven.org/maven2/org/springframework/spring-expression/3.2.16.RELEASE/spring-expression-3.2.16.RELEASE.pom
[INFO] Downloaded: http://repo1.maven.org/maven2/org/springframework/spring-expression/3.2.16.RELEASE/spring-expression-3.2.16.RELEASE.pom
(2 KB at 91.6 KB/sec)
[INFO] Downloading: http://repo1.maven.org/eclipse/org/apache/commons/commons-math3/3.0/commons-math3-3.0.pom
[INFO] Downloading: http://repo1.maven.org/maven2/org/apache/commons/commons-math3/3.0/commons-math3-3.0.pom
[INFO] Downloaded: http://repo1.maven.org/maven2/org/apache/commons/commons-math3/3.0/commons-math3-3.0.pom
(12 KB at 665.8 KB/sec)
[INFO] Downloading: http://repo1.maven.org/eclipse/org/apache/commons/commons-parent/23/commons-parent-23.pom
[INFO] Downloading: http://repo1.maven.org/maven2/org/apache/commons/commons-parent/23/commons-parent-23.pom
[INFO] Downloaded: http://repo1.maven.org/maven2/org/apache/commons/commons-parent/23/commons-parent-23.pom
(44 KB at 1807.0 KB/sec)
[INFO] Downloading: http://repo1.maven.org/eclipse/org/slf4j/slf4j-jdk14/1.7.24/slf4j-jdk14-1.7.24.pom
[INFO] Downloading: http://repo1.maven.org/maven2/org/slf4j/slf4j-jdk14/1.7.24/slf4j-jdk14-1.7.24.pom
[INFO] Downloaded: http://repo1.maven.org/maven2/org/slf4j/slf4j-jdk14/1.7.24/slf4j-jdk14-1.7.24.pom
(1008 B at 57.9 KB/sec)
[INFO] Downloading: http://repo1.maven.org/eclipse/org/antlr/antlr-runtime/3.5.2/antlr-runtime-3.5.2.jar
[INFO] Downloading: http://repo1.maven.org/eclipse/org/htmlparser/htmlparser/1.6/htmlparser-1.6.jar
[INFO] Downloading: http://repo1.maven.org/eclipse/org/apache/uima/uimaj-test-util/3.0.0-beta/uimaj-test-util-3.0.0-beta.jar
[INFO] Downloading: http://repo1.maven.org/eclipse/xmlunit/xmlunit/1.6/xmlunit-1.6.jar
[INFO] Downloading: http://repo1.maven.org/eclipse/org/apache/commons/commons-lang3/3.4/commons-lang3-3.4.jar
[INFO] Downloading: http://repo1.maven.org/eclipse/commons-lang/commons-lang/2.6/commons-lang-2.6.jar
[INFO] Downloading: http://repo1.maven.org/eclipse/org/springframework/spring-core/3.2.16.RELEASE/spring-core-3.2.16.RELEASE.jar
[INFO] Downloading: http://repo1.maven.org/eclipse/commons-logging/commons-logging/1.1.3/commons-logging-1.1.3.jar
[INFO] Downloading: http://repo1.maven.org/eclipse/org/springframework/spring-context/3.2.16.RELEASE/spring-context-3.2.16.RELEASE.jar
[INFO] Downloading: http://repo1.maven.org/eclipse/org/springframework/spring-expression/3.2.16.RELEASE/spring-expression-3.2.16.RELEASE.jar
[INFO] Downloading: http://repo1.maven.org/eclipse/org/springframework/spring-beans/3.2.16.RELEASE/spring-beans-3.2.16.RELEASE.jar
[INFO] Downloading: http://repo1.maven.org/eclipse/commons-io/commons-io/2.4/commons-io-2.4.jar
[INFO] Downloading: http://repo1.maven.org/eclipse/org/apache/commons/commons-math3/3.0/commons-math3-3.0.jar
[INFO] Downloading: http://repo1.maven.org/eclipse/org/slf4j/slf4j-jdk14/1.7.24/slf4j-jdk14-1.7.24.jar
[INFO] Downloading: http://repo1.maven.org/maven2/org/antlr/antlr-runtime/3.5.2/antlr-runtime-3.5.2.jar
[INFO] Downloading: http://repo1.maven.org/maven2/org/htmlparser/htmlparser/1.6/htmlparser-1.6.jar
[INFO] Downloading: http://repo1.maven.org/maven2/xmlunit/xmlunit/1.6/xmlunit-1.6.jar
[INFO] Downloading: http://repo1.maven.org/maven2/org/apache/uima/uimaj-test-util/3.0.0-beta/uimaj-test-util-3.0.0-beta.jar
[INFO] Downloading: http://repo1.maven.org/maven2/org/apache/commons/commons-lang3/3.4/commons-lang3-3.4.jar
[INFO] Downloaded: http://repo1.maven.org/maven2/xmlunit/xmlunit/1.6/xmlunit-1.6.jar (99 KB
at 3189.0 KB/sec)
[INFO] Downloading: http://repo1.maven.org/maven2/commons-lang/commons-lang/2.6/commons-lang-2.6.jar
[INFO] Downloaded: http://repo1.maven.org/maven2/org/antlr/antlr-runtime/3.5.2/antlr-runtime-3.5.2.jar
(164 KB at 5119.7 KB/sec)
[INFO] Downloading: http://repo1.maven.org/maven2/org/springframework/spring-core/3.2.16.RELEASE/spring-core-3.2.16.RELEASE.jar
[INFO] Downloaded: http://repo1.maven.org/maven2/org/htmlparser/htmlparser/1.6/htmlparser-1.6.jar
(282 KB at 7403.8 KB/sec)
[INFO] Downloading: http://repo1.maven.org/maven2/commons-logging/commons-logging/1.1.3/commons-logging-1.1.3.jar
[INFO] Downloaded: http://repo1.maven.org/maven2/commons-logging/commons-logging/1.1.3/commons-logging-1.1.3.jar
(61 KB at 1165.3 KB/sec)
[INFO] Downloading: http://repo1.maven.org/maven2/org/springframework/spring-context/3.2.16.RELEASE/spring-context-3.2.16.RELEASE.jar
[INFO] Downloaded: http://repo1.maven.org/maven2/org/apache/commons/commons-lang3/3.4/commons-lang3-3.4.jar
(425 KB at 8009.2 KB/sec)
[INFO] Downloading: http://repo1.maven.org/maven2/org/springframework/spring-expression/3.2.16.RELEASE/spring-expression-3.2.16.RELEASE.jar
[INFO] Downloaded: http://repo1.maven.org/maven2/commons-lang/commons-lang/2.6/commons-lang-2.6.jar
(278 KB at 4869.4 KB/sec)
[INFO] Downloading: http://repo1.maven.org/maven2/org/springframework/spring-beans/3.2.16.RELEASE/spring-beans-3.2.16.RELEASE.jar
[INFO] Downloaded: http://repo1.maven.org/maven2/org/springframework/spring-expression/3.2.16.RELEASE/spring-expression-3.2.16.RELEASE.jar
(192 KB at 2493.0 KB/sec)
[INFO] Downloaded: http://repo1.maven.org/maven2/org/springframework/spring-core/3.2.16.RELEASE/spring-core-3.2.16.RELEASE.jar
(866 KB at 11092.7 KB/sec)
[INFO] Downloading: http://repo1.maven.org/maven2/commons-io/commons-io/2.4/commons-io-2.4.jar
[INFO] Downloading: http://repo1.maven.org/maven2/org/apache/commons/commons-math3/3.0/commons-math3-3.0.jar
[INFO] Downloaded: http://repo1.maven.org/maven2/commons-io/commons-io/2.4/commons-io-2.4.jar
(181 KB at 1903.2 KB/sec)
[INFO] Downloading: http://repo1.maven.org/maven2/org/slf4j/slf4j-jdk14/1.7.24/slf4j-jdk14-1.7.24.jar
[INFO] Downloaded: http://repo1.maven.org/maven2/org/springframework/spring-beans/3.2.16.RELEASE/spring-beans-3.2.16.RELEASE.jar
(600 KB at 5713.9 KB/sec)
[INFO] Downloaded: http://repo1.maven.org/maven2/org/slf4j/slf4j-jdk14/1.7.24/slf4j-jdk14-1.7.24.jar
(9 KB at 75.1 KB/sec)
[INFO] Downloaded: http://repo1.maven.org/maven2/org/springframework/spring-context/3.2.16.RELEASE/spring-context-3.2.16.RELEASE.jar
(849 KB at 7187.7 KB/sec)
[INFO] Downloaded: http://repo1.maven.org/maven2/org/apache/commons/commons-math3/3.0/commons-math3-3.0.jar
(1256 KB at 9231.5 KB/sec)
[INFO] Downloaded: http://repo1.maven.org/maven2/org/apache/uima/uimaj-test-util/3.0.0-beta/uimaj-test-util-3.0.0-beta.jar
(24 KB at 32.8 KB/sec)
[INFO] Downloading: http://repository.apache.org/snapshots/org/apache/uima/uimafit-core/3.0.0-SNAPSHOT/uimafit-core-3.0.0-20180725.131408-80.jar
[INFO] Downloaded: http://repository.apache.org/snapshots/org/apache/uima/uimafit-core/3.0.0-SNAPSHOT/uimafit-core-3.0.0-20180725.131408-80.jar
(170 KB at 341.8 KB/sec)
[INFO] 
[INFO] --- maven-clean-plugin:2.5:clean (default-clean) @ ruta-core ---
[TASKS] Scanning folder '<https://builds.apache.org/job/UIMA-Ruta-v3/org.apache.uima$ruta-core/ws/'>
for files matching the pattern '**/*.java' - excludes: 
[TASKS] Found 490 files to scan for tasks
Found 67 open tasks.
[TASKS] Computing warning deltas based on reference build #46
[INFO] 
[INFO] --- maven-enforcer-plugin:1.3.1:enforce (enforce-versions) @ ruta-core ---
[INFO] 
[INFO] --- build-helper-maven-plugin:1.8:parse-version (parse-project-version) @ ruta-core
---
[INFO] 
[INFO] --- uima-build-helper-maven-plugin:7:parse-date-time (set buildYear and buildMonth)
@ ruta-core ---
[INFO] 
[INFO] --- antlr3-maven-plugin:3.5.2:antlr (run antlr) @ ruta-core ---
[INFO] Downloading: https://repo.maven.apache.org/maven2/org/apache/maven/maven-plugin-api/2.0/maven-plugin-api-2.0.pom
[INFO] Downloaded: https://repo.maven.apache.org/maven2/org/apache/maven/maven-plugin-api/2.0/maven-plugin-api-2.0.pom
(601 B at 36.7 KB/sec)
[INFO] Downloading: https://repo.maven.apache.org/maven2/org/apache/maven/maven/2.0/maven-2.0.pom
[INFO] Downloaded: https://repo.maven.apache.org/maven2/org/apache/maven/maven/2.0/maven-2.0.pom
(9 KB at 570.8 KB/sec)
[INFO] Downloading: https://repo.maven.apache.org/maven2/org/apache/maven/maven-project/2.0/maven-project-2.0.pom
[INFO] Downloaded: https://repo.maven.apache.org/maven2/org/apache/maven/maven-project/2.0/maven-project-2.0.pom
(2 KB at 99.9 KB/sec)
[INFO] Downloading: https://repo.maven.apache.org/maven2/org/apache/maven/maven-profile/2.0/maven-profile-2.0.pom
[INFO] Downloaded: https://repo.maven.apache.org/maven2/org/apache/maven/maven-profile/2.0/maven-profile-2.0.pom
(2 KB at 74.4 KB/sec)
[INFO] Downloading: https://repo.maven.apache.org/maven2/org/apache/maven/maven-model/2.0/maven-model-2.0.pom
[INFO] Downloaded: https://repo.maven.apache.org/maven2/org/apache/maven/maven-model/2.0/maven-model-2.0.pom
(3 KB at 156.7 KB/sec)
[INFO] Downloading: https://repo.maven.apache.org/maven2/org/apache/maven/maven-artifact-manager/2.0/maven-artifact-manager-2.0.pom
[INFO] Downloaded: https://repo.maven.apache.org/maven2/org/apache/maven/maven-artifact-manager/2.0/maven-artifact-manager-2.0.pom
(2 KB at 65.9 KB/sec)
[INFO] Downloading: https://repo.maven.apache.org/maven2/org/apache/maven/maven-repository-metadata/2.0/maven-repository-metadata-2.0.pom
[INFO] Downloaded: https://repo.maven.apache.org/maven2/org/apache/maven/maven-repository-metadata/2.0/maven-repository-metadata-2.0.pom
(2 KB at 49.9 KB/sec)
[INFO] Downloading: https://repo.maven.apache.org/maven2/org/apache/maven/maven-artifact/2.0/maven-artifact-2.0.pom
[INFO] Downloaded: https://repo.maven.apache.org/maven2/org/apache/maven/maven-artifact/2.0/maven-artifact-2.0.pom
(723 B at 39.2 KB/sec)
[INFO] Downloading: https://repo.maven.apache.org/maven2/org/codehaus/plexus/plexus-compiler-api/2.0/plexus-compiler-api-2.0.pom
[INFO] Downloaded: https://repo.maven.apache.org/maven2/org/codehaus/plexus/plexus-compiler-api/2.0/plexus-compiler-api-2.0.pom
(865 B at 52.8 KB/sec)
[INFO] Downloading: https://repo.maven.apache.org/maven2/org/codehaus/plexus/plexus-compiler/2.0/plexus-compiler-2.0.pom
[INFO] Downloaded: https://repo.maven.apache.org/maven2/org/codehaus/plexus/plexus-compiler/2.0/plexus-compiler-2.0.pom
(4 KB at 220.5 KB/sec)
[INFO] Downloading: https://repo.maven.apache.org/maven2/org/codehaus/plexus/plexus-components/1.3/plexus-components-1.3.pom
[INFO] Downloaded: https://repo.maven.apache.org/maven2/org/codehaus/plexus/plexus-components/1.3/plexus-components-1.3.pom
(3 KB at 199.1 KB/sec)
[INFO] Downloading: https://repo.maven.apache.org/maven2/org/antlr/antlr/3.5.2/antlr-3.5.2.pom
[INFO] Downloaded: https://repo.maven.apache.org/maven2/org/antlr/antlr/3.5.2/antlr-3.5.2.pom
(3 KB at 86.0 KB/sec)
[INFO] Downloading: https://repo.maven.apache.org/maven2/org/antlr/ST4/4.0.8/ST4-4.0.8.pom
[INFO] Downloaded: https://repo.maven.apache.org/maven2/org/antlr/ST4/4.0.8/ST4-4.0.8.pom
(14 KB at 789.4 KB/sec)
[INFO] Downloading: https://repo.maven.apache.org/maven2/org/apache/maven/maven-plugin-api/2.0/maven-plugin-api-2.0.jar
[INFO] Downloading: https://repo.maven.apache.org/maven2/org/apache/maven/maven-project/2.0/maven-project-2.0.jar
[INFO] Downloading: https://repo.maven.apache.org/maven2/org/apache/maven/maven-profile/2.0/maven-profile-2.0.jar
[INFO] Downloading: https://repo.maven.apache.org/maven2/org/apache/maven/maven-model/2.0/maven-model-2.0.jar
[INFO] Downloading: https://repo.maven.apache.org/maven2/org/apache/maven/maven-artifact-manager/2.0/maven-artifact-manager-2.0.jar
[INFO] Downloaded: https://repo.maven.apache.org/maven2/org/apache/maven/maven-plugin-api/2.0/maven-plugin-api-2.0.jar
(10 KB at 549.8 KB/sec)
[INFO] Downloaded: https://repo.maven.apache.org/maven2/org/apache/maven/maven-profile/2.0/maven-profile-2.0.jar
(30 KB at 1746.8 KB/sec)
[INFO] Downloading: https://repo.maven.apache.org/maven2/org/apache/maven/maven-repository-metadata/2.0/maven-repository-metadata-2.0.jar
[INFO] Downloading: https://repo.maven.apache.org/maven2/org/codehaus/plexus/plexus-utils/1.0.4/plexus-utils-1.0.4.jar
[INFO] Downloaded: https://repo.maven.apache.org/maven2/org/apache/maven/maven-project/2.0/maven-project-2.0.jar
(103 KB at 5108.2 KB/sec)
[INFO] Downloading: https://repo.maven.apache.org/maven2/org/apache/maven/maven-artifact/2.0/maven-artifact-2.0.jar
[INFO] Downloaded: https://repo.maven.apache.org/maven2/org/apache/maven/maven-model/2.0/maven-model-2.0.jar
(77 KB at 3831.8 KB/sec)
[INFO] Downloading: https://repo.maven.apache.org/maven2/org/codehaus/plexus/plexus-container-default/1.0-alpha-8/plexus-container-default-1.0-alpha-8.jar
[INFO] Downloaded: https://repo.maven.apache.org/maven2/org/apache/maven/maven-artifact-manager/2.0/maven-artifact-manager-2.0.jar
(50 KB at 2472.1 KB/sec)
[INFO] Downloading: https://repo.maven.apache.org/maven2/org/codehaus/plexus/plexus-compiler-api/2.0/plexus-compiler-api-2.0.jar
[INFO] Downloaded: https://repo.maven.apache.org/maven2/org/apache/maven/maven-repository-metadata/2.0/maven-repository-metadata-2.0.jar
(21 KB at 672.4 KB/sec)
[INFO] Downloading: https://repo.maven.apache.org/maven2/org/antlr/antlr/3.5.2/antlr-3.5.2.jar
[INFO] Downloaded: https://repo.maven.apache.org/maven2/org/apache/maven/maven-artifact/2.0/maven-artifact-2.0.jar
(77 KB at 2136.5 KB/sec)
[INFO] Downloading: https://repo.maven.apache.org/maven2/org/antlr/ST4/4.0.8/ST4-4.0.8.jar
[INFO] Downloaded: https://repo.maven.apache.org/maven2/org/codehaus/plexus/plexus-compiler-api/2.0/plexus-compiler-api-2.0.jar
(25 KB at 677.8 KB/sec)
[INFO] Downloaded: https://repo.maven.apache.org/maven2/org/codehaus/plexus/plexus-container-default/1.0-alpha-8/plexus-container-default-1.0-alpha-8.jar
(191 KB at 4544.2 KB/sec)
[INFO] Downloaded: https://repo.maven.apache.org/maven2/org/codehaus/plexus/plexus-utils/1.0.4/plexus-utils-1.0.4.jar
(160 KB at 3808.7 KB/sec)
[INFO] Downloaded: https://repo.maven.apache.org/maven2/org/antlr/ST4/4.0.8/ST4-4.0.8.jar
(234 KB at 3834.9 KB/sec)
[INFO] Downloaded: https://repo.maven.apache.org/maven2/org/antlr/antlr/3.5.2/antlr-3.5.2.jar
(1127 KB at 10243.4 KB/sec)
[INFO] ANTLR: Processing source directory <https://builds.apache.org/job/UIMA-Ruta-v3/org.apache.uima$ruta-core/ws/src/main/antlr3>
ANTLR Parser Generator  Version 3.5.2
Output file <https://builds.apache.org/job/UIMA-Ruta-v3/org.apache.uima$ruta-core/ws/target/generated-sources/antlr3/org/apache/uima/ruta/parser/RutaLexer.java>
does not exist: must build <https://builds.apache.org/job/UIMA-Ruta-v3/org.apache.uima$ruta-core/ws/src/main/antlr3/org/apache/uima/ruta/parser/RutaLexer.g>
org/apache/uima/ruta/parser/RutaLexer.g
Output file <https://builds.apache.org/job/UIMA-Ruta-v3/org.apache.uima$ruta-core/ws/target/generated-sources/antlr3/org/apache/uima/ruta/parser/RutaParser.java>
does not exist: must build <https://builds.apache.org/job/UIMA-Ruta-v3/org.apache.uima$ruta-core/ws/src/main/antlr3/org/apache/uima/ruta/parser/RutaParser.g>
org/apache/uima/ruta/parser/RutaParser.g
[INFO] 
[INFO] --- build-helper-maven-plugin:1.8:add-source (add-source) @ ruta-core ---
[INFO] Source directory: <https://builds.apache.org/job/UIMA-Ruta-v3/org.apache.uima$ruta-core/ws/target/generated-sources/antlr3>
added.
[INFO] 
[INFO] --- maven-remote-resources-plugin:1.5:process (default) @ ruta-core ---
[INFO] 
[INFO] --- maven-resources-plugin:2.6:resources (default-resources) @ ruta-core ---
[INFO] Using 'UTF-8' encoding to copy filtered resources.
[INFO] Copying 14 resources
[INFO] Copying 3 resources
[INFO] 
[INFO] --- maven-compiler-plugin:3.1:compile (default-compile) @ ruta-core ---
[INFO] Changes detected - recompiling the module!
[INFO] Compiling 307 source files to <https://builds.apache.org/job/UIMA-Ruta-v3/org.apache.uima$ruta-core/ws/target/classes>
[INFO] -------------------------------------------------------------
[WARNING] COMPILATION WARNING : 
[INFO] -------------------------------------------------------------
[WARNING] <https://builds.apache.org/job/UIMA-Ruta-v3/org.apache.uima$ruta-core/ws/src/main/java/org/apache/uima/ruta/engine/Ruta.java>:
<https://builds.apache.org/job/UIMA-Ruta-v3/org.apache.uima$ruta-core/ws/src/main/java/org/apache/uima/ruta/engine/Ruta.java>
uses or overrides a deprecated API.
[WARNING] <https://builds.apache.org/job/UIMA-Ruta-v3/org.apache.uima$ruta-core/ws/src/main/java/org/apache/uima/ruta/engine/Ruta.java>:
Recompile with -Xlint:deprecation for details.
[WARNING] <https://builds.apache.org/job/UIMA-Ruta-v3/org.apache.uima$ruta-core/ws/target/generated-sources/antlr3/org/apache/uima/ruta/parser/RutaParser.java>:
Some input files use unchecked or unsafe operations.
[WARNING] <https://builds.apache.org/job/UIMA-Ruta-v3/org.apache.uima$ruta-core/ws/target/generated-sources/antlr3/org/apache/uima/ruta/parser/RutaParser.java>:
Recompile with -Xlint:unchecked for details.
[INFO] 4 warnings 
[INFO] -------------------------------------------------------------
[INFO] -------------------------------------------------------------
[ERROR] COMPILATION ERROR : 
[INFO] -------------------------------------------------------------
[ERROR] <https://builds.apache.org/job/UIMA-Ruta-v3/org.apache.uima$ruta-core/ws/src/main/java/org/apache/uima/ruta/RutaStream.java>:[1033,56]
no suitable method found for createStringArray(org.apache.uima.cas.CAS,java.util.List<java.lang.String>)
    method org.apache.uima.fit.util.FSCollectionFactory.createStringArray(org.apache.uima.jcas.JCas,java.util.Collection<java.lang.String>)
is not applicable
      (argument mismatch; org.apache.uima.cas.CAS cannot be converted to org.apache.uima.jcas.JCas)
    method org.apache.uima.fit.util.FSCollectionFactory.createStringArray(org.apache.uima.jcas.JCas,java.lang.String...)
is not applicable
      (argument mismatch; org.apache.uima.cas.CAS cannot be converted to org.apache.uima.jcas.JCas)
[ERROR] <https://builds.apache.org/job/UIMA-Ruta-v3/org.apache.uima$ruta-core/ws/src/main/java/org/apache/uima/ruta/RutaStream.java>:[1038,50]
no suitable method found for createStringArray(org.apache.uima.cas.CAS,java.lang.String[])
    method org.apache.uima.fit.util.FSCollectionFactory.createStringArray(org.apache.uima.jcas.JCas,java.util.Collection<java.lang.String>)
is not applicable
      (argument mismatch; org.apache.uima.cas.CAS cannot be converted to org.apache.uima.jcas.JCas)
    method org.apache.uima.fit.util.FSCollectionFactory.createStringArray(org.apache.uima.jcas.JCas,java.lang.String...)
is not applicable
      (argument mismatch; org.apache.uima.cas.CAS cannot be converted to org.apache.uima.jcas.JCas)
[ERROR] <https://builds.apache.org/job/UIMA-Ruta-v3/org.apache.uima$ruta-core/ws/src/main/java/org/apache/uima/ruta/RutaStream.java>:[1060,47]
no suitable method found for createIntArray(org.apache.uima.cas.CAS,int[])
    method org.apache.uima.fit.util.FSCollectionFactory.createIntArray(org.apache.uima.jcas.JCas,java.util.Collection<java.lang.Integer>)
is not applicable
      (argument mismatch; org.apache.uima.cas.CAS cannot be converted to org.apache.uima.jcas.JCas)
    method org.apache.uima.fit.util.FSCollectionFactory.createIntArray(org.apache.uima.jcas.JCas,int...)
is not applicable
      (argument mismatch; org.apache.uima.cas.CAS cannot be converted to org.apache.uima.jcas.JCas)
[ERROR] <https://builds.apache.org/job/UIMA-Ruta-v3/org.apache.uima$ruta-core/ws/src/main/java/org/apache/uima/ruta/RutaStream.java>:[1065,47]
no suitable method found for createIntArray(org.apache.uima.cas.CAS,int[])
    method org.apache.uima.fit.util.FSCollectionFactory.createIntArray(org.apache.uima.jcas.JCas,java.util.Collection<java.lang.Integer>)
is not applicable
      (argument mismatch; org.apache.uima.cas.CAS cannot be converted to org.apache.uima.jcas.JCas)
    method org.apache.uima.fit.util.FSCollectionFactory.createIntArray(org.apache.uima.jcas.JCas,int...)
is not applicable
      (argument mismatch; org.apache.uima.cas.CAS cannot be converted to org.apache.uima.jcas.JCas)
[ERROR] <https://builds.apache.org/job/UIMA-Ruta-v3/org.apache.uima$ruta-core/ws/src/main/java/org/apache/uima/ruta/RutaStream.java>:[1078,50]
no suitable method found for createDoubleArray(org.apache.uima.cas.CAS,double[])
    method org.apache.uima.fit.util.FSCollectionFactory.createDoubleArray(org.apache.uima.jcas.JCas,java.util.Collection<java.lang.Double>)
is not applicable
      (argument mismatch; org.apache.uima.cas.CAS cannot be converted to org.apache.uima.jcas.JCas)
    method org.apache.uima.fit.util.FSCollectionFactory.createDoubleArray(org.apache.uima.jcas.JCas,double...)
is not applicable
      (argument mismatch; org.apache.uima.cas.CAS cannot be converted to org.apache.uima.jcas.JCas)
[ERROR] <https://builds.apache.org/job/UIMA-Ruta-v3/org.apache.uima$ruta-core/ws/src/main/java/org/apache/uima/ruta/RutaStream.java>:[1083,50]
no suitable method found for createDoubleArray(org.apache.uima.cas.CAS,double[])
    method org.apache.uima.fit.util.FSCollectionFactory.createDoubleArray(org.apache.uima.jcas.JCas,java.util.Collection<java.lang.Double>)
is not applicable
      (argument mismatch; org.apache.uima.cas.CAS cannot be converted to org.apache.uima.jcas.JCas)
    method org.apache.uima.fit.util.FSCollectionFactory.createDoubleArray(org.apache.uima.jcas.JCas,double...)
is not applicable
      (argument mismatch; org.apache.uima.cas.CAS cannot be converted to org.apache.uima.jcas.JCas)
[ERROR] <https://builds.apache.org/job/UIMA-Ruta-v3/org.apache.uima$ruta-core/ws/src/main/java/org/apache/uima/ruta/RutaStream.java>:[1097,49]
no suitable method found for createFloatArray(org.apache.uima.cas.CAS,float[])
    method org.apache.uima.fit.util.FSCollectionFactory.createFloatArray(org.apache.uima.jcas.JCas,java.util.Collection<java.lang.Float>)
is not applicable
      (argument mismatch; org.apache.uima.cas.CAS cannot be converted to org.apache.uima.jcas.JCas)
    method org.apache.uima.fit.util.FSCollectionFactory.createFloatArray(org.apache.uima.jcas.JCas,float...)
is not applicable
      (argument mismatch; org.apache.uima.cas.CAS cannot be converted to org.apache.uima.jcas.JCas)
[ERROR] <https://builds.apache.org/job/UIMA-Ruta-v3/org.apache.uima$ruta-core/ws/src/main/java/org/apache/uima/ruta/RutaStream.java>:[1102,49]
no suitable method found for createFloatArray(org.apache.uima.cas.CAS,float[])
    method org.apache.uima.fit.util.FSCollectionFactory.createFloatArray(org.apache.uima.jcas.JCas,java.util.Collection<java.lang.Float>)
is not applicable
      (argument mismatch; org.apache.uima.cas.CAS cannot be converted to org.apache.uima.jcas.JCas)
    method org.apache.uima.fit.util.FSCollectionFactory.createFloatArray(org.apache.uima.jcas.JCas,float...)
is not applicable
      (argument mismatch; org.apache.uima.cas.CAS cannot be converted to org.apache.uima.jcas.JCas)
[ERROR] <https://builds.apache.org/job/UIMA-Ruta-v3/org.apache.uima$ruta-core/ws/src/main/java/org/apache/uima/ruta/RutaStream.java>:[1116,51]
no suitable method found for createBooleanArray(org.apache.uima.cas.CAS,java.util.List<java.lang.Boolean>)
    method org.apache.uima.fit.util.FSCollectionFactory.createBooleanArray(org.apache.uima.jcas.JCas,java.util.Collection<java.lang.Boolean>)
is not applicable
      (argument mismatch; org.apache.uima.cas.CAS cannot be converted to org.apache.uima.jcas.JCas)
    method org.apache.uima.fit.util.FSCollectionFactory.createBooleanArray(org.apache.uima.jcas.JCas,boolean...)
is not applicable
      (argument mismatch; org.apache.uima.cas.CAS cannot be converted to org.apache.uima.jcas.JCas)
[ERROR] <https://builds.apache.org/job/UIMA-Ruta-v3/org.apache.uima$ruta-core/ws/src/main/java/org/apache/uima/ruta/RutaStream.java>:[1121,51]
no suitable method found for createBooleanArray(org.apache.uima.cas.CAS,boolean[])
    method org.apache.uima.fit.util.FSCollectionFactory.createBooleanArray(org.apache.uima.jcas.JCas,java.util.Collection<java.lang.Boolean>)
is not applicable
      (argument mismatch; org.apache.uima.cas.CAS cannot be converted to org.apache.uima.jcas.JCas)
    method org.apache.uima.fit.util.FSCollectionFactory.createBooleanArray(org.apache.uima.jcas.JCas,boolean...)
is not applicable
      (argument mismatch; org.apache.uima.cas.CAS cannot be converted to org.apache.uima.jcas.JCas)
[INFO] 10 errors 
[INFO] -------------------------------------------------------------

Mime
View raw message