uima-dev mailing list archives

Site index · List index
Message view « Date » · « Thread »
Top « Date » · « Thread »
From Apache Jenkins Server <jenk...@builds.apache.org>
Subject Build failed in Jenkins: UIMA-Ruta-v3 #53
Date Wed, 25 Jul 2018 13:22:35 GMT
See <https://builds.apache.org/job/UIMA-Ruta-v3/53/display/redirect>

------------------------------------------
[...truncated 599.35 KB...]
[INFO] Downloaded: https://repo.maven.apache.org/maven2/org/apache/maven/maven-profile/2.0/maven-profile-2.0.pom
(2 KB at 74.4 KB/sec)
[INFO] Downloading: https://repo.maven.apache.org/maven2/org/apache/maven/maven-model/2.0/maven-model-2.0.pom
[INFO] Downloaded: https://repo.maven.apache.org/maven2/org/apache/maven/maven-model/2.0/maven-model-2.0.pom
(3 KB at 156.7 KB/sec)
[INFO] Downloading: https://repo.maven.apache.org/maven2/org/apache/maven/maven-artifact-manager/2.0/maven-artifact-manager-2.0.pom
[INFO] Downloaded: https://repo.maven.apache.org/maven2/org/apache/maven/maven-artifact-manager/2.0/maven-artifact-manager-2.0.pom
(2 KB at 65.9 KB/sec)
[INFO] Downloading: https://repo.maven.apache.org/maven2/org/apache/maven/maven-repository-metadata/2.0/maven-repository-metadata-2.0.pom
[INFO] Downloaded: https://repo.maven.apache.org/maven2/org/apache/maven/maven-repository-metadata/2.0/maven-repository-metadata-2.0.pom
(2 KB at 49.9 KB/sec)
[INFO] Downloading: https://repo.maven.apache.org/maven2/org/apache/maven/maven-artifact/2.0/maven-artifact-2.0.pom
[INFO] Downloaded: https://repo.maven.apache.org/maven2/org/apache/maven/maven-artifact/2.0/maven-artifact-2.0.pom
(723 B at 39.2 KB/sec)
[INFO] Downloading: https://repo.maven.apache.org/maven2/org/codehaus/plexus/plexus-compiler-api/2.0/plexus-compiler-api-2.0.pom
[INFO] Downloaded: https://repo.maven.apache.org/maven2/org/codehaus/plexus/plexus-compiler-api/2.0/plexus-compiler-api-2.0.pom
(865 B at 52.8 KB/sec)
[INFO] Downloading: https://repo.maven.apache.org/maven2/org/codehaus/plexus/plexus-compiler/2.0/plexus-compiler-2.0.pom
[INFO] Downloaded: https://repo.maven.apache.org/maven2/org/codehaus/plexus/plexus-compiler/2.0/plexus-compiler-2.0.pom
(4 KB at 220.5 KB/sec)
[INFO] Downloading: https://repo.maven.apache.org/maven2/org/codehaus/plexus/plexus-components/1.3/plexus-components-1.3.pom
[INFO] Downloaded: https://repo.maven.apache.org/maven2/org/codehaus/plexus/plexus-components/1.3/plexus-components-1.3.pom
(3 KB at 199.1 KB/sec)
[INFO] Downloading: https://repo.maven.apache.org/maven2/org/antlr/antlr/3.5.2/antlr-3.5.2.pom
[INFO] Downloaded: https://repo.maven.apache.org/maven2/org/antlr/antlr/3.5.2/antlr-3.5.2.pom
(3 KB at 86.0 KB/sec)
[INFO] Downloading: https://repo.maven.apache.org/maven2/org/antlr/ST4/4.0.8/ST4-4.0.8.pom
[INFO] Downloaded: https://repo.maven.apache.org/maven2/org/antlr/ST4/4.0.8/ST4-4.0.8.pom
(14 KB at 789.4 KB/sec)
[INFO] Downloading: https://repo.maven.apache.org/maven2/org/apache/maven/maven-plugin-api/2.0/maven-plugin-api-2.0.jar
[INFO] Downloading: https://repo.maven.apache.org/maven2/org/apache/maven/maven-project/2.0/maven-project-2.0.jar
[INFO] Downloading: https://repo.maven.apache.org/maven2/org/apache/maven/maven-profile/2.0/maven-profile-2.0.jar
[INFO] Downloading: https://repo.maven.apache.org/maven2/org/apache/maven/maven-model/2.0/maven-model-2.0.jar
[INFO] Downloading: https://repo.maven.apache.org/maven2/org/apache/maven/maven-artifact-manager/2.0/maven-artifact-manager-2.0.jar
[INFO] Downloaded: https://repo.maven.apache.org/maven2/org/apache/maven/maven-plugin-api/2.0/maven-plugin-api-2.0.jar
(10 KB at 549.8 KB/sec)
[INFO] Downloaded: https://repo.maven.apache.org/maven2/org/apache/maven/maven-profile/2.0/maven-profile-2.0.jar
(30 KB at 1746.8 KB/sec)
[INFO] Downloading: https://repo.maven.apache.org/maven2/org/apache/maven/maven-repository-metadata/2.0/maven-repository-metadata-2.0.jar
[INFO] Downloading: https://repo.maven.apache.org/maven2/org/codehaus/plexus/plexus-utils/1.0.4/plexus-utils-1.0.4.jar
[INFO] Downloaded: https://repo.maven.apache.org/maven2/org/apache/maven/maven-project/2.0/maven-project-2.0.jar
(103 KB at 5108.2 KB/sec)
[INFO] Downloading: https://repo.maven.apache.org/maven2/org/apache/maven/maven-artifact/2.0/maven-artifact-2.0.jar
[INFO] Downloaded: https://repo.maven.apache.org/maven2/org/apache/maven/maven-model/2.0/maven-model-2.0.jar
(77 KB at 3831.8 KB/sec)
[INFO] Downloading: https://repo.maven.apache.org/maven2/org/codehaus/plexus/plexus-container-default/1.0-alpha-8/plexus-container-default-1.0-alpha-8.jar
[INFO] Downloaded: https://repo.maven.apache.org/maven2/org/apache/maven/maven-artifact-manager/2.0/maven-artifact-manager-2.0.jar
(50 KB at 2472.1 KB/sec)
[INFO] Downloading: https://repo.maven.apache.org/maven2/org/codehaus/plexus/plexus-compiler-api/2.0/plexus-compiler-api-2.0.jar
[INFO] Downloaded: https://repo.maven.apache.org/maven2/org/apache/maven/maven-repository-metadata/2.0/maven-repository-metadata-2.0.jar
(21 KB at 672.4 KB/sec)
[INFO] Downloading: https://repo.maven.apache.org/maven2/org/antlr/antlr/3.5.2/antlr-3.5.2.jar
[INFO] Downloaded: https://repo.maven.apache.org/maven2/org/apache/maven/maven-artifact/2.0/maven-artifact-2.0.jar
(77 KB at 2136.5 KB/sec)
[INFO] Downloading: https://repo.maven.apache.org/maven2/org/antlr/ST4/4.0.8/ST4-4.0.8.jar
[INFO] Downloaded: https://repo.maven.apache.org/maven2/org/codehaus/plexus/plexus-compiler-api/2.0/plexus-compiler-api-2.0.jar
(25 KB at 677.8 KB/sec)
[INFO] Downloaded: https://repo.maven.apache.org/maven2/org/codehaus/plexus/plexus-container-default/1.0-alpha-8/plexus-container-default-1.0-alpha-8.jar
(191 KB at 4544.2 KB/sec)
[INFO] Downloaded: https://repo.maven.apache.org/maven2/org/codehaus/plexus/plexus-utils/1.0.4/plexus-utils-1.0.4.jar
(160 KB at 3808.7 KB/sec)
[INFO] Downloaded: https://repo.maven.apache.org/maven2/org/antlr/ST4/4.0.8/ST4-4.0.8.jar
(234 KB at 3834.9 KB/sec)
[INFO] Downloaded: https://repo.maven.apache.org/maven2/org/antlr/antlr/3.5.2/antlr-3.5.2.jar
(1127 KB at 10243.4 KB/sec)
[INFO] ANTLR: Processing source directory <https://builds.apache.org/job/UIMA-Ruta-v3/ws/trunk/ruta-core/src/main/antlr3>
ANTLR Parser Generator  Version 3.5.2
Output file <https://builds.apache.org/job/UIMA-Ruta-v3/ws/trunk/ruta-core/target/generated-sources/antlr3/org/apache/uima/ruta/parser/RutaLexer.java>
does not exist: must build <https://builds.apache.org/job/UIMA-Ruta-v3/ws/trunk/ruta-core/src/main/antlr3/org/apache/uima/ruta/parser/RutaLexer.g>
org/apache/uima/ruta/parser/RutaLexer.g
Output file <https://builds.apache.org/job/UIMA-Ruta-v3/ws/trunk/ruta-core/target/generated-sources/antlr3/org/apache/uima/ruta/parser/RutaParser.java>
does not exist: must build <https://builds.apache.org/job/UIMA-Ruta-v3/ws/trunk/ruta-core/src/main/antlr3/org/apache/uima/ruta/parser/RutaParser.g>
org/apache/uima/ruta/parser/RutaParser.g
[INFO] 
[INFO] --- build-helper-maven-plugin:1.8:add-source (add-source) @ ruta-core ---
[INFO] Source directory: <https://builds.apache.org/job/UIMA-Ruta-v3/ws/trunk/ruta-core/target/generated-sources/antlr3>
added.
[INFO] 
[INFO] --- maven-remote-resources-plugin:1.5:process (default) @ ruta-core ---
[INFO] 
[INFO] --- maven-resources-plugin:2.6:resources (default-resources) @ ruta-core ---
[INFO] Using 'UTF-8' encoding to copy filtered resources.
[INFO] Copying 14 resources
[INFO] Copying 3 resources
[INFO] 
[INFO] --- maven-compiler-plugin:3.1:compile (default-compile) @ ruta-core ---
[INFO] Changes detected - recompiling the module!
[INFO] Compiling 307 source files to <https://builds.apache.org/job/UIMA-Ruta-v3/ws/trunk/ruta-core/target/classes>
[INFO] -------------------------------------------------------------
[WARNING] COMPILATION WARNING : 
[INFO] -------------------------------------------------------------
[WARNING] <https://builds.apache.org/job/UIMA-Ruta-v3/ws/trunk/ruta-core/src/main/java/org/apache/uima/ruta/engine/Ruta.java>:
<https://builds.apache.org/job/UIMA-Ruta-v3/ws/trunk/ruta-core/src/main/java/org/apache/uima/ruta/engine/Ruta.java>
uses or overrides a deprecated API.
[WARNING] <https://builds.apache.org/job/UIMA-Ruta-v3/ws/trunk/ruta-core/src/main/java/org/apache/uima/ruta/engine/Ruta.java>:
Recompile with -Xlint:deprecation for details.
[WARNING] <https://builds.apache.org/job/UIMA-Ruta-v3/ws/trunk/ruta-core/target/generated-sources/antlr3/org/apache/uima/ruta/parser/RutaParser.java>:
Some input files use unchecked or unsafe operations.
[WARNING] <https://builds.apache.org/job/UIMA-Ruta-v3/ws/trunk/ruta-core/target/generated-sources/antlr3/org/apache/uima/ruta/parser/RutaParser.java>:
Recompile with -Xlint:unchecked for details.
[INFO] 4 warnings 
[INFO] -------------------------------------------------------------
[INFO] -------------------------------------------------------------
[ERROR] COMPILATION ERROR : 
[INFO] -------------------------------------------------------------
[ERROR] <https://builds.apache.org/job/UIMA-Ruta-v3/ws/trunk/ruta-core/src/main/java/org/apache/uima/ruta/RutaStream.java>:[1033,56]
no suitable method found for createStringArray(org.apache.uima.cas.CAS,java.util.List<java.lang.String>)
    method org.apache.uima.fit.util.FSCollectionFactory.createStringArray(org.apache.uima.jcas.JCas,java.util.Collection<java.lang.String>)
is not applicable
      (argument mismatch; org.apache.uima.cas.CAS cannot be converted to org.apache.uima.jcas.JCas)
    method org.apache.uima.fit.util.FSCollectionFactory.createStringArray(org.apache.uima.jcas.JCas,java.lang.String...)
is not applicable
      (argument mismatch; org.apache.uima.cas.CAS cannot be converted to org.apache.uima.jcas.JCas)
[ERROR] <https://builds.apache.org/job/UIMA-Ruta-v3/ws/trunk/ruta-core/src/main/java/org/apache/uima/ruta/RutaStream.java>:[1038,50]
no suitable method found for createStringArray(org.apache.uima.cas.CAS,java.lang.String[])
    method org.apache.uima.fit.util.FSCollectionFactory.createStringArray(org.apache.uima.jcas.JCas,java.util.Collection<java.lang.String>)
is not applicable
      (argument mismatch; org.apache.uima.cas.CAS cannot be converted to org.apache.uima.jcas.JCas)
    method org.apache.uima.fit.util.FSCollectionFactory.createStringArray(org.apache.uima.jcas.JCas,java.lang.String...)
is not applicable
      (argument mismatch; org.apache.uima.cas.CAS cannot be converted to org.apache.uima.jcas.JCas)
[ERROR] <https://builds.apache.org/job/UIMA-Ruta-v3/ws/trunk/ruta-core/src/main/java/org/apache/uima/ruta/RutaStream.java>:[1060,47]
no suitable method found for createIntArray(org.apache.uima.cas.CAS,int[])
    method org.apache.uima.fit.util.FSCollectionFactory.createIntArray(org.apache.uima.jcas.JCas,java.util.Collection<java.lang.Integer>)
is not applicable
      (argument mismatch; org.apache.uima.cas.CAS cannot be converted to org.apache.uima.jcas.JCas)
    method org.apache.uima.fit.util.FSCollectionFactory.createIntArray(org.apache.uima.jcas.JCas,int...)
is not applicable
      (argument mismatch; org.apache.uima.cas.CAS cannot be converted to org.apache.uima.jcas.JCas)
[ERROR] <https://builds.apache.org/job/UIMA-Ruta-v3/ws/trunk/ruta-core/src/main/java/org/apache/uima/ruta/RutaStream.java>:[1065,47]
no suitable method found for createIntArray(org.apache.uima.cas.CAS,int[])
    method org.apache.uima.fit.util.FSCollectionFactory.createIntArray(org.apache.uima.jcas.JCas,java.util.Collection<java.lang.Integer>)
is not applicable
      (argument mismatch; org.apache.uima.cas.CAS cannot be converted to org.apache.uima.jcas.JCas)
    method org.apache.uima.fit.util.FSCollectionFactory.createIntArray(org.apache.uima.jcas.JCas,int...)
is not applicable
      (argument mismatch; org.apache.uima.cas.CAS cannot be converted to org.apache.uima.jcas.JCas)
[ERROR] <https://builds.apache.org/job/UIMA-Ruta-v3/ws/trunk/ruta-core/src/main/java/org/apache/uima/ruta/RutaStream.java>:[1078,50]
no suitable method found for createDoubleArray(org.apache.uima.cas.CAS,double[])
    method org.apache.uima.fit.util.FSCollectionFactory.createDoubleArray(org.apache.uima.jcas.JCas,java.util.Collection<java.lang.Double>)
is not applicable
      (argument mismatch; org.apache.uima.cas.CAS cannot be converted to org.apache.uima.jcas.JCas)
    method org.apache.uima.fit.util.FSCollectionFactory.createDoubleArray(org.apache.uima.jcas.JCas,double...)
is not applicable
      (argument mismatch; org.apache.uima.cas.CAS cannot be converted to org.apache.uima.jcas.JCas)
[ERROR] <https://builds.apache.org/job/UIMA-Ruta-v3/ws/trunk/ruta-core/src/main/java/org/apache/uima/ruta/RutaStream.java>:[1083,50]
no suitable method found for createDoubleArray(org.apache.uima.cas.CAS,double[])
    method org.apache.uima.fit.util.FSCollectionFactory.createDoubleArray(org.apache.uima.jcas.JCas,java.util.Collection<java.lang.Double>)
is not applicable
      (argument mismatch; org.apache.uima.cas.CAS cannot be converted to org.apache.uima.jcas.JCas)
    method org.apache.uima.fit.util.FSCollectionFactory.createDoubleArray(org.apache.uima.jcas.JCas,double...)
is not applicable
      (argument mismatch; org.apache.uima.cas.CAS cannot be converted to org.apache.uima.jcas.JCas)
[ERROR] <https://builds.apache.org/job/UIMA-Ruta-v3/ws/trunk/ruta-core/src/main/java/org/apache/uima/ruta/RutaStream.java>:[1097,49]
no suitable method found for createFloatArray(org.apache.uima.cas.CAS,float[])
    method org.apache.uima.fit.util.FSCollectionFactory.createFloatArray(org.apache.uima.jcas.JCas,java.util.Collection<java.lang.Float>)
is not applicable
      (argument mismatch; org.apache.uima.cas.CAS cannot be converted to org.apache.uima.jcas.JCas)
    method org.apache.uima.fit.util.FSCollectionFactory.createFloatArray(org.apache.uima.jcas.JCas,float...)
is not applicable
      (argument mismatch; org.apache.uima.cas.CAS cannot be converted to org.apache.uima.jcas.JCas)
[ERROR] <https://builds.apache.org/job/UIMA-Ruta-v3/ws/trunk/ruta-core/src/main/java/org/apache/uima/ruta/RutaStream.java>:[1102,49]
no suitable method found for createFloatArray(org.apache.uima.cas.CAS,float[])
    method org.apache.uima.fit.util.FSCollectionFactory.createFloatArray(org.apache.uima.jcas.JCas,java.util.Collection<java.lang.Float>)
is not applicable
      (argument mismatch; org.apache.uima.cas.CAS cannot be converted to org.apache.uima.jcas.JCas)
    method org.apache.uima.fit.util.FSCollectionFactory.createFloatArray(org.apache.uima.jcas.JCas,float...)
is not applicable
      (argument mismatch; org.apache.uima.cas.CAS cannot be converted to org.apache.uima.jcas.JCas)
[ERROR] <https://builds.apache.org/job/UIMA-Ruta-v3/ws/trunk/ruta-core/src/main/java/org/apache/uima/ruta/RutaStream.java>:[1116,51]
no suitable method found for createBooleanArray(org.apache.uima.cas.CAS,java.util.List<java.lang.Boolean>)
    method org.apache.uima.fit.util.FSCollectionFactory.createBooleanArray(org.apache.uima.jcas.JCas,java.util.Collection<java.lang.Boolean>)
is not applicable
      (argument mismatch; org.apache.uima.cas.CAS cannot be converted to org.apache.uima.jcas.JCas)
    method org.apache.uima.fit.util.FSCollectionFactory.createBooleanArray(org.apache.uima.jcas.JCas,boolean...)
is not applicable
      (argument mismatch; org.apache.uima.cas.CAS cannot be converted to org.apache.uima.jcas.JCas)
[ERROR] <https://builds.apache.org/job/UIMA-Ruta-v3/ws/trunk/ruta-core/src/main/java/org/apache/uima/ruta/RutaStream.java>:[1121,51]
no suitable method found for createBooleanArray(org.apache.uima.cas.CAS,boolean[])
    method org.apache.uima.fit.util.FSCollectionFactory.createBooleanArray(org.apache.uima.jcas.JCas,java.util.Collection<java.lang.Boolean>)
is not applicable
      (argument mismatch; org.apache.uima.cas.CAS cannot be converted to org.apache.uima.jcas.JCas)
    method org.apache.uima.fit.util.FSCollectionFactory.createBooleanArray(org.apache.uima.jcas.JCas,boolean...)
is not applicable
      (argument mismatch; org.apache.uima.cas.CAS cannot be converted to org.apache.uima.jcas.JCas)
[INFO] 10 errors 
[INFO] -------------------------------------------------------------
[INFO] ------------------------------------------------------------------------
[INFO] Reactor Summary:
[INFO] 
[INFO] Apache UIMA Ruta: ruta-parent ...................... SUCCESS [01:30 min]
[INFO] Apache UIMA Ruta: ruta-basic-type .................. SUCCESS [ 51.444 s]
[INFO] Apache UIMA Ruta: ruta-typesystem .................. SUCCESS [01:21 min]
[INFO] Apache UIMA Ruta: ruta-core ........................ FAILURE [ 36.304 s]
[INFO] Apache UIMA Ruta: ruta-core-ext .................... SKIPPED
[INFO] Apache UIMA Ruta: ruta-ep-parent ................... SKIPPED
[INFO] Apache UIMA Ruta Eclipse: ruta-ep-engine ........... SKIPPED
[INFO] Apache UIMA Ruta Eclipse: ruta-ep-ide .............. SKIPPED
[INFO] Apache UIMA Ruta Eclipse: ruta-ep-ide-ui ........... SKIPPED
[INFO] Apache UIMA Ruta Eclipse: ruta-ep-caseditor ........ SKIPPED
[INFO] Apache UIMA Ruta Eclipse: ruta-ep-addons ........... SKIPPED
[INFO] Apache UIMA Ruta Eclipse: ruta-ep-textruler ........ SKIPPED
[INFO] Apache UIMA Ruta Eclipse: ruta-ep-core-ext ......... SKIPPED
[INFO] Apache UIMA Maven: ruta-maven-plugin ............... SKIPPED
[INFO] Apache UIMA Maven: ruta-maven-archetype ............ SKIPPED
[INFO] Apache UIMA Ruta Documentation ..................... SKIPPED
[INFO] Apache UIMA Ruta Eclipse: ruta-eclipse-feature ..... SKIPPED
[INFO] Apache UIMA Ruta: ruta-ep-example-extensions ....... SKIPPED
[INFO] Apache UIMA Ruta: ruta-maven-example ............... SKIPPED
[INFO] Apache UIMA Ruta: ruta ............................. SKIPPED
[INFO] ------------------------------------------------------------------------
[INFO] BUILD FAILURE
[INFO] ------------------------------------------------------------------------
[INFO] Total time: 04:59 min
[INFO] Finished at: 2018-07-25T13:21:24+00:00
[INFO] Final Memory: 66M/664M
[INFO] ------------------------------------------------------------------------
[ERROR] Failed to execute goal org.apache.maven.plugins:maven-compiler-plugin:3.1:compile
(default-compile) on project ruta-core: Compilation failure: Compilation failure:
[ERROR] <https://builds.apache.org/job/UIMA-Ruta-v3/ws/trunk/ruta-core/src/main/java/org/apache/uima/ruta/RutaStream.java>:[1033,56]
no suitable method found for createStringArray(org.apache.uima.cas.CAS,java.util.List<java.lang.String>)
[ERROR] method org.apache.uima.fit.util.FSCollectionFactory.createStringArray(org.apache.uima.jcas.JCas,java.util.Collection<java.lang.String>)
is not applicable
[ERROR] (argument mismatch; org.apache.uima.cas.CAS cannot be converted to org.apache.uima.jcas.JCas)
[ERROR] method org.apache.uima.fit.util.FSCollectionFactory.createStringArray(org.apache.uima.jcas.JCas,java.lang.String...)
is not applicable
[ERROR] (argument mismatch; org.apache.uima.cas.CAS cannot be converted to org.apache.uima.jcas.JCas)
[ERROR] <https://builds.apache.org/job/UIMA-Ruta-v3/ws/trunk/ruta-core/src/main/java/org/apache/uima/ruta/RutaStream.java>:[1038,50]
no suitable method found for createStringArray(org.apache.uima.cas.CAS,java.lang.String[])
[ERROR] method org.apache.uima.fit.util.FSCollectionFactory.createStringArray(org.apache.uima.jcas.JCas,java.util.Collection<java.lang.String>)
is not applicable
[ERROR] (argument mismatch; org.apache.uima.cas.CAS cannot be converted to org.apache.uima.jcas.JCas)
[ERROR] method org.apache.uima.fit.util.FSCollectionFactory.createStringArray(org.apache.uima.jcas.JCas,java.lang.String...)
is not applicable
[ERROR] (argument mismatch; org.apache.uima.cas.CAS cannot be converted to org.apache.uima.jcas.JCas)
[ERROR] <https://builds.apache.org/job/UIMA-Ruta-v3/ws/trunk/ruta-core/src/main/java/org/apache/uima/ruta/RutaStream.java>:[1060,47]
no suitable method found for createIntArray(org.apache.uima.cas.CAS,int[])
[ERROR] method org.apache.uima.fit.util.FSCollectionFactory.createIntArray(org.apache.uima.jcas.JCas,java.util.Collection<java.lang.Integer>)
is not applicable
[ERROR] (argument mismatch; org.apache.uima.cas.CAS cannot be converted to org.apache.uima.jcas.JCas)
[ERROR] method org.apache.uima.fit.util.FSCollectionFactory.createIntArray(org.apache.uima.jcas.JCas,int...)
is not applicable
[ERROR] (argument mismatch; org.apache.uima.cas.CAS cannot be converted to org.apache.uima.jcas.JCas)
[ERROR] <https://builds.apache.org/job/UIMA-Ruta-v3/ws/trunk/ruta-core/src/main/java/org/apache/uima/ruta/RutaStream.java>:[1065,47]
no suitable method found for createIntArray(org.apache.uima.cas.CAS,int[])
[ERROR] method org.apache.uima.fit.util.FSCollectionFactory.createIntArray(org.apache.uima.jcas.JCas,java.util.Collection<java.lang.Integer>)
is not applicable
[ERROR] (argument mismatch; org.apache.uima.cas.CAS cannot be converted to org.apache.uima.jcas.JCas)
[ERROR] method org.apache.uima.fit.util.FSCollectionFactory.createIntArray(org.apache.uima.jcas.JCas,int...)
is not applicable
[ERROR] (argument mismatch; org.apache.uima.cas.CAS cannot be converted to org.apache.uima.jcas.JCas)
[ERROR] <https://builds.apache.org/job/UIMA-Ruta-v3/ws/trunk/ruta-core/src/main/java/org/apache/uima/ruta/RutaStream.java>:[1078,50]
no suitable method found for createDoubleArray(org.apache.uima.cas.CAS,double[])
[ERROR] method org.apache.uima.fit.util.FSCollectionFactory.createDoubleArray(org.apache.uima.jcas.JCas,java.util.Collection<java.lang.Double>)
is not applicable
[ERROR] (argument mismatch; org.apache.uima.cas.CAS cannot be converted to org.apache.uima.jcas.JCas)
[ERROR] method org.apache.uima.fit.util.FSCollectionFactory.createDoubleArray(org.apache.uima.jcas.JCas,double...)
is not applicable
[ERROR] (argument mismatch; org.apache.uima.cas.CAS cannot be converted to org.apache.uima.jcas.JCas)
[ERROR] <https://builds.apache.org/job/UIMA-Ruta-v3/ws/trunk/ruta-core/src/main/java/org/apache/uima/ruta/RutaStream.java>:[1083,50]
no suitable method found for createDoubleArray(org.apache.uima.cas.CAS,double[])
[ERROR] method org.apache.uima.fit.util.FSCollectionFactory.createDoubleArray(org.apache.uima.jcas.JCas,java.util.Collection<java.lang.Double>)
is not applicable
[ERROR] (argument mismatch; org.apache.uima.cas.CAS cannot be converted to org.apache.uima.jcas.JCas)
[ERROR] method org.apache.uima.fit.util.FSCollectionFactory.createDoubleArray(org.apache.uima.jcas.JCas,double...)
is not applicable
[ERROR] (argument mismatch; org.apache.uima.cas.CAS cannot be converted to org.apache.uima.jcas.JCas)
[ERROR] <https://builds.apache.org/job/UIMA-Ruta-v3/ws/trunk/ruta-core/src/main/java/org/apache/uima/ruta/RutaStream.java>:[1097,49]
no suitable method found for createFloatArray(org.apache.uima.cas.CAS,float[])
[ERROR] method org.apache.uima.fit.util.FSCollectionFactory.createFloatArray(org.apache.uima.jcas.JCas,java.util.Collection<java.lang.Float>)
is not applicable
[ERROR] (argument mismatch; org.apache.uima.cas.CAS cannot be converted to org.apache.uima.jcas.JCas)
[ERROR] method org.apache.uima.fit.util.FSCollectionFactory.createFloatArray(org.apache.uima.jcas.JCas,float...)
is not applicable
[ERROR] (argument mismatch; org.apache.uima.cas.CAS cannot be converted to org.apache.uima.jcas.JCas)
[ERROR] <https://builds.apache.org/job/UIMA-Ruta-v3/ws/trunk/ruta-core/src/main/java/org/apache/uima/ruta/RutaStream.java>:[1102,49]
no suitable method found for createFloatArray(org.apache.uima.cas.CAS,float[])
[ERROR] method org.apache.uima.fit.util.FSCollectionFactory.createFloatArray(org.apache.uima.jcas.JCas,java.util.Collection<java.lang.Float>)
is not applicable
[ERROR] (argument mismatch; org.apache.uima.cas.CAS cannot be converted to org.apache.uima.jcas.JCas)
[ERROR] method org.apache.uima.fit.util.FSCollectionFactory.createFloatArray(org.apache.uima.jcas.JCas,float...)
is not applicable
[ERROR] (argument mismatch; org.apache.uima.cas.CAS cannot be converted to org.apache.uima.jcas.JCas)
[ERROR] <https://builds.apache.org/job/UIMA-Ruta-v3/ws/trunk/ruta-core/src/main/java/org/apache/uima/ruta/RutaStream.java>:[1116,51]
no suitable method found for createBooleanArray(org.apache.uima.cas.CAS,java.util.List<java.lang.Boolean>)
[ERROR] method org.apache.uima.fit.util.FSCollectionFactory.createBooleanArray(org.apache.uima.jcas.JCas,java.util.Collection<java.lang.Boolean>)
is not applicable
[ERROR] (argument mismatch; org.apache.uima.cas.CAS cannot be converted to org.apache.uima.jcas.JCas)
[ERROR] method org.apache.uima.fit.util.FSCollectionFactory.createBooleanArray(org.apache.uima.jcas.JCas,boolean...)
is not applicable
[ERROR] (argument mismatch; org.apache.uima.cas.CAS cannot be converted to org.apache.uima.jcas.JCas)
[ERROR] <https://builds.apache.org/job/UIMA-Ruta-v3/ws/trunk/ruta-core/src/main/java/org/apache/uima/ruta/RutaStream.java>:[1121,51]
no suitable method found for createBooleanArray(org.apache.uima.cas.CAS,boolean[])
[ERROR] method org.apache.uima.fit.util.FSCollectionFactory.createBooleanArray(org.apache.uima.jcas.JCas,java.util.Collection<java.lang.Boolean>)
is not applicable
[ERROR] (argument mismatch; org.apache.uima.cas.CAS cannot be converted to org.apache.uima.jcas.JCas)
[ERROR] method org.apache.uima.fit.util.FSCollectionFactory.createBooleanArray(org.apache.uima.jcas.JCas,boolean...)
is not applicable
[ERROR] (argument mismatch; org.apache.uima.cas.CAS cannot be converted to org.apache.uima.jcas.JCas)
[ERROR] -> [Help 1]
[ERROR] 
[ERROR] To see the full stack trace of the errors, re-run Maven with the -e switch.
[ERROR] Re-run Maven using the -X switch to enable full debug logging.
[ERROR] 
[ERROR] For more information about the errors and possible solutions, please read the following
articles:
[ERROR] [Help 1] http://cwiki.apache.org/confluence/display/MAVEN/MojoFailureException
[ERROR] 
[ERROR] After correcting the problems, you can resume the build with the command
[ERROR]   mvn <goals> -rf :ruta-core
[JENKINS] Archiving <https://builds.apache.org/job/UIMA-Ruta-v3/ws/trunk/ruta-ep-parent/pom.xml>
to org.apache.uima/ruta-ep-parent/3.0.0-SNAPSHOT/ruta-ep-parent-3.0.0-SNAPSHOT.pom
[JENKINS] Archiving <https://builds.apache.org/job/UIMA-Ruta-v3/ws/trunk/ruta-core-ext/pom.xml>
to org.apache.uima/ruta-core-ext/3.0.0-SNAPSHOT/ruta-core-ext-3.0.0-SNAPSHOT.pom
[JENKINS] Archiving <https://builds.apache.org/job/UIMA-Ruta-v3/ws/trunk/ruta-ep-ide/pom.xml>
to org.apache.uima/ruta-ep-ide/3.0.0-SNAPSHOT/ruta-ep-ide-3.0.0-SNAPSHOT.pom
[JENKINS] Archiving <https://builds.apache.org/job/UIMA-Ruta-v3/ws/trunk/ruta-ep-textruler/pom.xml>
to org.apache.uima/ruta-ep-textruler/3.0.0-SNAPSHOT/ruta-ep-textruler-3.0.0-SNAPSHOT.pom
[JENKINS] Archiving <https://builds.apache.org/job/UIMA-Ruta-v3/ws/trunk/ruta-ep-addons/pom.xml>
to org.apache.uima/ruta-ep-addons/3.0.0-SNAPSHOT/ruta-ep-addons-3.0.0-SNAPSHOT.pom
[JENKINS] Archiving <https://builds.apache.org/job/UIMA-Ruta-v3/ws/trunk/ruta-core/pom.xml>
to org.apache.uima/ruta-core/3.0.0-SNAPSHOT/ruta-core-3.0.0-SNAPSHOT.pom
[JENKINS] Archiving <https://builds.apache.org/job/UIMA-Ruta-v3/ws/trunk/ruta-eclipse-feature/pom.xml>
to org.apache.uima/ruta-eclipse-feature/3.0.0-SNAPSHOT/ruta-eclipse-feature-3.0.0-SNAPSHOT.pom
[JENKINS] Archiving <https://builds.apache.org/job/UIMA-Ruta-v3/ws/trunk/example-projects/ruta-maven-example/pom.xml>
to org.apache.uima/ruta-maven-example/3.0.0-SNAPSHOT/ruta-maven-example-3.0.0-SNAPSHOT.pom
[JENKINS] Archiving <https://builds.apache.org/job/UIMA-Ruta-v3/ws/trunk/ruta-ep-caseditor/pom.xml>
to org.apache.uima/ruta-ep-caseditor/3.0.0-SNAPSHOT/ruta-ep-caseditor-3.0.0-SNAPSHOT.pom
[JENKINS] Archiving <https://builds.apache.org/job/UIMA-Ruta-v3/ws/trunk/ruta-basic-type/pom.xml>
to org.apache.uima/ruta-basic-type/3.0.0-SNAPSHOT/ruta-basic-type-3.0.0-SNAPSHOT.pom
[JENKINS] Archiving <https://builds.apache.org/job/UIMA-Ruta-v3/ws/trunk/ruta-basic-type/target/ruta-basic-type-3.0.0-SNAPSHOT.jar>
to org.apache.uima/ruta-basic-type/3.0.0-20180725.131826-75/ruta-basic-type-3.0.0-20180725.131826-75.jar
[JENKINS] Archiving <https://builds.apache.org/job/UIMA-Ruta-v3/ws/trunk/ruta-ep-core-ext/pom.xml>
to org.apache.uima/ruta-ep-core-ext/3.0.0-SNAPSHOT/ruta-ep-core-ext-3.0.0-SNAPSHOT.pom
[JENKINS] Archiving <https://builds.apache.org/job/UIMA-Ruta-v3/ws/trunk/ruta-typesystem/pom.xml>
to org.apache.uima/ruta-typesystem/3.0.0-SNAPSHOT/ruta-typesystem-3.0.0-SNAPSHOT.pom
[JENKINS] Archiving <https://builds.apache.org/job/UIMA-Ruta-v3/ws/trunk/ruta-typesystem/target/ruta-typesystem-3.0.0-SNAPSHOT.jar>
to org.apache.uima/ruta-typesystem/3.0.0-20180725.131923-73/ruta-typesystem-3.0.0-20180725.131923-73.jar
[JENKINS] Archiving <https://builds.apache.org/job/UIMA-Ruta-v3/ws/trunk/ruta-maven-archetype/pom.xml>
to org.apache.uima/ruta-maven-archetype/3.0.0-SNAPSHOT/ruta-maven-archetype-3.0.0-SNAPSHOT.pom
[JENKINS] Archiving <https://builds.apache.org/job/UIMA-Ruta-v3/ws/trunk/ruta-ep-engine/pom.xml>
to org.apache.uima/ruta-ep-engine/3.0.0-SNAPSHOT/ruta-ep-engine-3.0.0-SNAPSHOT.pom
[JENKINS] Archiving <https://builds.apache.org/job/UIMA-Ruta-v3/ws/trunk/example-projects/ruta-ep-example-extensions/pom.xml>
to org.apache.uima/ruta-ep-example-extensions/3.0.0-SNAPSHOT/ruta-ep-example-extensions-3.0.0-SNAPSHOT.pom
[JENKINS] Archiving <https://builds.apache.org/job/UIMA-Ruta-v3/ws/trunk/pom.xml> to
org.apache.uima/ruta/3.0.0-SNAPSHOT/ruta-3.0.0-SNAPSHOT.pom
[JENKINS] Archiving <https://builds.apache.org/job/UIMA-Ruta-v3/ws/trunk/ruta-parent/pom.xml>
to org.apache.uima/ruta-parent/3.0.0-SNAPSHOT/ruta-parent-3.0.0-SNAPSHOT.pom
[JENKINS] Archiving <https://builds.apache.org/job/UIMA-Ruta-v3/ws/trunk/ruta-ep-ide-ui/pom.xml>
to org.apache.uima/ruta-ep-ide-ui/3.0.0-SNAPSHOT/ruta-ep-ide-ui-3.0.0-SNAPSHOT.pom
[JENKINS] Archiving <https://builds.apache.org/job/UIMA-Ruta-v3/ws/trunk/ruta-maven-plugin/pom.xml>
to org.apache.uima/ruta-maven-plugin/3.0.0-SNAPSHOT/ruta-maven-plugin-3.0.0-SNAPSHOT.pom
[JENKINS] Archiving <https://builds.apache.org/job/UIMA-Ruta-v3/ws/trunk/ruta-docbook/pom.xml>
to org.apache.uima/ruta-docbook/3.0.0-SNAPSHOT/ruta-docbook-3.0.0-SNAPSHOT.pom
Sending e-mails to: dev@uima.apache.org
channel stopped
[WARNINGS] Skipping publisher since build result is FAILURE
[Cobertura] Publishing Cobertura coverage report...

[Cobertura] Publishing Cobertura coverage results...

[Cobertura] Cobertura coverage report found.


Mime
View raw message