uima-dev mailing list archives

Site index · List index
Message view « Date » · « Thread »
Top « Date » · « Thread »
From Apache Jenkins Server <jenk...@builds.apache.org>
Subject Build failed in Jenkins: UIMA-uima-parent-pom #81
Date Wed, 03 Oct 2018 08:08:50 GMT
See <https://builds.apache.org/job/UIMA-uima-parent-pom/81/display/redirect>

------------------------------------------
Started by user rec
[EnvInject] - Loading node environment variables.
Building remotely on ubuntu-2 (ubuntu trusty) in workspace <https://builds.apache.org/job/UIMA-uima-parent-pom/ws/>
Cleaning local Directory parent-pom
Checking out https://svn.apache.org/repos/asf/uima/build/trunk/parent-pom at revision '2018-10-03T08:07:44.913
+0000'
A         marker-file-identifying-parent-pom
A         pom.xml
A         README.txt
 U        .
At revision 1842685

Parsing POMs
using settings config with name simple-deploy-settings-no-mirror
Replacing all maven server entries not found in credentials list is true
Established TCP socket on 41554
maven35-agent.jar already up to date
maven35-interceptor.jar already up to date
maven3-interceptor-commons.jar already up to date
[parent-pom] $ /home/jenkins/tools/java/latest1.8/bin/java -Xmx800m -XX:MaxPermSize=256m -cp
/home/jenkins/jenkins-slave/maven35-agent.jar:/home/jenkins/tools/maven/latest/boot/plexus-classworlds-2.5.2.jar:/home/jenkins/tools/maven/latest/conf/logging
jenkins.maven3.agent.Maven35Main /home/jenkins/tools/maven/latest/ /home/jenkins/jenkins-slave/slave.jar
/home/jenkins/jenkins-slave/maven35-interceptor.jar /home/jenkins/jenkins-slave/maven3-interceptor-commons.jar
41554
Java HotSpot(TM) 64-Bit Server VM warning: ignoring option MaxPermSize=256m; support was removed
in 8.0
<===[JENKINS REMOTING CAPACITY]===>   channel started
using settings config with name simple-deploy-settings-no-mirror
Replacing all maven server entries not found in credentials list is true
Executing Maven:  -B -f <https://builds.apache.org/job/UIMA-uima-parent-pom/ws/parent-pom/pom.xml>
-Dmaven.repo.local=/home/jenkins/jenkins-slave/maven-repositories/0 -s /tmp/settings71430477178519967.xml
clean install
[INFO] Scanning for projects...
[WARNING] The project org.apache.uima:parent-pom:pom:13-SNAPSHOT uses prerequisites which
is only intended for maven-plugin projects but not for non maven-plugin projects. For such
purposes you should use the maven-enforcer-plugin. See https://maven.apache.org/enforcer/enforcer-rules/requireMavenVersion.html
[INFO] 
[INFO] ---------------------< org.apache.uima:parent-pom >---------------------
[INFO] Building Apache UIMA parent-pom 13-SNAPSHOT
[INFO] --------------------------------[ pom ]---------------------------------
[INFO] Downloading from central: https://repo.maven.apache.org/maven2/org/apache/maven/plugins/maven-changes-plugin/2.12.1/maven-changes-plugin-2.12.1.jar
[INFO] Downloaded from central: https://repo.maven.apache.org/maven2/org/apache/maven/plugins/maven-changes-plugin/2.12.1/maven-changes-plugin-2.12.1.jar
(223 kB at 710 kB/s)
[INFO] 
[INFO] --- maven-clean-plugin:3.1.0:clean (default-clean) @ parent-pom ---
[INFO] 
[INFO] --- build-helper-maven-plugin:3.0.0:parse-version (parse-project-version) @ parent-pom
---
[INFO] 
[INFO] --- uima-build-helper-maven-plugin:7:parse-date-time (set buildYear and buildMonth)
@ parent-pom ---
[INFO] 
[INFO] --- maven-enforcer-plugin:1.4.1:enforce (enforce-maven-version) @ parent-pom ---
[INFO] 
[INFO] --- maven-enforcer-plugin:1.4.1:enforce (enforce-versions) @ parent-pom ---
[INFO] 
[INFO] --- maven-remote-resources-plugin:1.5:process (process-resource-bundles) @ parent-pom
---
[INFO] 
[INFO] --- maven-remote-resources-plugin:1.5:process (default) @ parent-pom ---
[INFO] 
[INFO] --- maven-changes-plugin:2.12.1:jira-report (default-cli) @ parent-pom ---
[INFO] 
[INFO] --- maven-antrun-plugin:1.8:run (dup-meta-jar-cleanup) @ parent-pom ---
[INFO] Downloading from central: https://repo.maven.apache.org/maven2/ant-contrib/ant-contrib/20020829/ant-contrib-20020829.pom
[INFO] Downloaded from central: https://repo.maven.apache.org/maven2/ant-contrib/ant-contrib/20020829/ant-contrib-20020829.pom
(159 B at 1.8 kB/s)
[INFO] Downloading from central: https://repo.maven.apache.org/maven2/org/apache/ant/ant-apache-regexp/1.10.1/ant-apache-regexp-1.10.1.pom
[INFO] Downloaded from central: https://repo.maven.apache.org/maven2/org/apache/ant/ant-apache-regexp/1.10.1/ant-apache-regexp-1.10.1.pom
(2.8 kB at 50 kB/s)
[INFO] Downloading from central: https://repo.maven.apache.org/maven2/ant-contrib/ant-contrib/20020829/ant-contrib-20020829.jar
[INFO] Downloading from central: https://repo.maven.apache.org/maven2/org/apache/ant/ant-apache-regexp/1.10.1/ant-apache-regexp-1.10.1.jar
[INFO] Downloaded from central: https://repo.maven.apache.org/maven2/ant-contrib/ant-contrib/20020829/ant-contrib-20020829.jar
(9.4 kB at 407 kB/s)
[INFO] Downloaded from central: https://repo.maven.apache.org/maven2/org/apache/ant/ant-apache-regexp/1.10.1/ant-apache-regexp-1.10.1.jar
(9.7 kB at 72 kB/s)
[INFO] Executing tasks

main:
[INFO] Executed tasks
[INFO] 
[INFO] --- maven-site-plugin:3.7.1:attach-descriptor (attach-descriptor) @ parent-pom ---
[INFO] No site descriptor found: nothing to attach.
[INFO] 
[INFO] --- checksum-maven-plugin:1.8:artifacts (artifacts-checksum) @ parent-pom ---
[INFO] 
[INFO] --- maven-install-plugin:2.5.2:install (default-install) @ parent-pom ---
[INFO] Installing <https://builds.apache.org/job/UIMA-uima-parent-pom/ws/parent-pom/pom.xml>
to /home/jenkins/jenkins-slave/maven-repositories/0/org/apache/uima/parent-pom/13-SNAPSHOT/parent-pom-13-SNAPSHOT.pom
[WARNING] Attempt to (de-)serialize anonymous class hudson.maven.reporters.MavenArtifactArchiver$2;
see: https://jenkins.io/redirect/serialization-of-anonymous-classes/
[WARNING] Attempt to (de-)serialize anonymous class hudson.maven.reporters.MavenFingerprinter$1;
see: https://jenkins.io/redirect/serialization-of-anonymous-classes/
[INFO] ------------------------------------------------------------------------
[INFO] BUILD SUCCESS
[INFO] ------------------------------------------------------------------------
[INFO] Total time: 27.712 s
[INFO] Finished at: 2018-10-03T08:08:42Z
[INFO] ------------------------------------------------------------------------
Waiting for Jenkins to finish collecting data
[JENKINS] Archiving <https://builds.apache.org/job/UIMA-uima-parent-pom/ws/parent-pom/pom.xml>
to org.apache.uima/parent-pom/13-SNAPSHOT/parent-pom-13-SNAPSHOT.pom
[Fast Archiver] Compressed 128.56 KB of artifacts by 99.6% relative to #79
channel stopped
[WARNINGS] Parsing warnings in console log with parser Maven
Skipping warnings blame since Git is the only supported SCM up to now.%n
[WARNINGS] Computing warning deltas based on reference build #76
using settings config with name simple-deploy-settings-no-mirror
Replacing all maven server entries not found in credentials list is true
Maven RedeployPublisher use remote ubuntu-2 maven settings from : /tmp/settings7101948314459345123.xml
[INFO] Deployment in https://repository.apache.org/content/repositories/snapshots (id=apache.snapshots.https,uniqueVersion=true)
Deploying the main artifact parent-pom-13-SNAPSHOT.pom
Downloading: https://repository.apache.org/content/repositories/snapshots/org/apache/uima/parent-pom/13-SNAPSHOT/maven-metadata.xml
Downloaded: https://repository.apache.org/content/repositories/snapshots/org/apache/uima/parent-pom/13-SNAPSHOT/maven-metadata.xml
(596 B at 0.6 KB/sec)
Uploading: https://repository.apache.org/content/repositories/snapshots/org/apache/uima/parent-pom/13-SNAPSHOT/parent-pom-13-20181003.080847-2.pom
ERROR: Failed to deploy artifacts: Could not transfer artifact org.apache.uima:parent-pom:pom:13-20181003.080847-2
from/to apache.snapshots.https (https://repository.apache.org/content/repositories/snapshots):
Failed to transfer file: https://repository.apache.org/content/repositories/snapshots/org/apache/uima/parent-pom/13-SNAPSHOT/parent-pom-13-20181003.080847-2.pom.
Return code is: 401, ReasonPhrase: Unauthorized.
org.apache.maven.artifact.deployer.ArtifactDeploymentException: Failed to deploy artifacts:
Could not transfer artifact org.apache.uima:parent-pom:pom:13-20181003.080847-2 from/to apache.snapshots.https
(https://repository.apache.org/content/repositories/snapshots): Failed to transfer file: https://repository.apache.org/content/repositories/snapshots/org/apache/uima/parent-pom/13-SNAPSHOT/parent-pom-13-20181003.080847-2.pom.
Return code is: 401, ReasonPhrase: Unauthorized.
	at org.apache.maven.artifact.deployer.DefaultArtifactDeployer.deploy(DefaultArtifactDeployer.java:143)
	at hudson.maven.reporters.MavenArtifactRecord.deploy(MavenArtifactRecord.java:193)
	at hudson.maven.RedeployPublisher.perform(RedeployPublisher.java:176)
	at hudson.tasks.BuildStepMonitor$1.perform(BuildStepMonitor.java:20)
	at hudson.model.AbstractBuild$AbstractBuildExecution.perform(AbstractBuild.java:744)
	at hudson.model.AbstractBuild$AbstractBuildExecution.performAllBuildSteps(AbstractBuild.java:690)
	at hudson.maven.MavenModuleSetBuild$MavenModuleSetBuildExecution.post2(MavenModuleSetBuild.java:1073)
	at hudson.model.AbstractBuild$AbstractBuildExecution.post(AbstractBuild.java:635)
	at hudson.model.Run.execute(Run.java:1819)
	at hudson.maven.MavenModuleSetBuild.run(MavenModuleSetBuild.java:543)
	at hudson.model.ResourceController.execute(ResourceController.java:97)
	at hudson.model.Executor.run(Executor.java:429)
Caused by: org.eclipse.aether.deployment.DeploymentException: Failed to deploy artifacts:
Could not transfer artifact org.apache.uima:parent-pom:pom:13-20181003.080847-2 from/to apache.snapshots.https
(https://repository.apache.org/content/repositories/snapshots): Failed to transfer file: https://repository.apache.org/content/repositories/snapshots/org/apache/uima/parent-pom/13-SNAPSHOT/parent-pom-13-20181003.080847-2.pom.
Return code is: 401, ReasonPhrase: Unauthorized.
	at org.eclipse.aether.internal.impl.DefaultDeployer.deploy(DefaultDeployer.java:317)
	at org.eclipse.aether.internal.impl.DefaultDeployer.deploy(DefaultDeployer.java:245)
	at org.eclipse.aether.internal.impl.DefaultRepositorySystem.deploy(DefaultRepositorySystem.java:420)
	at org.apache.maven.artifact.deployer.DefaultArtifactDeployer.deploy(DefaultArtifactDeployer.java:139)
	... 11 more
Caused by: org.eclipse.aether.transfer.ArtifactTransferException: Could not transfer artifact
org.apache.uima:parent-pom:pom:13-20181003.080847-2 from/to apache.snapshots.https (https://repository.apache.org/content/repositories/snapshots):
Failed to transfer file: https://repository.apache.org/content/repositories/snapshots/org/apache/uima/parent-pom/13-SNAPSHOT/parent-pom-13-20181003.080847-2.pom.
Return code is: 401, ReasonPhrase: Unauthorized.
	at org.eclipse.aether.connector.basic.ArtifactTransportListener.transferFailed(ArtifactTransportListener.java:43)
	at org.eclipse.aether.connector.basic.BasicRepositoryConnector$TaskRunner.run(BasicRepositoryConnector.java:355)
	at org.eclipse.aether.connector.basic.BasicRepositoryConnector.put(BasicRepositoryConnector.java:274)
	at org.eclipse.aether.internal.impl.DefaultDeployer.deploy(DefaultDeployer.java:311)
	... 14 more
Caused by: org.apache.maven.wagon.TransferFailedException: Failed to transfer file: https://repository.apache.org/content/repositories/snapshots/org/apache/uima/parent-pom/13-SNAPSHOT/parent-pom-13-20181003.080847-2.pom.
Return code is: 401, ReasonPhrase: Unauthorized.
	at org.apache.maven.wagon.shared.http.AbstractHttpClientWagon.put(AbstractHttpClientWagon.java:635)
	at org.apache.maven.wagon.shared.http.AbstractHttpClientWagon.put(AbstractHttpClientWagon.java:557)
	at org.apache.maven.wagon.shared.http.AbstractHttpClientWagon.put(AbstractHttpClientWagon.java:539)
	at org.apache.maven.wagon.shared.http.AbstractHttpClientWagon.put(AbstractHttpClientWagon.java:533)
	at org.apache.maven.wagon.shared.http.AbstractHttpClientWagon.put(AbstractHttpClientWagon.java:513)
	at org.eclipse.aether.transport.wagon.WagonTransporter$PutTaskRunner.run(WagonTransporter.java:644)
	at org.eclipse.aether.transport.wagon.WagonTransporter.execute(WagonTransporter.java:427)
	at org.eclipse.aether.transport.wagon.WagonTransporter.put(WagonTransporter.java:410)
	at org.eclipse.aether.connector.basic.BasicRepositoryConnector$PutTaskRunner.runTask(BasicRepositoryConnector.java:510)
	at org.eclipse.aether.connector.basic.BasicRepositoryConnector$TaskRunner.run(BasicRepositoryConnector.java:350)
	... 16 more
[INFO] Deployment failed after 2.7 sec
Build step 'Deploy artifacts to Maven repository' changed build result to FAILURE

Mime
View raw message