uima-dev mailing list archives

Site index · List index
Message view « Date » · « Thread »
Top « Date » · « Thread »
From Apache Jenkins Server <jenk...@builds.apache.org>
Subject Build failed in Jenkins: UIMA-Ruta-v3 » Apache UIMA Ruta: ruta-core #75
Date Wed, 20 Mar 2019 18:46:00 GMT
See <https://builds.apache.org/job/UIMA-Ruta-v3/org.apache.uima$ruta-core/75/display/redirect>

------------------------------------------
[INFO]                                                                         
[INFO] ------------------------------------------------------------------------
[INFO] Building Apache UIMA Ruta: ruta-core 3.0.0-SNAPSHOT
[INFO] ------------------------------------------------------------------------
[INFO] Downloading: https://repo.maven.apache.org/maven2/org/eclipse/m2e/lifecycle-mapping/1.0.0/lifecycle-mapping-1.0.0.pom
[WARNING] The POM for org.eclipse.m2e:lifecycle-mapping:jar:1.0.0 is missing, no dependency
information available
[INFO] Downloading: https://repo.maven.apache.org/maven2/org/eclipse/m2e/lifecycle-mapping/1.0.0/lifecycle-mapping-1.0.0.jar
[WARNING] Failed to retrieve plugin descriptor for org.eclipse.m2e:lifecycle-mapping:1.0.0:
Plugin org.eclipse.m2e:lifecycle-mapping:1.0.0 or one of its dependencies could not be resolved:
Could not find artifact org.eclipse.m2e:lifecycle-mapping:jar:1.0.0 in central (https://repo.maven.apache.org/maven2)
[WARNING] The POM for org.eclipse.m2e:lifecycle-mapping:jar:1.0.0 is missing, no dependency
information available
[WARNING] Failed to retrieve plugin descriptor for org.eclipse.m2e:lifecycle-mapping:1.0.0:
Plugin org.eclipse.m2e:lifecycle-mapping:1.0.0 or one of its dependencies could not be resolved:
Failure to find org.eclipse.m2e:lifecycle-mapping:jar:1.0.0 in https://repo.maven.apache.org/maven2
was cached in the local repository, resolution will not be reattempted until the update interval
of central has elapsed or updates are forced
[WARNING] The POM for org.eclipse.m2e:lifecycle-mapping:jar:1.0.0 is missing, no dependency
information available
[WARNING] Failed to retrieve plugin descriptor for org.eclipse.m2e:lifecycle-mapping:1.0.0:
Plugin org.eclipse.m2e:lifecycle-mapping:1.0.0 or one of its dependencies could not be resolved:
Failure to find org.eclipse.m2e:lifecycle-mapping:jar:1.0.0 in https://repo.maven.apache.org/maven2
was cached in the local repository, resolution will not be reattempted until the update interval
of central has elapsed or updates are forced
[INFO] Downloading: http://repository.apache.org/snapshots/org/apache/uima/uimafit-core/3.0.0-SNAPSHOT/maven-metadata.xml
[INFO] Downloaded: http://repository.apache.org/snapshots/org/apache/uima/uimafit-core/3.0.0-SNAPSHOT/maven-metadata.xml
(783 B at 2.5 KB/sec)
[INFO] Downloading: http://repository.apache.org/snapshots/org/apache/uima/uimafit-core/3.0.0-SNAPSHOT/uimafit-core-3.0.0-20190320.183836-106.pom
[INFO] Downloaded: http://repository.apache.org/snapshots/org/apache/uima/uimafit-core/3.0.0-SNAPSHOT/uimafit-core-3.0.0-20190320.183836-106.pom
(7 KB at 23.1 KB/sec)
[INFO] Downloading: http://repository.apache.org/snapshots/org/apache/uima/uimafit-parent/3.0.0-SNAPSHOT/maven-metadata.xml
[INFO] Downloaded: http://repository.apache.org/snapshots/org/apache/uima/uimafit-parent/3.0.0-SNAPSHOT/maven-metadata.xml
(610 B at 2.0 KB/sec)
[INFO] Downloading: http://repository.apache.org/snapshots/org/apache/uima/uimafit-parent/3.0.0-SNAPSHOT/uimafit-parent-3.0.0-20190320.183919-103.pom
[INFO] Downloaded: http://repository.apache.org/snapshots/org/apache/uima/uimafit-parent/3.0.0-SNAPSHOT/uimafit-parent-3.0.0-20190320.183919-103.pom
(15 KB at 47.3 KB/sec)
[INFO] Downloading: http://repository.apache.org/snapshots/org/apache/uima/uimafit-core/3.0.0-SNAPSHOT/uimafit-core-3.0.0-20190320.183836-106.jar
[INFO] Downloaded: http://repository.apache.org/snapshots/org/apache/uima/uimafit-core/3.0.0-SNAPSHOT/uimafit-core-3.0.0-20190320.183836-106.jar
(172 KB at 348.5 KB/sec)
[INFO] 
[INFO] --- maven-clean-plugin:3.1.0:clean (default-clean) @ ruta-core ---
[TASKS] Scanning folder '<https://builds.apache.org/job/UIMA-Ruta-v3/org.apache.uima$ruta-core/ws/'>
for files matching the pattern '**/*.java' - excludes: 
[TASKS] Found 501 files to scan for tasks
Found 67 open tasks.
[TASKS] Computing warning deltas based on reference build #73
[INFO] 
[INFO] --- build-helper-maven-plugin:3.0.0:parse-version (parse-project-version) @ ruta-core
---
[INFO] 
[INFO] --- uima-build-helper-maven-plugin:7:parse-date-time (set buildYear and buildMonth)
@ ruta-core ---
[INFO] 
[INFO] --- maven-enforcer-plugin:3.0.0-M2:enforce (enforce-maven-version) @ ruta-core ---
[INFO] 
[INFO] --- maven-enforcer-plugin:3.0.0-M2:enforce (enforce-versions) @ ruta-core ---
[INFO] 
[INFO] --- antlr3-maven-plugin:3.5.2:antlr (run antlr) @ ruta-core ---
[INFO] ANTLR: Processing source directory <https://builds.apache.org/job/UIMA-Ruta-v3/org.apache.uima$ruta-core/ws/src/main/antlr3>
ANTLR Parser Generator  Version 3.5.2
Output file <https://builds.apache.org/job/UIMA-Ruta-v3/org.apache.uima$ruta-core/ws/target/generated-sources/antlr3/org/apache/uima/ruta/parser/RutaLexer.java>
does not exist: must build <https://builds.apache.org/job/UIMA-Ruta-v3/org.apache.uima$ruta-core/ws/src/main/antlr3/org/apache/uima/ruta/parser/RutaLexer.g>
org/apache/uima/ruta/parser/RutaLexer.g
Output file <https://builds.apache.org/job/UIMA-Ruta-v3/org.apache.uima$ruta-core/ws/target/generated-sources/antlr3/org/apache/uima/ruta/parser/RutaParser.java>
does not exist: must build <https://builds.apache.org/job/UIMA-Ruta-v3/org.apache.uima$ruta-core/ws/src/main/antlr3/org/apache/uima/ruta/parser/RutaParser.g>
org/apache/uima/ruta/parser/RutaParser.g
[INFO] 
[INFO] --- build-helper-maven-plugin:3.0.0:add-source (add-source) @ ruta-core ---
[INFO] Source directory: <https://builds.apache.org/job/UIMA-Ruta-v3/org.apache.uima$ruta-core/ws/target/generated-sources/jflex>
added.
[INFO] 
[INFO] --- jflex-maven-plugin:1.6.1:generate (default) @ ruta-core ---

Warning : Macro "WHITE_SPACE_CHAR" has been declared but never used.
[INFO]   generated <https://builds.apache.org/job/UIMA-Ruta-v3/org.apache.uima$ruta-core/ws/target/generated-sources/jflex/org/apache/uima/ruta/seed/SeedLexer.java>
[INFO] 
[INFO] --- maven-remote-resources-plugin:1.5:process (process-resource-bundles) @ ruta-core
---
[INFO] 
[INFO] --- maven-remote-resources-plugin:1.5:process (default) @ ruta-core ---
[INFO] 
[INFO] --- maven-resources-plugin:3.1.0:resources (default-resources) @ ruta-core ---
[INFO] Using 'UTF-8' encoding to copy filtered resources.
[INFO] Copying 14 resources
[INFO] Copying 3 resources
[INFO] Copying 3 resources
[INFO] 
[INFO] --- maven-compiler-plugin:3.8.0:compile (default-compile) @ ruta-core ---
[INFO] Changes detected - recompiling the module!
[INFO] Compiling 311 source files to <https://builds.apache.org/job/UIMA-Ruta-v3/org.apache.uima$ruta-core/ws/target/classes>
[INFO] <https://builds.apache.org/job/UIMA-Ruta-v3/org.apache.uima$ruta-core/ws/src/main/java/org/apache/uima/ruta/engine/Ruta.java>:
<https://builds.apache.org/job/UIMA-Ruta-v3/org.apache.uima$ruta-core/ws/src/main/java/org/apache/uima/ruta/engine/Ruta.java>
uses or overrides a deprecated API.
[INFO] <https://builds.apache.org/job/UIMA-Ruta-v3/org.apache.uima$ruta-core/ws/src/main/java/org/apache/uima/ruta/engine/Ruta.java>:
Recompile with -Xlint:deprecation for details.
[INFO] <https://builds.apache.org/job/UIMA-Ruta-v3/org.apache.uima$ruta-core/ws/target/generated-sources/antlr3/org/apache/uima/ruta/parser/RutaParser.java>:
Some input files use unchecked or unsafe operations.
[INFO] <https://builds.apache.org/job/UIMA-Ruta-v3/org.apache.uima$ruta-core/ws/target/generated-sources/antlr3/org/apache/uima/ruta/parser/RutaParser.java>:
Recompile with -Xlint:unchecked for details.
[INFO] -------------------------------------------------------------
[ERROR] COMPILATION ERROR : 
[INFO] -------------------------------------------------------------
[ERROR] <https://builds.apache.org/job/UIMA-Ruta-v3/org.apache.uima$ruta-core/ws/src/main/java/org/apache/uima/ruta/rule/quantifier/AbstractRuleElementQuantifier.java>:[24,31]
package org.apache.commons.lang does not exist
[ERROR] <https://builds.apache.org/job/UIMA-Ruta-v3/org.apache.uima$ruta-core/ws/src/main/java/org/apache/uima/ruta/rule/AnnotationListFSIterator.java>:[25,31]
package org.apache.commons.lang does not exist
[ERROR] <https://builds.apache.org/job/UIMA-Ruta-v3/org.apache.uima$ruta-core/ws/src/main/java/org/apache/uima/ruta/engine/RutaEngine.java>:[41,31]
package org.apache.commons.lang does not exist
[ERROR] <https://builds.apache.org/job/UIMA-Ruta-v3/org.apache.uima$ruta-core/ws/src/main/java/org/apache/uima/ruta/constraint/BasicTypeConstraint.java>:[25,31]
package org.apache.commons.lang does not exist
[ERROR] <https://builds.apache.org/job/UIMA-Ruta-v3/org.apache.uima$ruta-core/ws/src/main/java/org/apache/uima/ruta/rule/quantifier/AbstractRuleElementQuantifier.java>:[82,10]
cannot find symbol
  symbol:   variable StringUtils
  location: class org.apache.uima.ruta.rule.quantifier.AbstractRuleElementQuantifier
[ERROR] <https://builds.apache.org/job/UIMA-Ruta-v3/org.apache.uima$ruta-core/ws/src/main/java/org/apache/uima/ruta/rule/AnnotationListFSIterator.java>:[98,15]
cannot find symbol
  symbol:   class NotImplementedException
  location: class org.apache.uima.ruta.rule.AnnotationListFSIterator
[ERROR] <https://builds.apache.org/job/UIMA-Ruta-v3/org.apache.uima$ruta-core/ws/src/main/java/org/apache/uima/ruta/rule/AnnotationListFSIterator.java>:[103,15]
cannot find symbol
  symbol:   class NotImplementedException
  location: class org.apache.uima.ruta.rule.AnnotationListFSIterator
[ERROR] <https://builds.apache.org/job/UIMA-Ruta-v3/org.apache.uima$ruta-core/ws/src/main/java/org/apache/uima/ruta/rule/AnnotationListFSIterator.java>:[108,15]
cannot find symbol
  symbol:   class NotImplementedException
  location: class org.apache.uima.ruta.rule.AnnotationListFSIterator
[ERROR] <https://builds.apache.org/job/UIMA-Ruta-v3/org.apache.uima$ruta-core/ws/src/main/java/org/apache/uima/ruta/rule/AnnotationListFSIterator.java>:[113,15]
cannot find symbol
  symbol:   class NotImplementedException
  location: class org.apache.uima.ruta.rule.AnnotationListFSIterator
[ERROR] <https://builds.apache.org/job/UIMA-Ruta-v3/org.apache.uima$ruta-core/ws/src/main/java/org/apache/uima/ruta/rule/AnnotationListFSIterator.java>:[118,15]
cannot find symbol
  symbol:   class NotImplementedException
  location: class org.apache.uima.ruta.rule.AnnotationListFSIterator
[ERROR] <https://builds.apache.org/job/UIMA-Ruta-v3/org.apache.uima$ruta-core/ws/src/main/java/org/apache/uima/ruta/rule/AnnotationListFSIterator.java>:[123,15]
cannot find symbol
  symbol:   class NotImplementedException
  location: class org.apache.uima.ruta.rule.AnnotationListFSIterator
[ERROR] <https://builds.apache.org/job/UIMA-Ruta-v3/org.apache.uima$ruta-core/ws/src/main/java/org/apache/uima/ruta/rule/AnnotationListFSIterator.java>:[128,15]
cannot find symbol
  symbol:   class NotImplementedException
  location: class org.apache.uima.ruta.rule.AnnotationListFSIterator
[ERROR] <https://builds.apache.org/job/UIMA-Ruta-v3/org.apache.uima$ruta-core/ws/src/main/java/org/apache/uima/ruta/rule/AnnotationListFSIterator.java>:[133,15]
cannot find symbol
  symbol:   class NotImplementedException
  location: class org.apache.uima.ruta.rule.AnnotationListFSIterator
[ERROR] <https://builds.apache.org/job/UIMA-Ruta-v3/org.apache.uima$ruta-core/ws/src/main/java/org/apache/uima/ruta/rule/AnnotationListFSIterator.java>:[138,15]
cannot find symbol
  symbol:   class NotImplementedException
  location: class org.apache.uima.ruta.rule.AnnotationListFSIterator
[ERROR] <https://builds.apache.org/job/UIMA-Ruta-v3/org.apache.uima$ruta-core/ws/src/main/java/org/apache/uima/ruta/rule/AnnotationListFSIterator.java>:[143,15]
cannot find symbol
  symbol:   class NotImplementedException
  location: class org.apache.uima.ruta.rule.AnnotationListFSIterator
[ERROR] <https://builds.apache.org/job/UIMA-Ruta-v3/org.apache.uima$ruta-core/ws/src/main/java/org/apache/uima/ruta/rule/AnnotationListFSIterator.java>:[148,15]
cannot find symbol
  symbol:   class NotImplementedException
  location: class org.apache.uima.ruta.rule.AnnotationListFSIterator
[ERROR] <https://builds.apache.org/job/UIMA-Ruta-v3/org.apache.uima$ruta-core/ws/src/main/java/org/apache/uima/ruta/rule/AnnotationListFSIterator.java>:[153,15]
cannot find symbol
  symbol:   class NotImplementedException
  location: class org.apache.uima.ruta.rule.AnnotationListFSIterator
[ERROR] <https://builds.apache.org/job/UIMA-Ruta-v3/org.apache.uima$ruta-core/ws/src/main/java/org/apache/uima/ruta/rule/AnnotationListFSIterator.java>:[158,15]
cannot find symbol
  symbol:   class NotImplementedException
  location: class org.apache.uima.ruta.rule.AnnotationListFSIterator
[ERROR] <https://builds.apache.org/job/UIMA-Ruta-v3/org.apache.uima$ruta-core/ws/src/main/java/org/apache/uima/ruta/rule/AnnotationListFSIterator.java>:[163,15]
cannot find symbol
  symbol:   class NotImplementedException
  location: class org.apache.uima.ruta.rule.AnnotationListFSIterator
[ERROR] <https://builds.apache.org/job/UIMA-Ruta-v3/org.apache.uima$ruta-core/ws/src/main/java/org/apache/uima/ruta/rule/AnnotationListFSIterator.java>:[168,15]
cannot find symbol
  symbol:   class NotImplementedException
  location: class org.apache.uima.ruta.rule.AnnotationListFSIterator
[ERROR] <https://builds.apache.org/job/UIMA-Ruta-v3/org.apache.uima$ruta-core/ws/src/main/java/org/apache/uima/ruta/rule/AnnotationListFSIterator.java>:[173,15]
cannot find symbol
  symbol:   class NotImplementedException
  location: class org.apache.uima.ruta.rule.AnnotationListFSIterator
[ERROR] <https://builds.apache.org/job/UIMA-Ruta-v3/org.apache.uima$ruta-core/ws/src/main/java/org/apache/uima/ruta/rule/AnnotationListFSIterator.java>:[178,15]
cannot find symbol
  symbol:   class NotImplementedException
  location: class org.apache.uima.ruta.rule.AnnotationListFSIterator
[ERROR] <https://builds.apache.org/job/UIMA-Ruta-v3/org.apache.uima$ruta-core/ws/src/main/java/org/apache/uima/ruta/rule/AnnotationListFSIterator.java>:[183,15]
cannot find symbol
  symbol:   class NotImplementedException
  location: class org.apache.uima.ruta.rule.AnnotationListFSIterator
[ERROR] <https://builds.apache.org/job/UIMA-Ruta-v3/org.apache.uima$ruta-core/ws/src/main/java/org/apache/uima/ruta/engine/RutaEngine.java>:[658,10]
cannot find symbol
  symbol:   variable StringUtils
  location: class org.apache.uima.ruta.engine.RutaEngine
[ERROR] <https://builds.apache.org/job/UIMA-Ruta-v3/org.apache.uima$ruta-core/ws/src/main/java/org/apache/uima/ruta/engine/RutaEngine.java>:[857,46]
cannot find symbol
  symbol:   variable StringUtils
  location: class org.apache.uima.ruta.engine.RutaEngine
[ERROR] <https://builds.apache.org/job/UIMA-Ruta-v3/org.apache.uima$ruta-core/ws/src/main/java/org/apache/uima/ruta/engine/RutaEngine.java>:[881,43]
cannot find symbol
  symbol:   variable StringUtils
  location: class org.apache.uima.ruta.engine.RutaEngine
[ERROR] <https://builds.apache.org/job/UIMA-Ruta-v3/org.apache.uima$ruta-core/ws/src/main/java/org/apache/uima/ruta/engine/RutaEngine.java>:[928,44]
cannot find symbol
  symbol:   variable StringUtils
  location: class org.apache.uima.ruta.engine.RutaEngine
[ERROR] <https://builds.apache.org/job/UIMA-Ruta-v3/org.apache.uima$ruta-core/ws/src/main/java/org/apache/uima/ruta/engine/RutaEngine.java>:[966,56]
cannot find symbol
  symbol:   variable StringUtils
  location: class org.apache.uima.ruta.engine.RutaEngine
[ERROR] <https://builds.apache.org/job/UIMA-Ruta-v3/org.apache.uima$ruta-core/ws/src/main/java/org/apache/uima/ruta/engine/RutaEngine.java>:[968,29]
cannot find symbol
  symbol:   variable StringUtils
  location: class org.apache.uima.ruta.engine.RutaEngine
[ERROR] <https://builds.apache.org/job/UIMA-Ruta-v3/org.apache.uima$ruta-core/ws/src/main/java/org/apache/uima/ruta/engine/RutaEngine.java>:[1092,22]
cannot find symbol
  symbol:   variable StringUtils
  location: class org.apache.uima.ruta.engine.RutaEngine
[ERROR] <https://builds.apache.org/job/UIMA-Ruta-v3/org.apache.uima$ruta-core/ws/src/main/java/org/apache/uima/ruta/constraint/BasicTypeConstraint.java>:[62,15]
cannot find symbol
  symbol:   class NotImplementedException
  location: class org.apache.uima.ruta.constraint.BasicTypeConstraint
[INFO] 31 errors 
[INFO] -------------------------------------------------------------

Mime
View raw message