uima-dev mailing list archives

Site index · List index
Message view « Date » · « Thread »
Top « Date » · « Thread »
From Apache Jenkins Server <jenk...@builds.apache.org>
Subject Build failed in Jenkins: UIMA-Ruta-v3 #74
Date Wed, 20 Mar 2019 18:40:11 GMT
See <https://builds.apache.org/job/UIMA-Ruta-v3/74/display/redirect>

------------------------------------------
[...truncated 634.88 KB...]
[INFO] <https://builds.apache.org/job/UIMA-Ruta-v3/ws/trunk/ruta-core/target/generated-sources/antlr3/org/apache/uima/ruta/parser/RutaParser.java>:
Some input files use unchecked or unsafe operations.
[INFO] <https://builds.apache.org/job/UIMA-Ruta-v3/ws/trunk/ruta-core/target/generated-sources/antlr3/org/apache/uima/ruta/parser/RutaParser.java>:
Recompile with -Xlint:unchecked for details.
[INFO] -------------------------------------------------------------
[ERROR] COMPILATION ERROR : 
[INFO] -------------------------------------------------------------
[ERROR] <https://builds.apache.org/job/UIMA-Ruta-v3/ws/trunk/ruta-core/src/main/java/org/apache/uima/ruta/rule/quantifier/AbstractRuleElementQuantifier.java>:[24,31]
package org.apache.commons.lang does not exist
[ERROR] <https://builds.apache.org/job/UIMA-Ruta-v3/ws/trunk/ruta-core/src/main/java/org/apache/uima/ruta/rule/AnnotationListFSIterator.java>:[25,31]
package org.apache.commons.lang does not exist
[ERROR] <https://builds.apache.org/job/UIMA-Ruta-v3/ws/trunk/ruta-core/src/main/java/org/apache/uima/ruta/engine/RutaEngine.java>:[41,31]
package org.apache.commons.lang does not exist
[ERROR] <https://builds.apache.org/job/UIMA-Ruta-v3/ws/trunk/ruta-core/src/main/java/org/apache/uima/ruta/constraint/BasicTypeConstraint.java>:[25,31]
package org.apache.commons.lang does not exist
[ERROR] <https://builds.apache.org/job/UIMA-Ruta-v3/ws/trunk/ruta-core/src/main/java/org/apache/uima/ruta/rule/quantifier/AbstractRuleElementQuantifier.java>:[82,10]
cannot find symbol
  symbol:   variable StringUtils
  location: class org.apache.uima.ruta.rule.quantifier.AbstractRuleElementQuantifier
[ERROR] <https://builds.apache.org/job/UIMA-Ruta-v3/ws/trunk/ruta-core/src/main/java/org/apache/uima/ruta/rule/AnnotationListFSIterator.java>:[98,15]
cannot find symbol
  symbol:   class NotImplementedException
  location: class org.apache.uima.ruta.rule.AnnotationListFSIterator
[ERROR] <https://builds.apache.org/job/UIMA-Ruta-v3/ws/trunk/ruta-core/src/main/java/org/apache/uima/ruta/rule/AnnotationListFSIterator.java>:[103,15]
cannot find symbol
  symbol:   class NotImplementedException
  location: class org.apache.uima.ruta.rule.AnnotationListFSIterator
[ERROR] <https://builds.apache.org/job/UIMA-Ruta-v3/ws/trunk/ruta-core/src/main/java/org/apache/uima/ruta/rule/AnnotationListFSIterator.java>:[108,15]
cannot find symbol
  symbol:   class NotImplementedException
  location: class org.apache.uima.ruta.rule.AnnotationListFSIterator
[ERROR] <https://builds.apache.org/job/UIMA-Ruta-v3/ws/trunk/ruta-core/src/main/java/org/apache/uima/ruta/rule/AnnotationListFSIterator.java>:[113,15]
cannot find symbol
  symbol:   class NotImplementedException
  location: class org.apache.uima.ruta.rule.AnnotationListFSIterator
[ERROR] <https://builds.apache.org/job/UIMA-Ruta-v3/ws/trunk/ruta-core/src/main/java/org/apache/uima/ruta/rule/AnnotationListFSIterator.java>:[118,15]
cannot find symbol
  symbol:   class NotImplementedException
  location: class org.apache.uima.ruta.rule.AnnotationListFSIterator
[ERROR] <https://builds.apache.org/job/UIMA-Ruta-v3/ws/trunk/ruta-core/src/main/java/org/apache/uima/ruta/rule/AnnotationListFSIterator.java>:[123,15]
cannot find symbol
  symbol:   class NotImplementedException
  location: class org.apache.uima.ruta.rule.AnnotationListFSIterator
[ERROR] <https://builds.apache.org/job/UIMA-Ruta-v3/ws/trunk/ruta-core/src/main/java/org/apache/uima/ruta/rule/AnnotationListFSIterator.java>:[128,15]
cannot find symbol
  symbol:   class NotImplementedException
  location: class org.apache.uima.ruta.rule.AnnotationListFSIterator
[ERROR] <https://builds.apache.org/job/UIMA-Ruta-v3/ws/trunk/ruta-core/src/main/java/org/apache/uima/ruta/rule/AnnotationListFSIterator.java>:[133,15]
cannot find symbol
  symbol:   class NotImplementedException
  location: class org.apache.uima.ruta.rule.AnnotationListFSIterator
[ERROR] <https://builds.apache.org/job/UIMA-Ruta-v3/ws/trunk/ruta-core/src/main/java/org/apache/uima/ruta/rule/AnnotationListFSIterator.java>:[138,15]
cannot find symbol
  symbol:   class NotImplementedException
  location: class org.apache.uima.ruta.rule.AnnotationListFSIterator
[ERROR] <https://builds.apache.org/job/UIMA-Ruta-v3/ws/trunk/ruta-core/src/main/java/org/apache/uima/ruta/rule/AnnotationListFSIterator.java>:[143,15]
cannot find symbol
  symbol:   class NotImplementedException
  location: class org.apache.uima.ruta.rule.AnnotationListFSIterator
[ERROR] <https://builds.apache.org/job/UIMA-Ruta-v3/ws/trunk/ruta-core/src/main/java/org/apache/uima/ruta/rule/AnnotationListFSIterator.java>:[148,15]
cannot find symbol
  symbol:   class NotImplementedException
  location: class org.apache.uima.ruta.rule.AnnotationListFSIterator
[ERROR] <https://builds.apache.org/job/UIMA-Ruta-v3/ws/trunk/ruta-core/src/main/java/org/apache/uima/ruta/rule/AnnotationListFSIterator.java>:[153,15]
cannot find symbol
  symbol:   class NotImplementedException
  location: class org.apache.uima.ruta.rule.AnnotationListFSIterator
[ERROR] <https://builds.apache.org/job/UIMA-Ruta-v3/ws/trunk/ruta-core/src/main/java/org/apache/uima/ruta/rule/AnnotationListFSIterator.java>:[158,15]
cannot find symbol
  symbol:   class NotImplementedException
  location: class org.apache.uima.ruta.rule.AnnotationListFSIterator
[ERROR] <https://builds.apache.org/job/UIMA-Ruta-v3/ws/trunk/ruta-core/src/main/java/org/apache/uima/ruta/rule/AnnotationListFSIterator.java>:[163,15]
cannot find symbol
  symbol:   class NotImplementedException
  location: class org.apache.uima.ruta.rule.AnnotationListFSIterator
[ERROR] <https://builds.apache.org/job/UIMA-Ruta-v3/ws/trunk/ruta-core/src/main/java/org/apache/uima/ruta/rule/AnnotationListFSIterator.java>:[168,15]
cannot find symbol
  symbol:   class NotImplementedException
  location: class org.apache.uima.ruta.rule.AnnotationListFSIterator
[ERROR] <https://builds.apache.org/job/UIMA-Ruta-v3/ws/trunk/ruta-core/src/main/java/org/apache/uima/ruta/rule/AnnotationListFSIterator.java>:[173,15]
cannot find symbol
  symbol:   class NotImplementedException
  location: class org.apache.uima.ruta.rule.AnnotationListFSIterator
[ERROR] <https://builds.apache.org/job/UIMA-Ruta-v3/ws/trunk/ruta-core/src/main/java/org/apache/uima/ruta/rule/AnnotationListFSIterator.java>:[178,15]
cannot find symbol
  symbol:   class NotImplementedException
  location: class org.apache.uima.ruta.rule.AnnotationListFSIterator
[ERROR] <https://builds.apache.org/job/UIMA-Ruta-v3/ws/trunk/ruta-core/src/main/java/org/apache/uima/ruta/rule/AnnotationListFSIterator.java>:[183,15]
cannot find symbol
  symbol:   class NotImplementedException
  location: class org.apache.uima.ruta.rule.AnnotationListFSIterator
[ERROR] <https://builds.apache.org/job/UIMA-Ruta-v3/ws/trunk/ruta-core/src/main/java/org/apache/uima/ruta/engine/RutaEngine.java>:[658,10]
cannot find symbol
  symbol:   variable StringUtils
  location: class org.apache.uima.ruta.engine.RutaEngine
[ERROR] <https://builds.apache.org/job/UIMA-Ruta-v3/ws/trunk/ruta-core/src/main/java/org/apache/uima/ruta/engine/RutaEngine.java>:[857,46]
cannot find symbol
  symbol:   variable StringUtils
  location: class org.apache.uima.ruta.engine.RutaEngine
[ERROR] <https://builds.apache.org/job/UIMA-Ruta-v3/ws/trunk/ruta-core/src/main/java/org/apache/uima/ruta/engine/RutaEngine.java>:[881,43]
cannot find symbol
  symbol:   variable StringUtils
  location: class org.apache.uima.ruta.engine.RutaEngine
[ERROR] <https://builds.apache.org/job/UIMA-Ruta-v3/ws/trunk/ruta-core/src/main/java/org/apache/uima/ruta/engine/RutaEngine.java>:[928,44]
cannot find symbol
  symbol:   variable StringUtils
  location: class org.apache.uima.ruta.engine.RutaEngine
[ERROR] <https://builds.apache.org/job/UIMA-Ruta-v3/ws/trunk/ruta-core/src/main/java/org/apache/uima/ruta/engine/RutaEngine.java>:[966,56]
cannot find symbol
  symbol:   variable StringUtils
  location: class org.apache.uima.ruta.engine.RutaEngine
[ERROR] <https://builds.apache.org/job/UIMA-Ruta-v3/ws/trunk/ruta-core/src/main/java/org/apache/uima/ruta/engine/RutaEngine.java>:[968,29]
cannot find symbol
  symbol:   variable StringUtils
  location: class org.apache.uima.ruta.engine.RutaEngine
[ERROR] <https://builds.apache.org/job/UIMA-Ruta-v3/ws/trunk/ruta-core/src/main/java/org/apache/uima/ruta/engine/RutaEngine.java>:[1092,22]
cannot find symbol
  symbol:   variable StringUtils
  location: class org.apache.uima.ruta.engine.RutaEngine
[ERROR] <https://builds.apache.org/job/UIMA-Ruta-v3/ws/trunk/ruta-core/src/main/java/org/apache/uima/ruta/constraint/BasicTypeConstraint.java>:[62,15]
cannot find symbol
  symbol:   class NotImplementedException
  location: class org.apache.uima.ruta.constraint.BasicTypeConstraint
[INFO] 31 errors 
[INFO] -------------------------------------------------------------
[INFO] ------------------------------------------------------------------------
[INFO] Reactor Summary:
[INFO] 
[INFO] Apache UIMA Ruta: ruta-parent ...................... SUCCESS [01:32 min]
[INFO] Apache UIMA Ruta: ruta-basic-type .................. SUCCESS [ 53.090 s]
[INFO] Apache UIMA Ruta: ruta-typesystem .................. SUCCESS [01:19 min]
[INFO] Apache UIMA Ruta: ruta-core ........................ FAILURE [ 34.328 s]
[INFO] Apache UIMA Ruta: ruta-core-ext .................... SKIPPED
[INFO] Apache UIMA Ruta: ruta-ep-parent ................... SKIPPED
[INFO] Apache UIMA Ruta Eclipse: ruta-ep-engine ........... SKIPPED
[INFO] Apache UIMA Ruta Eclipse: ruta-ep-ide .............. SKIPPED
[INFO] Apache UIMA Ruta Eclipse: ruta-ep-ide-ui ........... SKIPPED
[INFO] Apache UIMA Ruta Eclipse: ruta-ep-caseditor ........ SKIPPED
[INFO] Apache UIMA Ruta Eclipse: ruta-ep-addons ........... SKIPPED
[INFO] Apache UIMA Ruta Eclipse: ruta-ep-textruler ........ SKIPPED
[INFO] Apache UIMA Ruta Eclipse: ruta-ep-core-ext ......... SKIPPED
[INFO] Apache UIMA Maven: ruta-maven-plugin ............... SKIPPED
[INFO] Apache UIMA Maven: ruta-maven-archetype ............ SKIPPED
[INFO] Apache UIMA Ruta Documentation ..................... SKIPPED
[INFO] Apache UIMA Ruta Eclipse: ruta-eclipse-feature ..... SKIPPED
[INFO] Apache UIMA Ruta: ruta-ep-example-extensions ....... SKIPPED
[INFO] Apache UIMA Ruta: ruta-maven-example ............... SKIPPED
[INFO] Apache UIMA Ruta: ruta ............................. SKIPPED
[INFO] ------------------------------------------------------------------------
[INFO] BUILD FAILURE
[INFO] ------------------------------------------------------------------------
[INFO] Total time: 04:55 min
[INFO] Finished at: 2019-03-20T18:38:52+00:00
[INFO] Final Memory: 73M/443M
[INFO] ------------------------------------------------------------------------
[ERROR] Failed to execute goal org.apache.maven.plugins:maven-compiler-plugin:3.8.0:compile
(default-compile) on project ruta-core: Compilation failure: Compilation failure:
[ERROR] <https://builds.apache.org/job/UIMA-Ruta-v3/ws/trunk/ruta-core/src/main/java/org/apache/uima/ruta/rule/quantifier/AbstractRuleElementQuantifier.java>:[24,31]
package org.apache.commons.lang does not exist
[ERROR] <https://builds.apache.org/job/UIMA-Ruta-v3/ws/trunk/ruta-core/src/main/java/org/apache/uima/ruta/rule/AnnotationListFSIterator.java>:[25,31]
package org.apache.commons.lang does not exist
[ERROR] <https://builds.apache.org/job/UIMA-Ruta-v3/ws/trunk/ruta-core/src/main/java/org/apache/uima/ruta/engine/RutaEngine.java>:[41,31]
package org.apache.commons.lang does not exist
[ERROR] <https://builds.apache.org/job/UIMA-Ruta-v3/ws/trunk/ruta-core/src/main/java/org/apache/uima/ruta/constraint/BasicTypeConstraint.java>:[25,31]
package org.apache.commons.lang does not exist
[ERROR] <https://builds.apache.org/job/UIMA-Ruta-v3/ws/trunk/ruta-core/src/main/java/org/apache/uima/ruta/rule/quantifier/AbstractRuleElementQuantifier.java>:[82,10]
cannot find symbol
[ERROR] symbol:   variable StringUtils
[ERROR] location: class org.apache.uima.ruta.rule.quantifier.AbstractRuleElementQuantifier
[ERROR] <https://builds.apache.org/job/UIMA-Ruta-v3/ws/trunk/ruta-core/src/main/java/org/apache/uima/ruta/rule/AnnotationListFSIterator.java>:[98,15]
cannot find symbol
[ERROR] symbol:   class NotImplementedException
[ERROR] location: class org.apache.uima.ruta.rule.AnnotationListFSIterator
[ERROR] <https://builds.apache.org/job/UIMA-Ruta-v3/ws/trunk/ruta-core/src/main/java/org/apache/uima/ruta/rule/AnnotationListFSIterator.java>:[103,15]
cannot find symbol
[ERROR] symbol:   class NotImplementedException
[ERROR] location: class org.apache.uima.ruta.rule.AnnotationListFSIterator
[ERROR] <https://builds.apache.org/job/UIMA-Ruta-v3/ws/trunk/ruta-core/src/main/java/org/apache/uima/ruta/rule/AnnotationListFSIterator.java>:[108,15]
cannot find symbol
[ERROR] symbol:   class NotImplementedException
[ERROR] location: class org.apache.uima.ruta.rule.AnnotationListFSIterator
[ERROR] <https://builds.apache.org/job/UIMA-Ruta-v3/ws/trunk/ruta-core/src/main/java/org/apache/uima/ruta/rule/AnnotationListFSIterator.java>:[113,15]
cannot find symbol
[ERROR] symbol:   class NotImplementedException
[ERROR] location: class org.apache.uima.ruta.rule.AnnotationListFSIterator
[ERROR] <https://builds.apache.org/job/UIMA-Ruta-v3/ws/trunk/ruta-core/src/main/java/org/apache/uima/ruta/rule/AnnotationListFSIterator.java>:[118,15]
cannot find symbol
[ERROR] symbol:   class NotImplementedException
[ERROR] location: class org.apache.uima.ruta.rule.AnnotationListFSIterator
[ERROR] <https://builds.apache.org/job/UIMA-Ruta-v3/ws/trunk/ruta-core/src/main/java/org/apache/uima/ruta/rule/AnnotationListFSIterator.java>:[123,15]
cannot find symbol
[ERROR] symbol:   class NotImplementedException
[ERROR] location: class org.apache.uima.ruta.rule.AnnotationListFSIterator
[ERROR] <https://builds.apache.org/job/UIMA-Ruta-v3/ws/trunk/ruta-core/src/main/java/org/apache/uima/ruta/rule/AnnotationListFSIterator.java>:[128,15]
cannot find symbol
[ERROR] symbol:   class NotImplementedException
[ERROR] location: class org.apache.uima.ruta.rule.AnnotationListFSIterator
[ERROR] <https://builds.apache.org/job/UIMA-Ruta-v3/ws/trunk/ruta-core/src/main/java/org/apache/uima/ruta/rule/AnnotationListFSIterator.java>:[133,15]
cannot find symbol
[ERROR] symbol:   class NotImplementedException
[ERROR] location: class org.apache.uima.ruta.rule.AnnotationListFSIterator
[ERROR] <https://builds.apache.org/job/UIMA-Ruta-v3/ws/trunk/ruta-core/src/main/java/org/apache/uima/ruta/rule/AnnotationListFSIterator.java>:[138,15]
cannot find symbol
[ERROR] symbol:   class NotImplementedException
[ERROR] location: class org.apache.uima.ruta.rule.AnnotationListFSIterator
[ERROR] <https://builds.apache.org/job/UIMA-Ruta-v3/ws/trunk/ruta-core/src/main/java/org/apache/uima/ruta/rule/AnnotationListFSIterator.java>:[143,15]
cannot find symbol
[ERROR] symbol:   class NotImplementedException
[ERROR] location: class org.apache.uima.ruta.rule.AnnotationListFSIterator
[ERROR] <https://builds.apache.org/job/UIMA-Ruta-v3/ws/trunk/ruta-core/src/main/java/org/apache/uima/ruta/rule/AnnotationListFSIterator.java>:[148,15]
cannot find symbol
[ERROR] symbol:   class NotImplementedException
[ERROR] location: class org.apache.uima.ruta.rule.AnnotationListFSIterator
[ERROR] <https://builds.apache.org/job/UIMA-Ruta-v3/ws/trunk/ruta-core/src/main/java/org/apache/uima/ruta/rule/AnnotationListFSIterator.java>:[153,15]
cannot find symbol
[ERROR] symbol:   class NotImplementedException
[ERROR] location: class org.apache.uima.ruta.rule.AnnotationListFSIterator
[ERROR] <https://builds.apache.org/job/UIMA-Ruta-v3/ws/trunk/ruta-core/src/main/java/org/apache/uima/ruta/rule/AnnotationListFSIterator.java>:[158,15]
cannot find symbol
[ERROR] symbol:   class NotImplementedException
[ERROR] location: class org.apache.uima.ruta.rule.AnnotationListFSIterator
[ERROR] <https://builds.apache.org/job/UIMA-Ruta-v3/ws/trunk/ruta-core/src/main/java/org/apache/uima/ruta/rule/AnnotationListFSIterator.java>:[163,15]
cannot find symbol
[ERROR] symbol:   class NotImplementedException
[ERROR] location: class org.apache.uima.ruta.rule.AnnotationListFSIterator
[ERROR] <https://builds.apache.org/job/UIMA-Ruta-v3/ws/trunk/ruta-core/src/main/java/org/apache/uima/ruta/rule/AnnotationListFSIterator.java>:[168,15]
cannot find symbol
[ERROR] symbol:   class NotImplementedException
[ERROR] location: class org.apache.uima.ruta.rule.AnnotationListFSIterator
[ERROR] <https://builds.apache.org/job/UIMA-Ruta-v3/ws/trunk/ruta-core/src/main/java/org/apache/uima/ruta/rule/AnnotationListFSIterator.java>:[173,15]
cannot find symbol
[ERROR] symbol:   class NotImplementedException
[ERROR] location: class org.apache.uima.ruta.rule.AnnotationListFSIterator
[ERROR] <https://builds.apache.org/job/UIMA-Ruta-v3/ws/trunk/ruta-core/src/main/java/org/apache/uima/ruta/rule/AnnotationListFSIterator.java>:[178,15]
cannot find symbol
[ERROR] symbol:   class NotImplementedException
[ERROR] location: class org.apache.uima.ruta.rule.AnnotationListFSIterator
[ERROR] <https://builds.apache.org/job/UIMA-Ruta-v3/ws/trunk/ruta-core/src/main/java/org/apache/uima/ruta/rule/AnnotationListFSIterator.java>:[183,15]
cannot find symbol
[ERROR] symbol:   class NotImplementedException
[ERROR] location: class org.apache.uima.ruta.rule.AnnotationListFSIterator
[ERROR] <https://builds.apache.org/job/UIMA-Ruta-v3/ws/trunk/ruta-core/src/main/java/org/apache/uima/ruta/engine/RutaEngine.java>:[658,10]
cannot find symbol
[ERROR] symbol:   variable StringUtils
[ERROR] location: class org.apache.uima.ruta.engine.RutaEngine
[ERROR] <https://builds.apache.org/job/UIMA-Ruta-v3/ws/trunk/ruta-core/src/main/java/org/apache/uima/ruta/engine/RutaEngine.java>:[857,46]
cannot find symbol
[ERROR] symbol:   variable StringUtils
[ERROR] location: class org.apache.uima.ruta.engine.RutaEngine
[ERROR] <https://builds.apache.org/job/UIMA-Ruta-v3/ws/trunk/ruta-core/src/main/java/org/apache/uima/ruta/engine/RutaEngine.java>:[881,43]
cannot find symbol
[ERROR] symbol:   variable StringUtils
[ERROR] location: class org.apache.uima.ruta.engine.RutaEngine
[ERROR] <https://builds.apache.org/job/UIMA-Ruta-v3/ws/trunk/ruta-core/src/main/java/org/apache/uima/ruta/engine/RutaEngine.java>:[928,44]
cannot find symbol
[ERROR] symbol:   variable StringUtils
[ERROR] location: class org.apache.uima.ruta.engine.RutaEngine
[ERROR] <https://builds.apache.org/job/UIMA-Ruta-v3/ws/trunk/ruta-core/src/main/java/org/apache/uima/ruta/engine/RutaEngine.java>:[966,56]
cannot find symbol
[ERROR] symbol:   variable StringUtils
[ERROR] location: class org.apache.uima.ruta.engine.RutaEngine
[ERROR] <https://builds.apache.org/job/UIMA-Ruta-v3/ws/trunk/ruta-core/src/main/java/org/apache/uima/ruta/engine/RutaEngine.java>:[968,29]
cannot find symbol
[ERROR] symbol:   variable StringUtils
[ERROR] location: class org.apache.uima.ruta.engine.RutaEngine
[ERROR] <https://builds.apache.org/job/UIMA-Ruta-v3/ws/trunk/ruta-core/src/main/java/org/apache/uima/ruta/engine/RutaEngine.java>:[1092,22]
cannot find symbol
[ERROR] symbol:   variable StringUtils
[ERROR] location: class org.apache.uima.ruta.engine.RutaEngine
[ERROR] <https://builds.apache.org/job/UIMA-Ruta-v3/ws/trunk/ruta-core/src/main/java/org/apache/uima/ruta/constraint/BasicTypeConstraint.java>:[62,15]
cannot find symbol
[ERROR] symbol:   class NotImplementedException
[ERROR] location: class org.apache.uima.ruta.constraint.BasicTypeConstraint
[ERROR] -> [Help 1]
[ERROR] 
[ERROR] To see the full stack trace of the errors, re-run Maven with the -e switch.
[ERROR] Re-run Maven using the -X switch to enable full debug logging.
[ERROR] 
[ERROR] For more information about the errors and possible solutions, please read the following
articles:
[ERROR] [Help 1] http://cwiki.apache.org/confluence/display/MAVEN/MojoFailureException
[ERROR] 
[ERROR] After correcting the problems, you can resume the build with the command
[ERROR]   mvn <goals> -rf :ruta-core
[JENKINS] Archiving <https://builds.apache.org/job/UIMA-Ruta-v3/ws/trunk/ruta-ep-parent/pom.xml>
to org.apache.uima/ruta-ep-parent/3.0.0-SNAPSHOT/ruta-ep-parent-3.0.0-SNAPSHOT.pom
[JENKINS] Archiving <https://builds.apache.org/job/UIMA-Ruta-v3/ws/trunk/ruta-core-ext/pom.xml>
to org.apache.uima/ruta-core-ext/3.0.0-SNAPSHOT/ruta-core-ext-3.0.0-SNAPSHOT.pom
[JENKINS] Archiving <https://builds.apache.org/job/UIMA-Ruta-v3/ws/trunk/ruta-ep-ide/pom.xml>
to org.apache.uima/ruta-ep-ide/3.0.0-SNAPSHOT/ruta-ep-ide-3.0.0-SNAPSHOT.pom
[JENKINS] Archiving <https://builds.apache.org/job/UIMA-Ruta-v3/ws/trunk/ruta-ep-textruler/pom.xml>
to org.apache.uima/ruta-ep-textruler/3.0.0-SNAPSHOT/ruta-ep-textruler-3.0.0-SNAPSHOT.pom
[JENKINS] Archiving <https://builds.apache.org/job/UIMA-Ruta-v3/ws/trunk/ruta-ep-addons/pom.xml>
to org.apache.uima/ruta-ep-addons/3.0.0-SNAPSHOT/ruta-ep-addons-3.0.0-SNAPSHOT.pom
[JENKINS] Archiving <https://builds.apache.org/job/UIMA-Ruta-v3/ws/trunk/ruta-core/pom.xml>
to org.apache.uima/ruta-core/3.0.0-SNAPSHOT/ruta-core-3.0.0-SNAPSHOT.pom
[JENKINS] Archiving <https://builds.apache.org/job/UIMA-Ruta-v3/ws/trunk/ruta-eclipse-feature/pom.xml>
to org.apache.uima/ruta-eclipse-feature/3.0.0-SNAPSHOT/ruta-eclipse-feature-3.0.0-SNAPSHOT.pom
[JENKINS] Archiving <https://builds.apache.org/job/UIMA-Ruta-v3/ws/trunk/example-projects/ruta-maven-example/pom.xml>
to org.apache.uima/ruta-maven-example/3.0.0-SNAPSHOT/ruta-maven-example-3.0.0-SNAPSHOT.pom
[JENKINS] Archiving <https://builds.apache.org/job/UIMA-Ruta-v3/ws/trunk/ruta-ep-caseditor/pom.xml>
to org.apache.uima/ruta-ep-caseditor/3.0.0-SNAPSHOT/ruta-ep-caseditor-3.0.0-SNAPSHOT.pom
[JENKINS] Archiving <https://builds.apache.org/job/UIMA-Ruta-v3/ws/trunk/ruta-basic-type/pom.xml>
to org.apache.uima/ruta-basic-type/3.0.0-SNAPSHOT/ruta-basic-type-3.0.0-SNAPSHOT.pom
[JENKINS] Archiving <https://builds.apache.org/job/UIMA-Ruta-v3/ws/trunk/ruta-basic-type/target/ruta-basic-type-3.0.0-SNAPSHOT.jar>
to org.apache.uima/ruta-basic-type/3.0.0-20190320.183558-100/ruta-basic-type-3.0.0-20190320.183558-100.jar
[JENKINS] Archiving <https://builds.apache.org/job/UIMA-Ruta-v3/ws/trunk/ruta-ep-core-ext/pom.xml>
to org.apache.uima/ruta-ep-core-ext/3.0.0-SNAPSHOT/ruta-ep-core-ext-3.0.0-SNAPSHOT.pom
[JENKINS] Archiving <https://builds.apache.org/job/UIMA-Ruta-v3/ws/trunk/ruta-typesystem/pom.xml>
to org.apache.uima/ruta-typesystem/3.0.0-SNAPSHOT/ruta-typesystem-3.0.0-SNAPSHOT.pom
[JENKINS] Archiving <https://builds.apache.org/job/UIMA-Ruta-v3/ws/trunk/ruta-typesystem/target/ruta-typesystem-3.0.0-SNAPSHOT.jar>
to org.apache.uima/ruta-typesystem/3.0.0-20190320.183655-98/ruta-typesystem-3.0.0-20190320.183655-98.jar
[JENKINS] Archiving <https://builds.apache.org/job/UIMA-Ruta-v3/ws/trunk/ruta-maven-archetype/pom.xml>
to org.apache.uima/ruta-maven-archetype/3.0.0-SNAPSHOT/ruta-maven-archetype-3.0.0-SNAPSHOT.pom
[JENKINS] Archiving <https://builds.apache.org/job/UIMA-Ruta-v3/ws/trunk/ruta-ep-engine/pom.xml>
to org.apache.uima/ruta-ep-engine/3.0.0-SNAPSHOT/ruta-ep-engine-3.0.0-SNAPSHOT.pom
[JENKINS] Archiving <https://builds.apache.org/job/UIMA-Ruta-v3/ws/trunk/example-projects/ruta-ep-example-extensions/pom.xml>
to org.apache.uima/ruta-ep-example-extensions/3.0.0-SNAPSHOT/ruta-ep-example-extensions-3.0.0-SNAPSHOT.pom
[JENKINS] Archiving <https://builds.apache.org/job/UIMA-Ruta-v3/ws/trunk/pom.xml> to
org.apache.uima/ruta/3.0.0-SNAPSHOT/ruta-3.0.0-SNAPSHOT.pom
[JENKINS] Archiving <https://builds.apache.org/job/UIMA-Ruta-v3/ws/trunk/ruta-parent/pom.xml>
to org.apache.uima/ruta-parent/3.0.0-SNAPSHOT/ruta-parent-3.0.0-SNAPSHOT.pom
[JENKINS] Archiving <https://builds.apache.org/job/UIMA-Ruta-v3/ws/trunk/ruta-ep-ide-ui/pom.xml>
to org.apache.uima/ruta-ep-ide-ui/3.0.0-SNAPSHOT/ruta-ep-ide-ui-3.0.0-SNAPSHOT.pom
[JENKINS] Archiving <https://builds.apache.org/job/UIMA-Ruta-v3/ws/trunk/ruta-maven-plugin/pom.xml>
to org.apache.uima/ruta-maven-plugin/3.0.0-SNAPSHOT/ruta-maven-plugin-3.0.0-SNAPSHOT.pom
[JENKINS] Archiving <https://builds.apache.org/job/UIMA-Ruta-v3/ws/trunk/ruta-docbook/pom.xml>
to org.apache.uima/ruta-docbook/3.0.0-SNAPSHOT/ruta-docbook-3.0.0-SNAPSHOT.pom
Sending e-mails to: dev@uima.apache.org
channel stopped
[WARNINGS] Skipping publisher since build result is FAILURE
[Cobertura] Publishing Cobertura coverage report...

[Cobertura] Publishing Cobertura coverage results...

[Cobertura] Cobertura coverage report found.


Mime
View raw message