uima-dev mailing list archives

Site index · List index
Message view « Date » · « Thread »
Top « Date » · « Thread »
From Apache Jenkins Server <jenk...@builds.apache.org>
Subject Build failed in Jenkins: UIMA-Ruta-v3 » Apache UIMA Ruta: ruta-core #82
Date Mon, 15 Apr 2019 13:37:07 GMT
See <https://builds.apache.org/job/UIMA-Ruta-v3/org.apache.uima$ruta-core/82/display/redirect?page=changes>

Changes:

[pkluegl] UIMA-6024: apply cleanup of 2.7.0

[pkluegl] no jira - cleanup usage of commons-lang

------------------------------------------
[...truncated 6.06 KB...]
[INFO] Downloaded: http://repo1.maven.org/maven2/org/apache/uima/uimaj-test-util/3.0.1/uimaj-test-util-3.0.1.pom
(3 KB at 204.9 KB/sec)
[INFO] Downloading: http://repo1.maven.org/eclipse/xmlunit/xmlunit/1.6/xmlunit-1.6.pom
[INFO] Downloading: http://repo1.maven.org/maven2/xmlunit/xmlunit/1.6/xmlunit-1.6.pom
[INFO] Downloaded: http://repo1.maven.org/maven2/xmlunit/xmlunit/1.6/xmlunit-1.6.pom (3 KB
at 65.1 KB/sec)
[INFO] Downloading: http://repo1.maven.org/eclipse/org/apache/commons/commons-lang3/3.8.1/commons-lang3-3.8.1.pom
[INFO] Downloading: http://repo1.maven.org/maven2/org/apache/commons/commons-lang3/3.8.1/commons-lang3-3.8.1.pom
[INFO] Downloaded: http://repo1.maven.org/maven2/org/apache/commons/commons-lang3/3.8.1/commons-lang3-3.8.1.pom
(28 KB at 1296.9 KB/sec)
[INFO] Downloading: http://repo1.maven.org/eclipse/org/apache/commons/commons-parent/47/commons-parent-47.pom
[INFO] Downloading: http://repo1.maven.org/maven2/org/apache/commons/commons-parent/47/commons-parent-47.pom
[INFO] Downloaded: http://repo1.maven.org/maven2/org/apache/commons/commons-parent/47/commons-parent-47.pom
(76 KB at 3029.8 KB/sec)
[INFO] Downloading: http://repository.apache.org/snapshots/org/apache/uima/uimafit-core/3.0.0-SNAPSHOT/maven-metadata.xml
[INFO] Downloaded: http://repository.apache.org/snapshots/org/apache/uima/uimafit-core/3.0.0-SNAPSHOT/maven-metadata.xml
(783 B at 0.1 KB/sec)
[INFO] Downloading: http://repository.apache.org/snapshots/org/apache/uima/uimafit-core/3.0.0-SNAPSHOT/uimafit-core-3.0.0-20190411.072534-112.pom
[INFO] Downloaded: http://repository.apache.org/snapshots/org/apache/uima/uimafit-core/3.0.0-SNAPSHOT/uimafit-core-3.0.0-20190411.072534-112.pom
(7 KB at 1.4 KB/sec)
[INFO] Downloading: http://repository.apache.org/snapshots/org/apache/uima/uimafit-parent/3.0.0-SNAPSHOT/maven-metadata.xml
[INFO] Downloaded: http://repository.apache.org/snapshots/org/apache/uima/uimafit-parent/3.0.0-SNAPSHOT/maven-metadata.xml
(610 B at 0.1 KB/sec)
[INFO] Downloading: http://repository.apache.org/snapshots/org/apache/uima/uimafit-parent/3.0.0-SNAPSHOT/uimafit-parent-3.0.0-20190411.072636-109.pom
[INFO] Downloaded: http://repository.apache.org/snapshots/org/apache/uima/uimafit-parent/3.0.0-SNAPSHOT/uimafit-parent-3.0.0-20190411.072636-109.pom
(16 KB at 2.8 KB/sec)
[INFO] Downloading: http://repo1.maven.org/eclipse/org/apache/uima/uimaj-core/3.0.2/uimaj-core-3.0.2.pom
[INFO] Downloading: http://repo1.maven.org/maven2/org/apache/uima/uimaj-core/3.0.2/uimaj-core-3.0.2.pom
[INFO] Downloaded: http://repo1.maven.org/maven2/org/apache/uima/uimaj-core/3.0.2/uimaj-core-3.0.2.pom
(14 KB at 622.8 KB/sec)
[INFO] Downloading: http://repo1.maven.org/eclipse/org/apache/uima/uimaj-parent/3.0.2/uimaj-parent-3.0.2.pom
[INFO] Downloading: http://repo1.maven.org/maven2/org/apache/uima/uimaj-parent/3.0.2/uimaj-parent-3.0.2.pom
[INFO] Downloaded: http://repo1.maven.org/maven2/org/apache/uima/uimaj-parent/3.0.2/uimaj-parent-3.0.2.pom
(17 KB at 730.3 KB/sec)
[INFO] Downloading: http://repo1.maven.org/eclipse/org/springframework/spring-core/4.3.22.RELEASE/spring-core-4.3.22.RELEASE.pom
[INFO] Downloading: http://repo1.maven.org/maven2/org/springframework/spring-core/4.3.22.RELEASE/spring-core-4.3.22.RELEASE.pom
[INFO] Downloaded: http://repo1.maven.org/maven2/org/springframework/spring-core/4.3.22.RELEASE/spring-core-4.3.22.RELEASE.pom
(3 KB at 142.2 KB/sec)
[INFO] Downloading: http://repo1.maven.org/eclipse/org/springframework/spring-context/4.3.22.RELEASE/spring-context-4.3.22.RELEASE.pom
[INFO] Downloading: http://repo1.maven.org/maven2/org/springframework/spring-context/4.3.22.RELEASE/spring-context-4.3.22.RELEASE.pom
[INFO] Downloaded: http://repo1.maven.org/maven2/org/springframework/spring-context/4.3.22.RELEASE/spring-context-4.3.22.RELEASE.pom
(5 KB at 245.3 KB/sec)
[INFO] Downloading: http://repo1.maven.org/eclipse/org/springframework/spring-beans/4.3.22.RELEASE/spring-beans-4.3.22.RELEASE.pom
[INFO] Downloading: http://repo1.maven.org/maven2/org/springframework/spring-beans/4.3.22.RELEASE/spring-beans-4.3.22.RELEASE.pom
[INFO] Downloaded: http://repo1.maven.org/maven2/org/springframework/spring-beans/4.3.22.RELEASE/spring-beans-4.3.22.RELEASE.pom
(3 KB at 93.4 KB/sec)
[INFO] Downloading: http://repo1.maven.org/eclipse/org/springframework/spring-expression/4.3.22.RELEASE/spring-expression-4.3.22.RELEASE.pom
[INFO] Downloading: http://repo1.maven.org/maven2/org/springframework/spring-expression/4.3.22.RELEASE/spring-expression-4.3.22.RELEASE.pom
[INFO] Downloaded: http://repo1.maven.org/maven2/org/springframework/spring-expression/4.3.22.RELEASE/spring-expression-4.3.22.RELEASE.pom
(2 KB at 98.1 KB/sec)
[INFO] Downloading: http://repo1.maven.org/eclipse/org/slf4j/slf4j-api/1.7.26/slf4j-api-1.7.26.pom
[INFO] Downloading: http://repo1.maven.org/maven2/org/slf4j/slf4j-api/1.7.26/slf4j-api-1.7.26.pom
[INFO] Downloaded: http://repo1.maven.org/maven2/org/slf4j/slf4j-api/1.7.26/slf4j-api-1.7.26.pom
(4 KB at 234.1 KB/sec)
[INFO] Downloading: http://repo1.maven.org/eclipse/org/slf4j/slf4j-parent/1.7.26/slf4j-parent-1.7.26.pom
[INFO] Downloading: http://repo1.maven.org/maven2/org/slf4j/slf4j-parent/1.7.26/slf4j-parent-1.7.26.pom
[INFO] Downloaded: http://repo1.maven.org/maven2/org/slf4j/slf4j-parent/1.7.26/slf4j-parent-1.7.26.pom
(14 KB at 668.0 KB/sec)
[INFO] Downloading: http://repo1.maven.org/eclipse/org/apache/commons/commons-math3/3.0/commons-math3-3.0.pom
[INFO] Downloading: http://repo1.maven.org/maven2/org/apache/commons/commons-math3/3.0/commons-math3-3.0.pom
[INFO] Downloaded: http://repo1.maven.org/maven2/org/apache/commons/commons-math3/3.0/commons-math3-3.0.pom
(12 KB at 628.8 KB/sec)
[INFO] Downloading: http://repo1.maven.org/eclipse/org/apache/commons/commons-parent/23/commons-parent-23.pom
[INFO] Downloading: http://repo1.maven.org/maven2/org/apache/commons/commons-parent/23/commons-parent-23.pom
[INFO] Downloaded: http://repo1.maven.org/maven2/org/apache/commons/commons-parent/23/commons-parent-23.pom
(44 KB at 1734.7 KB/sec)
[INFO] Downloading: http://repo1.maven.org/eclipse/org/slf4j/slf4j-jdk14/1.7.24/slf4j-jdk14-1.7.24.pom
[INFO] Downloading: http://repo1.maven.org/maven2/org/slf4j/slf4j-jdk14/1.7.24/slf4j-jdk14-1.7.24.pom
[INFO] Downloaded: http://repo1.maven.org/maven2/org/slf4j/slf4j-jdk14/1.7.24/slf4j-jdk14-1.7.24.pom
(1008 B at 54.7 KB/sec)
[INFO] Downloading: http://repo1.maven.org/eclipse/org/slf4j/slf4j-parent/1.7.24/slf4j-parent-1.7.24.pom
[INFO] Downloading: http://repo1.maven.org/maven2/org/slf4j/slf4j-parent/1.7.24/slf4j-parent-1.7.24.pom
[INFO] Downloaded: http://repo1.maven.org/maven2/org/slf4j/slf4j-parent/1.7.24/slf4j-parent-1.7.24.pom
(14 KB at 776.0 KB/sec)
[INFO] Downloading: http://repo1.maven.org/eclipse/org/slf4j/slf4j-api/1.7.24/slf4j-api-1.7.24.pom
[INFO] Downloading: http://repo1.maven.org/maven2/org/slf4j/slf4j-api/1.7.24/slf4j-api-1.7.24.pom
[INFO] Downloaded: http://repo1.maven.org/maven2/org/slf4j/slf4j-api/1.7.24/slf4j-api-1.7.24.pom
(4 KB at 220.2 KB/sec)
[INFO] Downloading: http://repo1.maven.org/eclipse/org/antlr/antlr-runtime/3.5.2/antlr-runtime-3.5.2.jar
[INFO] Downloading: http://repo1.maven.org/eclipse/org/htmlparser/htmlparser/1.6/htmlparser-1.6.jar
[INFO] Downloading: http://repo1.maven.org/eclipse/org/apache/uima/uimaj-test-util/3.0.1/uimaj-test-util-3.0.1.jar
[INFO] Downloading: http://repo1.maven.org/eclipse/xmlunit/xmlunit/1.6/xmlunit-1.6.jar
[INFO] Downloading: http://repo1.maven.org/eclipse/org/apache/commons/commons-lang3/3.8.1/commons-lang3-3.8.1.jar
[INFO] Downloading: http://repo1.maven.org/eclipse/org/springframework/spring-core/4.3.22.RELEASE/spring-core-4.3.22.RELEASE.jar
[INFO] Downloading: http://repo1.maven.org/eclipse/org/springframework/spring-context/4.3.22.RELEASE/spring-context-4.3.22.RELEASE.jar
[INFO] Downloading: http://repo1.maven.org/eclipse/org/springframework/spring-expression/4.3.22.RELEASE/spring-expression-4.3.22.RELEASE.jar
[INFO] Downloading: http://repo1.maven.org/eclipse/org/springframework/spring-beans/4.3.22.RELEASE/spring-beans-4.3.22.RELEASE.jar
[INFO] Downloading: http://repo1.maven.org/eclipse/org/apache/commons/commons-math3/3.0/commons-math3-3.0.jar
[INFO] Downloading: http://repo1.maven.org/eclipse/org/slf4j/slf4j-jdk14/1.7.24/slf4j-jdk14-1.7.24.jar
[INFO] Downloading: http://repo1.maven.org/maven2/org/antlr/antlr-runtime/3.5.2/antlr-runtime-3.5.2.jar
[INFO] Downloading: http://repo1.maven.org/maven2/org/htmlparser/htmlparser/1.6/htmlparser-1.6.jar
[INFO] Downloading: http://repo1.maven.org/maven2/org/apache/uima/uimaj-test-util/3.0.1/uimaj-test-util-3.0.1.jar
[INFO] Downloading: http://repo1.maven.org/maven2/xmlunit/xmlunit/1.6/xmlunit-1.6.jar
[INFO] Downloading: http://repo1.maven.org/maven2/org/apache/commons/commons-lang3/3.8.1/commons-lang3-3.8.1.jar
[INFO] Downloaded: http://repo1.maven.org/maven2/org/apache/uima/uimaj-test-util/3.0.1/uimaj-test-util-3.0.1.jar
(24 KB at 941.2 KB/sec)
[INFO] Downloading: http://repo1.maven.org/maven2/org/springframework/spring-core/4.3.22.RELEASE/spring-core-4.3.22.RELEASE.jar
[INFO] Downloaded: http://repo1.maven.org/maven2/org/antlr/antlr-runtime/3.5.2/antlr-runtime-3.5.2.jar
(164 KB at 4818.5 KB/sec)
[INFO] Downloading: http://repo1.maven.org/maven2/org/springframework/spring-context/4.3.22.RELEASE/spring-context-4.3.22.RELEASE.jar
[INFO] Downloaded: http://repo1.maven.org/maven2/xmlunit/xmlunit/1.6/xmlunit-1.6.jar (99 KB
at 2907.6 KB/sec)
[INFO] Downloading: http://repo1.maven.org/maven2/org/springframework/spring-expression/4.3.22.RELEASE/spring-expression-4.3.22.RELEASE.jar
[INFO] Downloaded: http://repo1.maven.org/maven2/org/apache/commons/commons-lang3/3.8.1/commons-lang3-3.8.1.jar
(491 KB at 11669.4 KB/sec)
[INFO] Downloaded: http://repo1.maven.org/maven2/org/htmlparser/htmlparser/1.6/htmlparser-1.6.jar
(282 KB at 6394.2 KB/sec)
[INFO] Downloading: http://repo1.maven.org/maven2/org/springframework/spring-beans/4.3.22.RELEASE/spring-beans-4.3.22.RELEASE.jar
[INFO] Downloading: http://repo1.maven.org/maven2/org/apache/commons/commons-math3/3.0/commons-math3-3.0.jar
[INFO] Downloaded: http://repo1.maven.org/maven2/org/springframework/spring-expression/4.3.22.RELEASE/spring-expression-4.3.22.RELEASE.jar
(269 KB at 4709.3 KB/sec)
[INFO] Downloading: http://repo1.maven.org/maven2/org/slf4j/slf4j-jdk14/1.7.24/slf4j-jdk14-1.7.24.jar
[INFO] Downloaded: http://repo1.maven.org/maven2/org/springframework/spring-core/4.3.22.RELEASE/spring-core-4.3.22.RELEASE.jar
(1105 KB at 18403.7 KB/sec)
[INFO] Downloaded: http://repo1.maven.org/maven2/org/springframework/spring-beans/4.3.22.RELEASE/spring-beans-4.3.22.RELEASE.jar
(746 KB at 10079.6 KB/sec)
[INFO] Downloaded: http://repo1.maven.org/maven2/org/slf4j/slf4j-jdk14/1.7.24/slf4j-jdk14-1.7.24.jar
(9 KB at 108.7 KB/sec)
[INFO] Downloaded: http://repo1.maven.org/maven2/org/springframework/spring-context/4.3.22.RELEASE/spring-context-4.3.22.RELEASE.jar
(1117 KB at 13779.8 KB/sec)
[INFO] Downloaded: http://repo1.maven.org/maven2/org/apache/commons/commons-math3/3.0/commons-math3-3.0.jar
(1256 KB at 12811.1 KB/sec)
[INFO] Downloading: http://repository.apache.org/snapshots/org/apache/uima/uimafit-core/3.0.0-SNAPSHOT/uimafit-core-3.0.0-20190411.072534-112.jar
[INFO] Downloaded: http://repository.apache.org/snapshots/org/apache/uima/uimafit-core/3.0.0-SNAPSHOT/uimafit-core-3.0.0-20190411.072534-112.jar
(172 KB at 15.5 KB/sec)
[INFO] 
[INFO] --- maven-clean-plugin:3.1.0:clean (default-clean) @ ruta-core ---
[TASKS] Scanning folder '<https://builds.apache.org/job/UIMA-Ruta-v3/org.apache.uima$ruta-core/ws/'>
for files matching the pattern '**/*.java' - excludes: 
[TASKS] Found 502 files to scan for tasks
Found 67 open tasks.
[TASKS] Computing warning deltas based on reference build #73
[INFO] 
[INFO] --- build-helper-maven-plugin:3.0.0:parse-version (parse-project-version) @ ruta-core
---
[INFO] 
[INFO] --- uima-build-helper-maven-plugin:7:parse-date-time (set buildYear and buildMonth)
@ ruta-core ---
[INFO] 
[INFO] --- maven-enforcer-plugin:3.0.0-M2:enforce (enforce-maven-version) @ ruta-core ---
[INFO] 
[INFO] --- maven-enforcer-plugin:3.0.0-M2:enforce (enforce-versions) @ ruta-core ---
[INFO] 
[INFO] --- antlr3-maven-plugin:3.5.2:antlr (run antlr) @ ruta-core ---
[INFO] Downloading: https://repo.maven.apache.org/maven2/org/apache/maven/maven-plugin-api/2.0/maven-plugin-api-2.0.pom
[INFO] Downloaded: https://repo.maven.apache.org/maven2/org/apache/maven/maven-plugin-api/2.0/maven-plugin-api-2.0.pom
(601 B at 39.1 KB/sec)
[INFO] Downloading: https://repo.maven.apache.org/maven2/org/apache/maven/maven/2.0/maven-2.0.pom
[INFO] Downloaded: https://repo.maven.apache.org/maven2/org/apache/maven/maven/2.0/maven-2.0.pom
(9 KB at 611.6 KB/sec)
[INFO] Downloading: https://repo.maven.apache.org/maven2/org/apache/maven/maven-project/2.0/maven-project-2.0.pom
[INFO] Downloaded: https://repo.maven.apache.org/maven2/org/apache/maven/maven-project/2.0/maven-project-2.0.pom
(2 KB at 122.9 KB/sec)
[INFO] Downloading: https://repo.maven.apache.org/maven2/org/apache/maven/maven-profile/2.0/maven-profile-2.0.pom
[INFO] Downloaded: https://repo.maven.apache.org/maven2/org/apache/maven/maven-profile/2.0/maven-profile-2.0.pom
(2 KB at 95.7 KB/sec)
[INFO] Downloading: https://repo.maven.apache.org/maven2/org/apache/maven/maven-model/2.0/maven-model-2.0.pom
[INFO] Downloaded: https://repo.maven.apache.org/maven2/org/apache/maven/maven-model/2.0/maven-model-2.0.pom
(3 KB at 156.7 KB/sec)
[INFO] Downloading: https://repo.maven.apache.org/maven2/org/codehaus/plexus/plexus-container-default/1.0-alpha-8/plexus-container-default-1.0-alpha-8.pom
[INFO] Downloaded: https://repo.maven.apache.org/maven2/org/codehaus/plexus/plexus-container-default/1.0-alpha-8/plexus-container-default-1.0-alpha-8.pom
(8 KB at 472.9 KB/sec)
[INFO] Downloading: https://repo.maven.apache.org/maven2/junit/junit/4.10/junit-4.10.pom
[INFO] Downloaded: https://repo.maven.apache.org/maven2/junit/junit/4.10/junit-4.10.pom (3
KB at 163.6 KB/sec)
[INFO] Downloading: https://repo.maven.apache.org/maven2/org/hamcrest/hamcrest-core/1.1/hamcrest-core-1.1.pom
[INFO] Downloaded: https://repo.maven.apache.org/maven2/org/hamcrest/hamcrest-core/1.1/hamcrest-core-1.1.pom
(481 B at 33.6 KB/sec)
[INFO] Downloading: https://repo.maven.apache.org/maven2/org/hamcrest/hamcrest-parent/1.1/hamcrest-parent-1.1.pom
[INFO] Downloaded: https://repo.maven.apache.org/maven2/org/hamcrest/hamcrest-parent/1.1/hamcrest-parent-1.1.pom
(6 KB at 358.7 KB/sec)
[INFO] Downloading: https://repo.maven.apache.org/maven2/org/apache/maven/maven-artifact-manager/2.0/maven-artifact-manager-2.0.pom
[INFO] Downloaded: https://repo.maven.apache.org/maven2/org/apache/maven/maven-artifact-manager/2.0/maven-artifact-manager-2.0.pom
(2 KB at 87.8 KB/sec)
[INFO] Downloading: https://repo.maven.apache.org/maven2/org/apache/maven/maven-repository-metadata/2.0/maven-repository-metadata-2.0.pom
[INFO] Downloaded: https://repo.maven.apache.org/maven2/org/apache/maven/maven-repository-metadata/2.0/maven-repository-metadata-2.0.pom
(2 KB at 85.6 KB/sec)
[INFO] Downloading: https://repo.maven.apache.org/maven2/org/apache/maven/maven-artifact/2.0/maven-artifact-2.0.pom
[INFO] Downloaded: https://repo.maven.apache.org/maven2/org/apache/maven/maven-artifact/2.0/maven-artifact-2.0.pom
(723 B at 54.3 KB/sec)
[INFO] Downloading: https://repo.maven.apache.org/maven2/org/codehaus/plexus/plexus-compiler-api/2.0/plexus-compiler-api-2.0.pom
[INFO] Downloaded: https://repo.maven.apache.org/maven2/org/codehaus/plexus/plexus-compiler-api/2.0/plexus-compiler-api-2.0.pom
(865 B at 56.3 KB/sec)
[INFO] Downloading: https://repo.maven.apache.org/maven2/org/codehaus/plexus/plexus-compiler/2.0/plexus-compiler-2.0.pom
[INFO] Downloaded: https://repo.maven.apache.org/maven2/org/codehaus/plexus/plexus-compiler/2.0/plexus-compiler-2.0.pom
(4 KB at 235.2 KB/sec)
[INFO] Downloading: https://repo.maven.apache.org/maven2/org/antlr/antlr/3.5.2/antlr-3.5.2.pom
[INFO] Downloaded: https://repo.maven.apache.org/maven2/org/antlr/antlr/3.5.2/antlr-3.5.2.pom
(3 KB at 205.1 KB/sec)
[INFO] Downloading: https://repo.maven.apache.org/maven2/org/antlr/ST4/4.0.8/ST4-4.0.8.pom
[INFO] Downloaded: https://repo.maven.apache.org/maven2/org/antlr/ST4/4.0.8/ST4-4.0.8.pom
(14 KB at 958.6 KB/sec)
[INFO] Downloading: https://repo.maven.apache.org/maven2/org/apache/maven/maven-plugin-api/2.0/maven-plugin-api-2.0.jar
[INFO] Downloading: https://repo.maven.apache.org/maven2/org/apache/maven/maven-project/2.0/maven-project-2.0.jar
[INFO] Downloading: https://repo.maven.apache.org/maven2/org/apache/maven/maven-profile/2.0/maven-profile-2.0.jar
[INFO] Downloading: https://repo.maven.apache.org/maven2/org/apache/maven/maven-model/2.0/maven-model-2.0.jar
[INFO] Downloading: https://repo.maven.apache.org/maven2/org/apache/maven/maven-artifact-manager/2.0/maven-artifact-manager-2.0.jar
[INFO] Downloaded: https://repo.maven.apache.org/maven2/org/apache/maven/maven-plugin-api/2.0/maven-plugin-api-2.0.jar
(10 KB at 618.5 KB/sec)
[INFO] Downloading: https://repo.maven.apache.org/maven2/org/apache/maven/maven-repository-metadata/2.0/maven-repository-metadata-2.0.jar
[INFO] Downloaded: https://repo.maven.apache.org/maven2/org/apache/maven/maven-profile/2.0/maven-profile-2.0.jar
(30 KB at 1856.0 KB/sec)
[INFO] Downloading: https://repo.maven.apache.org/maven2/org/codehaus/plexus/plexus-utils/1.0.4/plexus-utils-1.0.4.jar
[INFO] Downloaded: https://repo.maven.apache.org/maven2/org/apache/maven/maven-project/2.0/maven-project-2.0.jar
(103 KB at 4864.9 KB/sec)
[INFO] Downloading: https://repo.maven.apache.org/maven2/org/apache/maven/maven-artifact/2.0/maven-artifact-2.0.jar
[INFO] Downloaded: https://repo.maven.apache.org/maven2/org/apache/maven/maven-repository-metadata/2.0/maven-repository-metadata-2.0.jar
(21 KB at 695.5 KB/sec)
[INFO] Downloading: https://repo.maven.apache.org/maven2/org/codehaus/plexus/plexus-container-default/1.0-alpha-8/plexus-container-default-1.0-alpha-8.jar
[INFO] Downloaded: https://repo.maven.apache.org/maven2/org/apache/maven/maven-artifact/2.0/maven-artifact-2.0.jar
(77 KB at 2078.8 KB/sec)
[INFO] Downloading: https://repo.maven.apache.org/maven2/org/codehaus/plexus/plexus-compiler-api/2.0/plexus-compiler-api-2.0.jar
[INFO] Downloaded: https://repo.maven.apache.org/maven2/org/codehaus/plexus/plexus-utils/1.0.4/plexus-utils-1.0.4.jar
(160 KB at 4101.6 KB/sec)
[INFO] Downloading: https://repo.maven.apache.org/maven2/org/antlr/antlr/3.5.2/antlr-3.5.2.jar
[INFO] Downloaded: https://repo.maven.apache.org/maven2/org/codehaus/plexus/plexus-container-default/1.0-alpha-8/plexus-container-default-1.0-alpha-8.jar
(191 KB at 3534.4 KB/sec)
[INFO] Downloading: https://repo.maven.apache.org/maven2/org/antlr/ST4/4.0.8/ST4-4.0.8.jar
[INFO] Downloaded: https://repo.maven.apache.org/maven2/org/codehaus/plexus/plexus-compiler-api/2.0/plexus-compiler-api-2.0.jar
(25 KB at 428.1 KB/sec)
[INFO] Downloaded: https://repo.maven.apache.org/maven2/org/antlr/ST4/4.0.8/ST4-4.0.8.jar
(234 KB at 2570.6 KB/sec)
[INFO] Downloaded: https://repo.maven.apache.org/maven2/org/apache/maven/maven-model/2.0/maven-model-2.0.jar
(77 KB at 696.7 KB/sec)
[INFO] Downloaded: https://repo.maven.apache.org/maven2/org/apache/maven/maven-artifact-manager/2.0/maven-artifact-manager-2.0.jar
(50 KB at 445.4 KB/sec)
[INFO] Downloaded: https://repo.maven.apache.org/maven2/org/antlr/antlr/3.5.2/antlr-3.5.2.jar
(1127 KB at 8165.0 KB/sec)
[INFO] ANTLR: Processing source directory <https://builds.apache.org/job/UIMA-Ruta-v3/org.apache.uima$ruta-core/ws/src/main/antlr3>
ANTLR Parser Generator  Version 3.5.2
Output file <https://builds.apache.org/job/UIMA-Ruta-v3/org.apache.uima$ruta-core/ws/target/generated-sources/antlr3/org/apache/uima/ruta/parser/RutaLexer.java>
does not exist: must build <https://builds.apache.org/job/UIMA-Ruta-v3/org.apache.uima$ruta-core/ws/src/main/antlr3/org/apache/uima/ruta/parser/RutaLexer.g>
org/apache/uima/ruta/parser/RutaLexer.g
Output file <https://builds.apache.org/job/UIMA-Ruta-v3/org.apache.uima$ruta-core/ws/target/generated-sources/antlr3/org/apache/uima/ruta/parser/RutaParser.java>
does not exist: must build <https://builds.apache.org/job/UIMA-Ruta-v3/org.apache.uima$ruta-core/ws/src/main/antlr3/org/apache/uima/ruta/parser/RutaParser.g>
org/apache/uima/ruta/parser/RutaParser.g
[INFO] 
[INFO] --- jflex-maven-plugin:1.6.1:generate (default) @ ruta-core ---
[INFO] Downloading: https://repo.maven.apache.org/maven2/de/jflex/jflex/1.6.1/jflex-1.6.1.pom
[INFO] Downloaded: https://repo.maven.apache.org/maven2/de/jflex/jflex/1.6.1/jflex-1.6.1.pom
(12 KB at 608.0 KB/sec)
[INFO] Downloading: https://repo.maven.apache.org/maven2/de/jflex/jflex-parent/1.6.1/jflex-parent-1.6.1.pom
[INFO] Downloaded: https://repo.maven.apache.org/maven2/de/jflex/jflex-parent/1.6.1/jflex-parent-1.6.1.pom
(8 KB at 448.1 KB/sec)
[INFO] Downloading: https://repo.maven.apache.org/maven2/org/apache/ant/ant/1.7.0/ant-1.7.0.pom
[INFO] Downloaded: https://repo.maven.apache.org/maven2/org/apache/ant/ant/1.7.0/ant-1.7.0.pom
(10 KB at 560.5 KB/sec)
[INFO] Downloading: https://repo.maven.apache.org/maven2/org/apache/ant/ant-parent/1.7.0/ant-parent-1.7.0.pom
[INFO] Downloaded: https://repo.maven.apache.org/maven2/org/apache/ant/ant-parent/1.7.0/ant-parent-1.7.0.pom
(5 KB at 328.9 KB/sec)
[INFO] Downloading: https://repo.maven.apache.org/maven2/org/apache/ant/ant-launcher/1.7.0/ant-launcher-1.7.0.pom
[INFO] Downloaded: https://repo.maven.apache.org/maven2/org/apache/ant/ant-launcher/1.7.0/ant-launcher-1.7.0.pom
(3 KB at 145.4 KB/sec)
[INFO] Downloading: https://repo.maven.apache.org/maven2/de/jflex/jflex/1.6.1/jflex-1.6.1.jar
[INFO] Downloading: https://repo.maven.apache.org/maven2/org/apache/ant/ant/1.7.0/ant-1.7.0.jar
[INFO] Downloading: https://repo.maven.apache.org/maven2/org/apache/ant/ant-launcher/1.7.0/ant-launcher-1.7.0.jar
[INFO] Downloading: https://repo.maven.apache.org/maven2/commons-io/commons-io/1.4/commons-io-1.4.jar
[INFO] Downloaded: https://repo.maven.apache.org/maven2/org/apache/ant/ant-launcher/1.7.0/ant-launcher-1.7.0.jar
(12 KB at 545.7 KB/sec)
[INFO] Downloaded: https://repo.maven.apache.org/maven2/commons-io/commons-io/1.4/commons-io-1.4.jar
(107 KB at 4629.9 KB/sec)
[INFO] Downloaded: https://repo.maven.apache.org/maven2/org/apache/ant/ant/1.7.0/ant-1.7.0.jar
(1260 KB at 14818.5 KB/sec)
[INFO] Downloaded: https://repo.maven.apache.org/maven2/de/jflex/jflex/1.6.1/jflex-1.6.1.jar
(1027 KB at 8695.9 KB/sec)
[INFO]   generated <https://builds.apache.org/job/UIMA-Ruta-v3/org.apache.uima$ruta-core/ws/target/generated-sources/jflex/org/apache/uima/ruta/seed/SeedLexer.java>
[INFO] 
[INFO] --- build-helper-maven-plugin:3.0.0:add-source (add-antlr-source) @ ruta-core ---
[INFO] Source directory: <https://builds.apache.org/job/UIMA-Ruta-v3/org.apache.uima$ruta-core/ws/target/generated-sources/antlr3>
added.
[INFO] 
[INFO] --- build-helper-maven-plugin:3.0.0:add-source (add-jflex-source) @ ruta-core ---
[INFO] Source directory: <https://builds.apache.org/job/UIMA-Ruta-v3/org.apache.uima$ruta-core/ws/target/generated-sources/jflex>
added.
[INFO] 
[INFO] --- maven-remote-resources-plugin:1.5:process (process-resource-bundles) @ ruta-core
---
[INFO] 
[INFO] --- maven-remote-resources-plugin:1.5:process (default) @ ruta-core ---
[INFO] 
[INFO] --- maven-resources-plugin:3.1.0:resources (default-resources) @ ruta-core ---
[INFO] Using 'UTF-8' encoding to copy filtered resources.
[INFO] Copying 14 resources
[INFO] Copying 3 resources
[INFO] Copying 3 resources
[INFO] 
[INFO] --- maven-compiler-plugin:3.8.0:compile (default-compile) @ ruta-core ---
[INFO] Changes detected - recompiling the module!
[INFO] Compiling 311 source files to <https://builds.apache.org/job/UIMA-Ruta-v3/org.apache.uima$ruta-core/ws/target/classes>
[INFO] <https://builds.apache.org/job/UIMA-Ruta-v3/org.apache.uima$ruta-core/ws/src/main/java/org/apache/uima/ruta/engine/Ruta.java>:
Some input files use or override a deprecated API.
[INFO] <https://builds.apache.org/job/UIMA-Ruta-v3/org.apache.uima$ruta-core/ws/src/main/java/org/apache/uima/ruta/engine/Ruta.java>:
Recompile with -Xlint:deprecation for details.
[INFO] <https://builds.apache.org/job/UIMA-Ruta-v3/org.apache.uima$ruta-core/ws/target/generated-sources/antlr3/org/apache/uima/ruta/parser/RutaParser.java>:
Some input files use unchecked or unsafe operations.
[INFO] <https://builds.apache.org/job/UIMA-Ruta-v3/org.apache.uima$ruta-core/ws/target/generated-sources/antlr3/org/apache/uima/ruta/parser/RutaParser.java>:
Recompile with -Xlint:unchecked for details.
[INFO] 
[INFO] --- maven-resources-plugin:3.1.0:testResources (default-testResources) @ ruta-core
---
[INFO] Using 'UTF-8' encoding to copy filtered resources.
[INFO] Copying 248 resources
[INFO] Copying 3 resources
[INFO] Copying 3 resources
[INFO] 
[INFO] --- maven-compiler-plugin:3.8.0:testCompile (default-testCompile) @ ruta-core ---
[INFO] Changes detected - recompiling the module!
[INFO] Compiling 194 source files to <https://builds.apache.org/job/UIMA-Ruta-v3/org.apache.uima$ruta-core/ws/target/test-classes>
[INFO] <https://builds.apache.org/job/UIMA-Ruta-v3/org.apache.uima$ruta-core/ws/src/test/java/org/apache/uima/ruta/engine/RutaTest.java>:
Some input files use or override a deprecated API.
[INFO] <https://builds.apache.org/job/UIMA-Ruta-v3/org.apache.uima$ruta-core/ws/src/test/java/org/apache/uima/ruta/engine/RutaTest.java>:
Recompile with -Xlint:deprecation for details.
[INFO] -------------------------------------------------------------
[ERROR] COMPILATION ERROR : 
[INFO] -------------------------------------------------------------
[ERROR] <https://builds.apache.org/job/UIMA-Ruta-v3/org.apache.uima$ruta-core/ws/src/test/java/org/apache/uima/ruta/engine/TestRutaInferenceVisitor.java>:[23,31]
package org.apache.commons.lang does not exist
[ERROR] <https://builds.apache.org/job/UIMA-Ruta-v3/org.apache.uima$ruta-core/ws/src/test/java/org/apache/uima/ruta/engine/RutaEngineTest.java>:[27,31]
package org.apache.commons.lang does not exist
[ERROR] <https://builds.apache.org/job/UIMA-Ruta-v3/org.apache.uima$ruta-core/ws/src/test/java/org/apache/uima/ruta/engine/RutaEngineTest.java>:[92,20]
cannot find symbol
  symbol:   class NotImplementedException
  location: class org.apache.uima.ruta.engine.RutaEngineTest
[ERROR] <https://builds.apache.org/job/UIMA-Ruta-v3/org.apache.uima$ruta-core/ws/src/test/java/org/apache/uima/ruta/engine/TestRutaInferenceVisitor.java>:[36,15]
cannot find symbol
  symbol:   class NotImplementedException
  location: class org.apache.uima.ruta.engine.TestRutaInferenceVisitor
[ERROR] <https://builds.apache.org/job/UIMA-Ruta-v3/org.apache.uima$ruta-core/ws/src/test/java/org/apache/uima/ruta/engine/TestRutaInferenceVisitor.java>:[41,15]
cannot find symbol
  symbol:   class NotImplementedException
  location: class org.apache.uima.ruta.engine.TestRutaInferenceVisitor
[ERROR] <https://builds.apache.org/job/UIMA-Ruta-v3/org.apache.uima$ruta-core/ws/src/test/java/org/apache/uima/ruta/engine/TestRutaInferenceVisitor.java>:[46,15]
cannot find symbol
  symbol:   class NotImplementedException
  location: class org.apache.uima.ruta.engine.TestRutaInferenceVisitor
[ERROR] <https://builds.apache.org/job/UIMA-Ruta-v3/org.apache.uima$ruta-core/ws/src/test/java/org/apache/uima/ruta/engine/TestRutaInferenceVisitor.java>:[52,15]
cannot find symbol
  symbol:   class NotImplementedException
  location: class org.apache.uima.ruta.engine.TestRutaInferenceVisitor
[INFO] 7 errors 
[INFO] -------------------------------------------------------------

Mime
View raw message