uima-dev mailing list archives

Site index · List index
Message view « Date » · « Thread »
Top « Date » · « Thread »
From Apache Jenkins Server <jenk...@builds.apache.org>
Subject Build failed in Jenkins: UIMA-Ruta Java 11 » Apache UIMA Maven: ruta-maven-plugin #8
Date Fri, 14 Jun 2019 08:54:40 GMT
See <https://builds.apache.org/job/UIMA-Ruta%20Java%2011/org.apache.uima$ruta-maven-plugin/8/display/redirect>

------------------------------------------
[...truncated 19.95 KB...]
[INFO] Downloading: https://repo.maven.apache.org/maven2/org/apache/maven/plugin-tools/maven-plugin-tools-api/3.5.2/maven-plugin-tools-api-3.5.2.jar
[INFO] Downloading: https://repo.maven.apache.org/maven2/org/apache/maven/plugin-tools/maven-plugin-tools-generators/3.5.2/maven-plugin-tools-generators-3.5.2.jar
[INFO] Downloading: https://repo.maven.apache.org/maven2/org/ow2/asm/asm-commons/6.1.1/asm-commons-6.1.1.jar
[INFO] Downloading: https://repo.maven.apache.org/maven2/org/ow2/asm/asm-tree/6.1.1/asm-tree-6.1.1.jar
[INFO] Downloading: https://repo.maven.apache.org/maven2/org/ow2/asm/asm-analysis/6.1.1/asm-analysis-6.1.1.jar
[INFO] Downloaded: https://repo.maven.apache.org/maven2/org/apache/maven/plugin-tools/maven-plugin-tools-generators/3.5.2/maven-plugin-tools-generators-3.5.2.jar
(48 KB at 2146.0 KB/sec)
[INFO] Downloading: https://repo.maven.apache.org/maven2/net/sf/jtidy/jtidy/r938/jtidy-r938.jar
[INFO] Downloaded: https://repo.maven.apache.org/maven2/org/apache/maven/plugin-tools/maven-plugin-tools-api/3.5.2/maven-plugin-tools-api-3.5.2.jar
(24 KB at 697.4 KB/sec)
[INFO] Downloading: https://repo.maven.apache.org/maven2/org/apache/maven/plugin-tools/maven-plugin-tools-java/3.5.2/maven-plugin-tools-java-3.5.2.jar
[INFO] Downloaded: https://repo.maven.apache.org/maven2/org/ow2/asm/asm-analysis/6.1.1/asm-analysis-6.1.1.jar
(32 KB at 946.3 KB/sec)
[INFO] Downloading: https://repo.maven.apache.org/maven2/com/thoughtworks/qdox/qdox/2.0-M5/qdox-2.0-M5.jar
[INFO] Downloaded: https://repo.maven.apache.org/maven2/org/ow2/asm/asm-commons/6.1.1/asm-commons-6.1.1.jar
(76 KB at 1998.0 KB/sec)
[INFO] Downloading: https://repo.maven.apache.org/maven2/org/apache/maven/plugin-tools/maven-plugin-tools-annotations/3.5.2/maven-plugin-tools-annotations-3.5.2.jar
[INFO] Downloaded: https://repo.maven.apache.org/maven2/net/sf/jtidy/jtidy/r938/jtidy-r938.jar
(245 KB at 5547.0 KB/sec)
[INFO] Downloading: https://repo.maven.apache.org/maven2/org/codehaus/plexus/plexus-archiver/3.4.1/plexus-archiver-3.4.1.jar
[INFO] Downloaded: https://repo.maven.apache.org/maven2/org/apache/maven/plugin-tools/maven-plugin-tools-java/3.5.2/maven-plugin-tools-java-3.5.2.jar
(18 KB at 384.9 KB/sec)
[INFO] Downloading: https://repo.maven.apache.org/maven2/org/apache/maven/doxia/doxia-core/1.4/doxia-core-1.4.jar
[INFO] Downloaded: https://repo.maven.apache.org/maven2/org/ow2/asm/asm-tree/6.1.1/asm-tree-6.1.1.jar
(49 KB at 1039.9 KB/sec)
[INFO] Downloading: https://repo.maven.apache.org/maven2/javax/servlet/servlet-api/2.3/servlet-api-2.3.jar
[INFO] Downloaded: https://repo.maven.apache.org/maven2/org/apache/maven/plugin-tools/maven-plugin-tools-annotations/3.5.2/maven-plugin-tools-annotations-3.5.2.jar
(43 KB at 750.1 KB/sec)
[INFO] Downloading: https://repo.maven.apache.org/maven2/org/apache/maven/shared/maven-shared-utils/0.6/maven-shared-utils-0.6.jar
[INFO] Downloaded: https://repo.maven.apache.org/maven2/com/thoughtworks/qdox/qdox/2.0-M5/qdox-2.0-M5.jar
(307 KB at 5370.0 KB/sec)
[INFO] Downloading: https://repo.maven.apache.org/maven2/org/codehaus/plexus/plexus-velocity/1.1.8/plexus-velocity-1.1.8.jar
[INFO] Downloaded: https://repo.maven.apache.org/maven2/org/codehaus/plexus/plexus-archiver/3.4.1/plexus-archiver-3.4.1.jar
(183 KB at 2947.2 KB/sec)
[INFO] Downloading: https://repo.maven.apache.org/maven2/org/apache/maven/surefire/maven-surefire-common/2.19.1/maven-surefire-common-2.19.1.jar
[INFO] Downloaded: https://repo.maven.apache.org/maven2/javax/servlet/servlet-api/2.3/servlet-api-2.3.jar
(77 KB at 1171.5 KB/sec)
[INFO] Downloading: https://repo.maven.apache.org/maven2/org/apache/maven/surefire/surefire-api/2.19.1/surefire-api-2.19.1.jar
[INFO] Downloaded: https://repo.maven.apache.org/maven2/org/apache/maven/doxia/doxia-core/1.4/doxia-core-1.4.jar
(162 KB at 2439.9 KB/sec)
[INFO] Downloading: https://repo.maven.apache.org/maven2/org/apache/maven/surefire/surefire-booter/2.19.1/surefire-booter-2.19.1.jar
[INFO] Downloaded: https://repo.maven.apache.org/maven2/org/codehaus/plexus/plexus-velocity/1.1.8/plexus-velocity-1.1.8.jar
(8 KB at 108.5 KB/sec)
[INFO] Downloaded: https://repo.maven.apache.org/maven2/org/apache/maven/shared/maven-shared-utils/0.6/maven-shared-utils-0.6.jar
(161 KB at 2143.7 KB/sec)
[INFO] Downloaded: https://repo.maven.apache.org/maven2/org/apache/maven/surefire/surefire-booter/2.19.1/surefire-booter-2.19.1.jar
(45 KB at 562.5 KB/sec)
[INFO] Downloaded: https://repo.maven.apache.org/maven2/org/apache/maven/surefire/maven-surefire-common/2.19.1/maven-surefire-common-2.19.1.jar
(286 KB at 3570.6 KB/sec)
[INFO] Downloaded: https://repo.maven.apache.org/maven2/org/apache/maven/surefire/surefire-api/2.19.1/surefire-api-2.19.1.jar
(192 KB at 2279.5 KB/sec)
[INFO] Using 'UTF-8' encoding to read mojo source files.
[INFO] java-annotations mojo extractor found 0 mojo descriptor.
[INFO] 
[INFO] --- maven-remote-resources-plugin:1.5:process (process-resource-bundles) @ ruta-maven-plugin
---
[INFO] 
[INFO] --- maven-remote-resources-plugin:1.5:process (default) @ ruta-maven-plugin ---
[INFO] 
[INFO] --- maven-resources-plugin:3.1.0:resources (default-resources) @ ruta-maven-plugin
---
[INFO] Using 'UTF-8' encoding to copy filtered resources.
[INFO] Copying 1 resource
[INFO] Copying 3 resources
[INFO] Copying 3 resources
[INFO] 
[INFO] --- maven-compiler-plugin:3.8.0:compile (default-compile) @ ruta-maven-plugin ---
[INFO] Changes detected - recompiling the module!
[INFO] Compiling 5 source files to <https://builds.apache.org/job/UIMA-Ruta%20Java%2011/org.apache.uima$ruta-maven-plugin/ws/target/classes>
[INFO] 
[INFO] --- maven-plugin-plugin:3.5.2:descriptor (default-descriptor) @ ruta-maven-plugin ---
[INFO] Using 'UTF-8' encoding to read mojo source files.
[INFO] java-annotations mojo extractor found 4 mojo descriptors.
[INFO] 
[INFO] --- maven-resources-plugin:3.1.0:testResources (default-testResources) @ ruta-maven-plugin
---
[INFO] Using 'UTF-8' encoding to copy filtered resources.
[INFO] Copying 2 resources
[INFO] Copying 3 resources
[INFO] Copying 3 resources
[INFO] 
[INFO] --- maven-compiler-plugin:3.8.0:testCompile (default-testCompile) @ ruta-maven-plugin
---
[INFO] Changes detected - recompiling the module!
[INFO] Compiling 1 source file to <https://builds.apache.org/job/UIMA-Ruta%20Java%2011/org.apache.uima$ruta-maven-plugin/ws/target/test-classes>
[INFO] 
[INFO] --- maven-surefire-plugin:2.22.1:test (default-test) @ ruta-maven-plugin ---
[INFO] 
[INFO] -------------------------------------------------------
[INFO]  T E S T S
[INFO] -------------------------------------------------------
[INFO] Running org.apache.uima.ruta.maven.RutaGenerateDescriptorMojoTest
[debug] Classpath entry: <https://builds.apache.org/job/UIMA-Ruta%20Java%2011/org.apache.uima$ruta-maven-plugin/ws/target/project-simple-test/src/main/java>
[debug] Classpath entry: <https://builds.apache.org/job/UIMA-Ruta%20Java%2011/org.apache.uima$ruta-maven-plugin/ws/target/project-simple-test/target/generated-sources/ruta/descriptor>
[debug] Classpath entry: <https://builds.apache.org/job/UIMA-Ruta%20Java%2011/org.apache.uima$ruta-maven-plugin/ws/target/project-simple-test/src/main/resources>
[debug] Classpath entry: <https://builds.apache.org/job/UIMA-Ruta%20Java%2011/org.apache.uima$ruta-maven-plugin/ws/target/project-simple-test/target/classes>
[debug] Writing descriptor to: <https://builds.apache.org/job/UIMA-Ruta%20Java%2011/org.apache.uima$ruta-maven-plugin/ws/target/project-simple-test/target/generated-sources/ruta/descriptor/SimpleEngine.xml>
[debug] Writing descriptor to: <https://builds.apache.org/job/UIMA-Ruta%20Java%2011/org.apache.uima$ruta-maven-plugin/ws/target/project-simple-test/target/generated-sources/ruta/descriptor/SimpleTypeSystem.xml>
[INFO] Tests run: 1, Failures: 0, Errors: 0, Skipped: 0, Time elapsed: 2.73 s - in org.apache.uima.ruta.maven.RutaGenerateDescriptorMojoTest
[INFO] 
[INFO] Results:
[INFO] 
[INFO] Tests run: 1, Failures: 0, Errors: 0, Skipped: 0
[INFO] 
[JENKINS] Recording test results
[INFO] 
[INFO] --- maven-antrun-plugin:1.8:run (dup-meta-jar-cleanup) @ ruta-maven-plugin ---
[INFO] Executing tasks

main:
[INFO] Executed tasks
[INFO] 
[INFO] --- maven-resources-plugin:3.1.0:copy-resources (copy customized bin LICENSE file)
@ ruta-maven-plugin ---
[INFO] Using 'UTF-8' encoding to copy filtered resources.
[INFO] skip non existing resourceDirectory <https://builds.apache.org/job/UIMA-Ruta%20Java%2011/org.apache.uima$ruta-maven-plugin/ws/src/main/readme_bin>
[INFO] 
[INFO] --- maven-jar-plugin:3.1.0:jar (default-jar) @ ruta-maven-plugin ---
[INFO] Building jar: <https://builds.apache.org/job/UIMA-Ruta%20Java%2011/org.apache.uima$ruta-maven-plugin/ws/target/ruta-maven-plugin-2.7.1-SNAPSHOT.jar>
[INFO] 
[INFO] --- maven-plugin-plugin:3.5.2:addPluginArtifactMetadata (default-addPluginArtifactMetadata)
@ ruta-maven-plugin ---
[INFO] 
[INFO] --- maven-site-plugin:3.7.1:attach-descriptor (attach-descriptor) @ ruta-maven-plugin
---
[INFO] Skipping because packaging 'maven-plugin' is not pom.
[INFO] 
[INFO] --- maven-invoker-plugin:2.0.0:install (integration-test) @ ruta-maven-plugin ---
[INFO] Downloading: https://repo.maven.apache.org/maven2/org/apache/maven/shared/maven-invoker/2.2/maven-invoker-2.2.pom
[INFO] Downloaded: https://repo.maven.apache.org/maven2/org/apache/maven/shared/maven-invoker/2.2/maven-invoker-2.2.pom
(6 KB at 381.1 KB/sec)
[INFO] Downloading: https://repo.maven.apache.org/maven2/org/apache/maven/reporting/maven-reporting-impl/2.2/maven-reporting-impl-2.2.pom
[INFO] Downloaded: https://repo.maven.apache.org/maven2/org/apache/maven/reporting/maven-reporting-impl/2.2/maven-reporting-impl-2.2.pom
(5 KB at 308.0 KB/sec)
[INFO] Downloading: https://repo.maven.apache.org/maven2/org/apache/maven/shared/maven-script-interpreter/1.1/maven-script-interpreter-1.1.pom
[INFO] Downloaded: https://repo.maven.apache.org/maven2/org/apache/maven/shared/maven-script-interpreter/1.1/maven-script-interpreter-1.1.pom
(4 KB at 258.9 KB/sec)
[INFO] Downloading: https://repo.maven.apache.org/maven2/org/codehaus/groovy/groovy/2.0.1/groovy-2.0.1.pom
[INFO] Downloaded: https://repo.maven.apache.org/maven2/org/codehaus/groovy/groovy/2.0.1/groovy-2.0.1.pom
(16 KB at 1041.8 KB/sec)
[INFO] Downloading: https://repo.maven.apache.org/maven2/antlr/antlr/2.7.7/antlr-2.7.7.pom
[INFO] Downloaded: https://repo.maven.apache.org/maven2/antlr/antlr/2.7.7/antlr-2.7.7.pom
(632 B at 44.1 KB/sec)
[INFO] Downloading: https://repo.maven.apache.org/maven2/org/ow2/asm/asm-tree/4.0/asm-tree-4.0.pom
[INFO] Downloaded: https://repo.maven.apache.org/maven2/org/ow2/asm/asm-tree/4.0/asm-tree-4.0.pom
(3 KB at 145.2 KB/sec)
[INFO] Downloading: https://repo.maven.apache.org/maven2/org/ow2/asm/asm-parent/4.0/asm-parent-4.0.pom
[INFO] Downloaded: https://repo.maven.apache.org/maven2/org/ow2/asm/asm-parent/4.0/asm-parent-4.0.pom
(6 KB at 383.2 KB/sec)
[INFO] Downloading: https://repo.maven.apache.org/maven2/org/ow2/ow2/1.3/ow2-1.3.pom
[INFO] Downloaded: https://repo.maven.apache.org/maven2/org/ow2/ow2/1.3/ow2-1.3.pom (10 KB
at 773.8 KB/sec)
[INFO] Downloading: https://repo.maven.apache.org/maven2/org/ow2/asm/asm/4.0/asm-4.0.pom
[INFO] Downloaded: https://repo.maven.apache.org/maven2/org/ow2/asm/asm/4.0/asm-4.0.pom (2
KB at 157.3 KB/sec)
[INFO] Downloading: https://repo.maven.apache.org/maven2/org/ow2/asm/asm-commons/4.0/asm-commons-4.0.pom
[INFO] Downloaded: https://repo.maven.apache.org/maven2/org/ow2/asm/asm-commons/4.0/asm-commons-4.0.pom
(3 KB at 157.2 KB/sec)
[INFO] Downloading: https://repo.maven.apache.org/maven2/org/ow2/asm/asm-util/4.0/asm-util-4.0.pom
[INFO] Downloaded: https://repo.maven.apache.org/maven2/org/ow2/asm/asm-util/4.0/asm-util-4.0.pom
(3 KB at 145.5 KB/sec)
[INFO] Downloading: https://repo.maven.apache.org/maven2/org/ow2/asm/asm-analysis/4.0/asm-analysis-4.0.pom
[INFO] Downloaded: https://repo.maven.apache.org/maven2/org/ow2/asm/asm-analysis/4.0/asm-analysis-4.0.pom
(3 KB at 146.1 KB/sec)
[INFO] Downloading: https://repo.maven.apache.org/maven2/org/apache/ant/ant/1.8.1/ant-1.8.1.pom
[INFO] Downloaded: https://repo.maven.apache.org/maven2/org/apache/ant/ant/1.8.1/ant-1.8.1.pom
(9 KB at 661.0 KB/sec)
[INFO] Downloading: https://repo.maven.apache.org/maven2/org/apache/ant/ant-parent/1.8.1/ant-parent-1.8.1.pom
[INFO] Downloaded: https://repo.maven.apache.org/maven2/org/apache/ant/ant-parent/1.8.1/ant-parent-1.8.1.pom
(5 KB at 321.6 KB/sec)
[INFO] Downloading: https://repo.maven.apache.org/maven2/org/apache/maven/doxia/doxia-site-renderer/1.1.4/doxia-site-renderer-1.1.4.pom
[INFO] Downloaded: https://repo.maven.apache.org/maven2/org/apache/maven/doxia/doxia-site-renderer/1.1.4/doxia-site-renderer-1.1.4.pom
(6 KB at 459.7 KB/sec)
[INFO] Downloading: https://repo.maven.apache.org/maven2/org/apache/maven/doxia/doxia-sitetools/1.1.4/doxia-sitetools-1.1.4.pom
[INFO] Downloaded: https://repo.maven.apache.org/maven2/org/apache/maven/doxia/doxia-sitetools/1.1.4/doxia-sitetools-1.1.4.pom
(16 KB at 1117.5 KB/sec)
[INFO] Downloading: https://repo.maven.apache.org/maven2/org/apache/maven/doxia/doxia-core/1.1.4/doxia-core-1.1.4.pom
[INFO] Downloaded: https://repo.maven.apache.org/maven2/org/apache/maven/doxia/doxia-core/1.1.4/doxia-core-1.1.4.pom
(4 KB at 242.3 KB/sec)
[INFO] Downloading: https://repo.maven.apache.org/maven2/org/apache/maven/doxia/doxia/1.1.4/doxia-1.1.4.pom
[INFO] Downloaded: https://repo.maven.apache.org/maven2/org/apache/maven/doxia/doxia/1.1.4/doxia-1.1.4.pom
(19 KB at 1316.5 KB/sec)
[INFO] Downloading: https://repo.maven.apache.org/maven2/org/apache/maven/doxia/doxia-sink-api/1.1.4/doxia-sink-api-1.1.4.pom
[INFO] Downloaded: https://repo.maven.apache.org/maven2/org/apache/maven/doxia/doxia-sink-api/1.1.4/doxia-sink-api-1.1.4.pom
(2 KB at 109.9 KB/sec)
[INFO] Downloading: https://repo.maven.apache.org/maven2/org/apache/maven/doxia/doxia-logging-api/1.1.4/doxia-logging-api-1.1.4.pom
[INFO] Downloaded: https://repo.maven.apache.org/maven2/org/apache/maven/doxia/doxia-logging-api/1.1.4/doxia-logging-api-1.1.4.pom
(2 KB at 110.2 KB/sec)
[INFO] Downloading: https://repo.maven.apache.org/maven2/org/codehaus/plexus/plexus-utils/1.5.12/plexus-utils-1.5.12.pom
[INFO] Downloaded: https://repo.maven.apache.org/maven2/org/codehaus/plexus/plexus-utils/1.5.12/plexus-utils-1.5.12.pom
(6 KB at 458.5 KB/sec)
[INFO] Downloading: https://repo.maven.apache.org/maven2/org/apache/maven/doxia/doxia-decoration-model/1.1.4/doxia-decoration-model-1.1.4.pom
[INFO] Downloaded: https://repo.maven.apache.org/maven2/org/apache/maven/doxia/doxia-decoration-model/1.1.4/doxia-decoration-model-1.1.4.pom
(3 KB at 193.7 KB/sec)
[INFO] Downloading: https://repo.maven.apache.org/maven2/org/apache/maven/doxia/doxia-module-xhtml/1.1.4/doxia-module-xhtml-1.1.4.pom
[INFO] Downloaded: https://repo.maven.apache.org/maven2/org/apache/maven/doxia/doxia-module-xhtml/1.1.4/doxia-module-xhtml-1.1.4.pom
(2 KB at 111.7 KB/sec)
[INFO] Downloading: https://repo.maven.apache.org/maven2/org/apache/maven/doxia/doxia-modules/1.1.4/doxia-modules-1.1.4.pom
[INFO] Downloaded: https://repo.maven.apache.org/maven2/org/apache/maven/doxia/doxia-modules/1.1.4/doxia-modules-1.1.4.pom
(3 KB at 148.7 KB/sec)
[INFO] Downloading: https://repo.maven.apache.org/maven2/org/apache/maven/doxia/doxia-module-fml/1.1.4/doxia-module-fml-1.1.4.pom
[INFO] Downloaded: https://repo.maven.apache.org/maven2/org/apache/maven/doxia/doxia-module-fml/1.1.4/doxia-module-fml-1.1.4.pom
(6 KB at 382.5 KB/sec)
[INFO] Downloading: https://repo.maven.apache.org/maven2/org/codehaus/groovy/groovy-all/2.0.1/groovy-all-2.0.1.pom
[INFO] Downloaded: https://repo.maven.apache.org/maven2/org/codehaus/groovy/groovy-all/2.0.1/groovy-all-2.0.1.pom
(18 KB at 1240.7 KB/sec)
[INFO] Downloading: https://repo.maven.apache.org/maven2/org/codehaus/plexus/plexus-utils/3.0.21/plexus-utils-3.0.21.pom
[INFO] Downloaded: https://repo.maven.apache.org/maven2/org/codehaus/plexus/plexus-utils/3.0.21/plexus-utils-3.0.21.pom
(4 KB at 286.2 KB/sec)
[INFO] Downloading: https://repo.maven.apache.org/maven2/org/apache/maven/shared/maven-invoker/2.2/maven-invoker-2.2.jar
[INFO] Downloading: https://repo.maven.apache.org/maven2/org/apache/maven/reporting/maven-reporting-impl/2.2/maven-reporting-impl-2.2.jar
[INFO] Downloading: https://repo.maven.apache.org/maven2/org/apache/maven/shared/maven-script-interpreter/1.1/maven-script-interpreter-1.1.jar
[INFO] Downloading: https://repo.maven.apache.org/maven2/org/codehaus/groovy/groovy/2.0.1/groovy-2.0.1.jar
[INFO] Downloading: https://repo.maven.apache.org/maven2/antlr/antlr/2.7.7/antlr-2.7.7.jar
[INFO] Downloaded: https://repo.maven.apache.org/maven2/org/apache/maven/shared/maven-invoker/2.2/maven-invoker-2.2.jar
(30 KB at 1844.9 KB/sec)
[INFO] Downloading: https://repo.maven.apache.org/maven2/org/ow2/asm/asm-tree/4.0/asm-tree-4.0.jar
[INFO] Downloaded: https://repo.maven.apache.org/maven2/org/apache/maven/reporting/maven-reporting-impl/2.2/maven-reporting-impl-2.2.jar
(17 KB at 1029.1 KB/sec)
[INFO] Downloading: https://repo.maven.apache.org/maven2/org/ow2/asm/asm-commons/4.0/asm-commons-4.0.jar
[INFO] Downloaded: https://repo.maven.apache.org/maven2/org/apache/maven/shared/maven-script-interpreter/1.1/maven-script-interpreter-1.1.jar
(21 KB at 1082.5 KB/sec)
[INFO] Downloading: https://repo.maven.apache.org/maven2/org/ow2/asm/asm/4.0/asm-4.0.jar
[INFO] Downloaded: https://repo.maven.apache.org/maven2/antlr/antlr/2.7.7/antlr-2.7.7.jar
(435 KB at 17394.1 KB/sec)
[INFO] Downloading: https://repo.maven.apache.org/maven2/org/ow2/asm/asm-util/4.0/asm-util-4.0.jar
[INFO] Downloaded: https://repo.maven.apache.org/maven2/org/ow2/asm/asm-tree/4.0/asm-tree-4.0.jar
(22 KB at 795.1 KB/sec)
[INFO] Downloading: https://repo.maven.apache.org/maven2/org/ow2/asm/asm-analysis/4.0/asm-analysis-4.0.jar
[INFO] Downloaded: https://repo.maven.apache.org/maven2/org/ow2/asm/asm-commons/4.0/asm-commons-4.0.jar
(37 KB at 1366.3 KB/sec)
[INFO] Downloading: https://repo.maven.apache.org/maven2/org/apache/maven/doxia/doxia-site-renderer/1.1.4/doxia-site-renderer-1.1.4.jar
[INFO] Downloaded: https://repo.maven.apache.org/maven2/org/ow2/asm/asm/4.0/asm-4.0.jar (45
KB at 1498.1 KB/sec)
[INFO] Downloading: https://repo.maven.apache.org/maven2/org/apache/maven/doxia/doxia-decoration-model/1.1.4/doxia-decoration-model-1.1.4.jar
[INFO] Downloaded: https://repo.maven.apache.org/maven2/org/ow2/asm/asm-util/4.0/asm-util-4.0.jar
(37 KB at 950.7 KB/sec)
[INFO] Downloading: https://repo.maven.apache.org/maven2/org/apache/maven/doxia/doxia-module-xhtml/1.1.4/doxia-module-xhtml-1.1.4.jar
[INFO] Downloaded: https://repo.maven.apache.org/maven2/org/ow2/asm/asm-analysis/4.0/asm-analysis-4.0.jar
(20 KB at 478.9 KB/sec)
[INFO] Downloading: https://repo.maven.apache.org/maven2/org/apache/maven/doxia/doxia-module-fml/1.1.4/doxia-module-fml-1.1.4.jar
[INFO] Downloaded: https://repo.maven.apache.org/maven2/org/apache/maven/doxia/doxia-site-renderer/1.1.4/doxia-site-renderer-1.1.4.jar
(50 KB at 1153.2 KB/sec)
[INFO] Downloading: https://repo.maven.apache.org/maven2/org/codehaus/groovy/groovy-all/2.0.1/groovy-all-2.0.1.jar
[INFO] Downloaded: https://repo.maven.apache.org/maven2/org/apache/maven/doxia/doxia-decoration-model/1.1.4/doxia-decoration-model-1.1.4.jar
(52 KB at 1110.8 KB/sec)
[INFO] Downloading: https://repo.maven.apache.org/maven2/org/apache/ant/ant/1.8.1/ant-1.8.1.jar
[INFO] Downloaded: https://repo.maven.apache.org/maven2/org/apache/maven/doxia/doxia-module-xhtml/1.1.4/doxia-module-xhtml-1.1.4.jar
(15 KB at 271.8 KB/sec)
[INFO] Downloading: https://repo.maven.apache.org/maven2/org/codehaus/plexus/plexus-utils/3.0.21/plexus-utils-3.0.21.jar
[INFO] Downloaded: https://repo.maven.apache.org/maven2/org/apache/maven/doxia/doxia-module-fml/1.1.4/doxia-module-fml-1.1.4.jar
(37 KB at 652.5 KB/sec)
[INFO] Downloading: https://repo.maven.apache.org/maven2/commons-io/commons-io/2.2/commons-io-2.2.jar
[INFO] Downloaded: https://repo.maven.apache.org/maven2/org/codehaus/plexus/plexus-utils/3.0.21/plexus-utils-3.0.21.jar
(240 KB at 2542.9 KB/sec)
[INFO] Downloaded: https://repo.maven.apache.org/maven2/commons-io/commons-io/2.2/commons-io-2.2.jar
(170 KB at 1513.6 KB/sec)
[INFO] Downloaded: https://repo.maven.apache.org/maven2/org/apache/ant/ant/1.8.1/ant-1.8.1.jar
(1479 KB at 11643.9 KB/sec)
[INFO] Downloaded: https://repo.maven.apache.org/maven2/org/codehaus/groovy/groovy/2.0.1/groovy-2.0.1.jar
(3194 KB at 20087.9 KB/sec)
[INFO] Downloaded: https://repo.maven.apache.org/maven2/org/codehaus/groovy/groovy-all/2.0.1/groovy-all-2.0.1.jar
(6047 KB at 30083.8 KB/sec)
[INFO] Installing /home/jenkins/jenkins-slave/workspace/UIMA-Ruta Java 11/trunk/ruta-parent/pom.xml
to <https://builds.apache.org/job/UIMA-Ruta%20Java%2011/org.apache.uima$ruta-maven-plugin/ws/target/local-repo/org/apache/uima/ruta-parent/2.7.1-SNAPSHOT/ruta-parent-2.7.1-SNAPSHOT.pom>
[INFO] Installing /home/jenkins/jenkins-slave/workspace/UIMA-Ruta Java 11/trunk/ruta-basic-type/pom.xml
to <https://builds.apache.org/job/UIMA-Ruta%20Java%2011/org.apache.uima$ruta-maven-plugin/ws/target/local-repo/org/apache/uima/ruta-basic-type/2.7.1-SNAPSHOT/ruta-basic-type-2.7.1-SNAPSHOT.pom>
[INFO] Installing /home/jenkins/jenkins-slave/workspace/UIMA-Ruta Java 11/trunk/ruta-basic-type/target/ruta-basic-type-2.7.1-SNAPSHOT.jar
to <https://builds.apache.org/job/UIMA-Ruta%20Java%2011/org.apache.uima$ruta-maven-plugin/ws/target/local-repo/org/apache/uima/ruta-basic-type/2.7.1-SNAPSHOT/ruta-basic-type-2.7.1-SNAPSHOT.jar>
[INFO] Installing /home/jenkins/jenkins-slave/workspace/UIMA-Ruta Java 11/trunk/ruta-basic-type/pom.xml
to <https://builds.apache.org/job/UIMA-Ruta%20Java%2011/org.apache.uima$ruta-maven-plugin/ws/target/local-repo/org/apache/uima/ruta-basic-type/2.7.1-SNAPSHOT/ruta-basic-type-2.7.1-SNAPSHOT.pom>
[INFO] Installing /home/jenkins/jenkins-slave/workspace/UIMA-Ruta Java 11/trunk/ruta-typesystem/pom.xml
to <https://builds.apache.org/job/UIMA-Ruta%20Java%2011/org.apache.uima$ruta-maven-plugin/ws/target/local-repo/org/apache/uima/ruta-typesystem/2.7.1-SNAPSHOT/ruta-typesystem-2.7.1-SNAPSHOT.pom>
[INFO] Installing /home/jenkins/jenkins-slave/workspace/UIMA-Ruta Java 11/trunk/ruta-typesystem/target/ruta-typesystem-2.7.1-SNAPSHOT.jar
to <https://builds.apache.org/job/UIMA-Ruta%20Java%2011/org.apache.uima$ruta-maven-plugin/ws/target/local-repo/org/apache/uima/ruta-typesystem/2.7.1-SNAPSHOT/ruta-typesystem-2.7.1-SNAPSHOT.jar>
[INFO] Installing /home/jenkins/jenkins-slave/workspace/UIMA-Ruta Java 11/trunk/ruta-typesystem/pom.xml
to <https://builds.apache.org/job/UIMA-Ruta%20Java%2011/org.apache.uima$ruta-maven-plugin/ws/target/local-repo/org/apache/uima/ruta-typesystem/2.7.1-SNAPSHOT/ruta-typesystem-2.7.1-SNAPSHOT.pom>
[INFO] Installing /home/jenkins/jenkins-slave/workspace/UIMA-Ruta Java 11/trunk/ruta-core/pom.xml
to <https://builds.apache.org/job/UIMA-Ruta%20Java%2011/org.apache.uima$ruta-maven-plugin/ws/target/local-repo/org/apache/uima/ruta-core/2.7.1-SNAPSHOT/ruta-core-2.7.1-SNAPSHOT.pom>
[INFO] Installing /home/jenkins/jenkins-slave/workspace/UIMA-Ruta Java 11/trunk/ruta-core/target/ruta-core-2.7.1-SNAPSHOT.jar
to <https://builds.apache.org/job/UIMA-Ruta%20Java%2011/org.apache.uima$ruta-maven-plugin/ws/target/local-repo/org/apache/uima/ruta-core/2.7.1-SNAPSHOT/ruta-core-2.7.1-SNAPSHOT.jar>
[INFO] Installing /home/jenkins/jenkins-slave/workspace/UIMA-Ruta Java 11/trunk/ruta-core/pom.xml
to <https://builds.apache.org/job/UIMA-Ruta%20Java%2011/org.apache.uima$ruta-maven-plugin/ws/target/local-repo/org/apache/uima/ruta-core/2.7.1-SNAPSHOT/ruta-core-2.7.1-SNAPSHOT.pom>
[INFO] Installing /home/jenkins/jenkins-slave/workspace/UIMA-Ruta Java 11/trunk/ruta-core-ext/pom.xml
to <https://builds.apache.org/job/UIMA-Ruta%20Java%2011/org.apache.uima$ruta-maven-plugin/ws/target/local-repo/org/apache/uima/ruta-core-ext/2.7.1-SNAPSHOT/ruta-core-ext-2.7.1-SNAPSHOT.pom>
[INFO] Installing /home/jenkins/jenkins-slave/workspace/UIMA-Ruta Java 11/trunk/ruta-core-ext/target/ruta-core-ext-2.7.1-SNAPSHOT.jar
to <https://builds.apache.org/job/UIMA-Ruta%20Java%2011/org.apache.uima$ruta-maven-plugin/ws/target/local-repo/org/apache/uima/ruta-core-ext/2.7.1-SNAPSHOT/ruta-core-ext-2.7.1-SNAPSHOT.jar>
[INFO] Installing /home/jenkins/jenkins-slave/workspace/UIMA-Ruta Java 11/trunk/ruta-core-ext/pom.xml
to <https://builds.apache.org/job/UIMA-Ruta%20Java%2011/org.apache.uima$ruta-maven-plugin/ws/target/local-repo/org/apache/uima/ruta-core-ext/2.7.1-SNAPSHOT/ruta-core-ext-2.7.1-SNAPSHOT.pom>
[INFO] Installing /home/jenkins/jenkins-slave/workspace/UIMA-Ruta Java 11/trunk/ruta-ep-parent/pom.xml
to <https://builds.apache.org/job/UIMA-Ruta%20Java%2011/org.apache.uima$ruta-maven-plugin/ws/target/local-repo/org/apache/uima/ruta-ep-parent/2.7.1-SNAPSHOT/ruta-ep-parent-2.7.1-SNAPSHOT.pom>
[INFO] Installing /home/jenkins/jenkins-slave/workspace/UIMA-Ruta Java 11/trunk/ruta-ep-engine/pom.xml
to <https://builds.apache.org/job/UIMA-Ruta%20Java%2011/org.apache.uima$ruta-maven-plugin/ws/target/local-repo/org/apache/uima/ruta-ep-engine/2.7.1-SNAPSHOT/ruta-ep-engine-2.7.1-SNAPSHOT.pom>
[INFO] Installing /home/jenkins/jenkins-slave/workspace/UIMA-Ruta Java 11/trunk/ruta-ep-engine/target/org.apache.uima.ruta.engine_2.7.1.SNAPSHOT.jar
to <https://builds.apache.org/job/UIMA-Ruta%20Java%2011/org.apache.uima$ruta-maven-plugin/ws/target/local-repo/org/apache/uima/ruta-ep-engine/2.7.1-SNAPSHOT/ruta-ep-engine-2.7.1-SNAPSHOT.jar>
[INFO] Installing /home/jenkins/jenkins-slave/workspace/UIMA-Ruta Java 11/trunk/ruta-ep-engine/pom.xml
to <https://builds.apache.org/job/UIMA-Ruta%20Java%2011/org.apache.uima$ruta-maven-plugin/ws/target/local-repo/org/apache/uima/ruta-ep-engine/2.7.1-SNAPSHOT/ruta-ep-engine-2.7.1-SNAPSHOT.pom>
[INFO] Installing /home/jenkins/jenkins-slave/workspace/UIMA-Ruta Java 11/trunk/ruta-ep-ide/pom.xml
to <https://builds.apache.org/job/UIMA-Ruta%20Java%2011/org.apache.uima$ruta-maven-plugin/ws/target/local-repo/org/apache/uima/ruta-ep-ide/2.7.1-SNAPSHOT/ruta-ep-ide-2.7.1-SNAPSHOT.pom>
[INFO] Installing /home/jenkins/jenkins-slave/workspace/UIMA-Ruta Java 11/trunk/ruta-ep-ide/target/org.apache.uima.ruta.ide_2.7.1.SNAPSHOT.jar
to <https://builds.apache.org/job/UIMA-Ruta%20Java%2011/org.apache.uima$ruta-maven-plugin/ws/target/local-repo/org/apache/uima/ruta-ep-ide/2.7.1-SNAPSHOT/ruta-ep-ide-2.7.1-SNAPSHOT.jar>
[INFO] Installing /home/jenkins/jenkins-slave/workspace/UIMA-Ruta Java 11/trunk/ruta-ep-ide/pom.xml
to <https://builds.apache.org/job/UIMA-Ruta%20Java%2011/org.apache.uima$ruta-maven-plugin/ws/target/local-repo/org/apache/uima/ruta-ep-ide/2.7.1-SNAPSHOT/ruta-ep-ide-2.7.1-SNAPSHOT.pom>
[INFO] Installing /home/jenkins/jenkins-slave/workspace/UIMA-Ruta Java 11/trunk/ruta-ep-ide-ui/pom.xml
to <https://builds.apache.org/job/UIMA-Ruta%20Java%2011/org.apache.uima$ruta-maven-plugin/ws/target/local-repo/org/apache/uima/ruta-ep-ide-ui/2.7.1-SNAPSHOT/ruta-ep-ide-ui-2.7.1-SNAPSHOT.pom>
[INFO] Installing /home/jenkins/jenkins-slave/workspace/UIMA-Ruta Java 11/trunk/ruta-ep-ide-ui/target/org.apache.uima.ruta.ide.ui_2.7.1.SNAPSHOT.jar
to <https://builds.apache.org/job/UIMA-Ruta%20Java%2011/org.apache.uima$ruta-maven-plugin/ws/target/local-repo/org/apache/uima/ruta-ep-ide-ui/2.7.1-SNAPSHOT/ruta-ep-ide-ui-2.7.1-SNAPSHOT.jar>
[INFO] Installing /home/jenkins/jenkins-slave/workspace/UIMA-Ruta Java 11/trunk/ruta-ep-ide-ui/pom.xml
to <https://builds.apache.org/job/UIMA-Ruta%20Java%2011/org.apache.uima$ruta-maven-plugin/ws/target/local-repo/org/apache/uima/ruta-ep-ide-ui/2.7.1-SNAPSHOT/ruta-ep-ide-ui-2.7.1-SNAPSHOT.pom>
[INFO] Installing /home/jenkins/jenkins-slave/workspace/UIMA-Ruta Java 11/trunk/ruta-ep-caseditor/pom.xml
to <https://builds.apache.org/job/UIMA-Ruta%20Java%2011/org.apache.uima$ruta-maven-plugin/ws/target/local-repo/org/apache/uima/ruta-ep-caseditor/2.7.1-SNAPSHOT/ruta-ep-caseditor-2.7.1-SNAPSHOT.pom>
[INFO] Installing /home/jenkins/jenkins-slave/workspace/UIMA-Ruta Java 11/trunk/ruta-ep-caseditor/target/org.apache.uima.ruta.caseditor_2.7.1.SNAPSHOT.jar
to <https://builds.apache.org/job/UIMA-Ruta%20Java%2011/org.apache.uima$ruta-maven-plugin/ws/target/local-repo/org/apache/uima/ruta-ep-caseditor/2.7.1-SNAPSHOT/ruta-ep-caseditor-2.7.1-SNAPSHOT.jar>
[INFO] Installing /home/jenkins/jenkins-slave/workspace/UIMA-Ruta Java 11/trunk/ruta-ep-caseditor/pom.xml
to <https://builds.apache.org/job/UIMA-Ruta%20Java%2011/org.apache.uima$ruta-maven-plugin/ws/target/local-repo/org/apache/uima/ruta-ep-caseditor/2.7.1-SNAPSHOT/ruta-ep-caseditor-2.7.1-SNAPSHOT.pom>
[INFO] Installing /home/jenkins/jenkins-slave/workspace/UIMA-Ruta Java 11/trunk/ruta-ep-addons/pom.xml
to <https://builds.apache.org/job/UIMA-Ruta%20Java%2011/org.apache.uima$ruta-maven-plugin/ws/target/local-repo/org/apache/uima/ruta-ep-addons/2.7.1-SNAPSHOT/ruta-ep-addons-2.7.1-SNAPSHOT.pom>
[INFO] Installing /home/jenkins/jenkins-slave/workspace/UIMA-Ruta Java 11/trunk/ruta-ep-addons/target/org.apache.uima.ruta.addons_2.7.1.SNAPSHOT.jar
to <https://builds.apache.org/job/UIMA-Ruta%20Java%2011/org.apache.uima$ruta-maven-plugin/ws/target/local-repo/org/apache/uima/ruta-ep-addons/2.7.1-SNAPSHOT/ruta-ep-addons-2.7.1-SNAPSHOT.jar>
[INFO] Installing /home/jenkins/jenkins-slave/workspace/UIMA-Ruta Java 11/trunk/ruta-ep-addons/pom.xml
to <https://builds.apache.org/job/UIMA-Ruta%20Java%2011/org.apache.uima$ruta-maven-plugin/ws/target/local-repo/org/apache/uima/ruta-ep-addons/2.7.1-SNAPSHOT/ruta-ep-addons-2.7.1-SNAPSHOT.pom>
[INFO] Installing /home/jenkins/jenkins-slave/workspace/UIMA-Ruta Java 11/trunk/ruta-ep-textruler/pom.xml
to <https://builds.apache.org/job/UIMA-Ruta%20Java%2011/org.apache.uima$ruta-maven-plugin/ws/target/local-repo/org/apache/uima/ruta-ep-textruler/2.7.1-SNAPSHOT/ruta-ep-textruler-2.7.1-SNAPSHOT.pom>
[INFO] Installing /home/jenkins/jenkins-slave/workspace/UIMA-Ruta Java 11/trunk/ruta-ep-textruler/target/org.apache.uima.ruta.textruler_2.7.1.SNAPSHOT.jar
to <https://builds.apache.org/job/UIMA-Ruta%20Java%2011/org.apache.uima$ruta-maven-plugin/ws/target/local-repo/org/apache/uima/ruta-ep-textruler/2.7.1-SNAPSHOT/ruta-ep-textruler-2.7.1-SNAPSHOT.jar>
[INFO] Installing /home/jenkins/jenkins-slave/workspace/UIMA-Ruta Java 11/trunk/ruta-ep-textruler/pom.xml
to <https://builds.apache.org/job/UIMA-Ruta%20Java%2011/org.apache.uima$ruta-maven-plugin/ws/target/local-repo/org/apache/uima/ruta-ep-textruler/2.7.1-SNAPSHOT/ruta-ep-textruler-2.7.1-SNAPSHOT.pom>
[INFO] Installing /home/jenkins/jenkins-slave/workspace/UIMA-Ruta Java 11/trunk/ruta-ep-core-ext/pom.xml
to <https://builds.apache.org/job/UIMA-Ruta%20Java%2011/org.apache.uima$ruta-maven-plugin/ws/target/local-repo/org/apache/uima/ruta-ep-core-ext/2.7.1-SNAPSHOT/ruta-ep-core-ext-2.7.1-SNAPSHOT.pom>
[INFO] Installing /home/jenkins/jenkins-slave/workspace/UIMA-Ruta Java 11/trunk/ruta-ep-core-ext/target/org.apache.uima.ruta.core.ext_2.7.1.SNAPSHOT.jar
to <https://builds.apache.org/job/UIMA-Ruta%20Java%2011/org.apache.uima$ruta-maven-plugin/ws/target/local-repo/org/apache/uima/ruta-ep-core-ext/2.7.1-SNAPSHOT/ruta-ep-core-ext-2.7.1-SNAPSHOT.jar>
[INFO] Installing /home/jenkins/jenkins-slave/workspace/UIMA-Ruta Java 11/trunk/ruta-ep-core-ext/pom.xml
to <https://builds.apache.org/job/UIMA-Ruta%20Java%2011/org.apache.uima$ruta-maven-plugin/ws/target/local-repo/org/apache/uima/ruta-ep-core-ext/2.7.1-SNAPSHOT/ruta-ep-core-ext-2.7.1-SNAPSHOT.pom>
[INFO] Installing <https://builds.apache.org/job/UIMA-Ruta%20Java%2011/org.apache.uima$ruta-maven-plugin/ws/pom.xml>
to <https://builds.apache.org/job/UIMA-Ruta%20Java%2011/org.apache.uima$ruta-maven-plugin/ws/target/local-repo/org/apache/uima/ruta-maven-plugin/2.7.1-SNAPSHOT/ruta-maven-plugin-2.7.1-SNAPSHOT.pom>
[INFO] Installing <https://builds.apache.org/job/UIMA-Ruta%20Java%2011/org.apache.uima$ruta-maven-plugin/ws/target/ruta-maven-plugin-2.7.1-SNAPSHOT.jar>
to <https://builds.apache.org/job/UIMA-Ruta%20Java%2011/org.apache.uima$ruta-maven-plugin/ws/target/local-repo/org/apache/uima/ruta-maven-plugin/2.7.1-SNAPSHOT/ruta-maven-plugin-2.7.1-SNAPSHOT.jar>
[INFO] 
[INFO] --- maven-invoker-plugin:2.0.0:run (integration-test) @ ruta-maven-plugin ---
[INFO] Building: conflictingShortName/pom.xml
[INFO] ..SUCCESS (13.8 s)
[INFO] Building: importByName/pom.xml
[INFO] ..SUCCESS (15.4 s)
[INFO] Building: wordlists/pom.xml
[INFO] ..SUCCESS (11.1 s)
[INFO] Building: multimodule/pom.xml
[INFO] ..FAILED (7.2 s)
[INFO]   The build exited with code 1. See <https://builds.apache.org/job/UIMA-Ruta%20Java%2011/org.apache.uima$ruta-maven-plugin/ws/target/it/multimodule/build.log>
for details.
[INFO] -------------------------------------------------
[INFO] Build Summary:
[INFO]   Passed: 3, Failed: 1, Errors: 0, Skipped: 0
[INFO] -------------------------------------------------
[ERROR] The following builds failed:
[ERROR] *  multimodule/pom.xml
[INFO] -------------------------------------------------

Mime
View raw message