uima-dev mailing list archives

Site index · List index
Message view « Date » · « Thread »
Top « Date » · « Thread »
From Apache Jenkins Server <jenk...@builds.apache.org>
Subject Build failed in Jenkins: UIMA-Ruta Java 11 #9
Date Tue, 18 Jun 2019 12:56:20 GMT
See <https://builds.apache.org/job/UIMA-Ruta%20Java%2011/9/display/redirect?page=changes>

Changes:

[pkluegl] UIMA-6069: create nodes for elements of primitive arrays

------------------------------------------
[...truncated 2.43 MB...]
main:
[INFO] Executed tasks
[INFO] 
[INFO] --- maven-resources-plugin:3.1.0:copy-resources (copy customized bin LICENSE file)
@ ruta-maven-plugin ---
[INFO] Using 'UTF-8' encoding to copy filtered resources.
[INFO] skip non existing resourceDirectory <https://builds.apache.org/job/UIMA-Ruta%20Java%2011/ws/trunk/ruta-maven-plugin/src/main/readme_bin>
[INFO] 
[INFO] --- maven-jar-plugin:3.1.0:jar (default-jar) @ ruta-maven-plugin ---
[INFO] Building jar: <https://builds.apache.org/job/UIMA-Ruta%20Java%2011/ws/trunk/ruta-maven-plugin/target/ruta-maven-plugin-2.7.1-SNAPSHOT.jar>
[INFO] 
[INFO] --- maven-plugin-plugin:3.5.2:addPluginArtifactMetadata (default-addPluginArtifactMetadata)
@ ruta-maven-plugin ---
[INFO] 
[INFO] --- maven-site-plugin:3.7.1:attach-descriptor (attach-descriptor) @ ruta-maven-plugin
---
[INFO] Skipping because packaging 'maven-plugin' is not pom.
[INFO] 
[INFO] --- maven-invoker-plugin:2.0.0:install (integration-test) @ ruta-maven-plugin ---
[INFO] Downloading: https://repo.maven.apache.org/maven2/org/apache/maven/shared/maven-invoker/2.2/maven-invoker-2.2.pom
[INFO] Downloaded: https://repo.maven.apache.org/maven2/org/apache/maven/shared/maven-invoker/2.2/maven-invoker-2.2.pom
(6 KB at 381.1 KB/sec)
[INFO] Downloading: https://repo.maven.apache.org/maven2/org/apache/maven/reporting/maven-reporting-impl/2.2/maven-reporting-impl-2.2.pom
[INFO] Downloaded: https://repo.maven.apache.org/maven2/org/apache/maven/reporting/maven-reporting-impl/2.2/maven-reporting-impl-2.2.pom
(5 KB at 355.4 KB/sec)
[INFO] Downloading: https://repo.maven.apache.org/maven2/org/apache/maven/shared/maven-script-interpreter/1.1/maven-script-interpreter-1.1.pom
[INFO] Downloaded: https://repo.maven.apache.org/maven2/org/apache/maven/shared/maven-script-interpreter/1.1/maven-script-interpreter-1.1.pom
(4 KB at 241.6 KB/sec)
[INFO] Downloading: https://repo.maven.apache.org/maven2/org/codehaus/groovy/groovy/2.0.1/groovy-2.0.1.pom
[INFO] Downloaded: https://repo.maven.apache.org/maven2/org/codehaus/groovy/groovy/2.0.1/groovy-2.0.1.pom
(16 KB at 1116.2 KB/sec)
[INFO] Downloading: https://repo.maven.apache.org/maven2/antlr/antlr/2.7.7/antlr-2.7.7.pom
[INFO] Downloaded: https://repo.maven.apache.org/maven2/antlr/antlr/2.7.7/antlr-2.7.7.pom
(632 B at 44.1 KB/sec)
[INFO] Downloading: https://repo.maven.apache.org/maven2/org/ow2/asm/asm-tree/4.0/asm-tree-4.0.pom
[INFO] Downloaded: https://repo.maven.apache.org/maven2/org/ow2/asm/asm-tree/4.0/asm-tree-4.0.pom
(3 KB at 135.5 KB/sec)
[INFO] Downloading: https://repo.maven.apache.org/maven2/org/ow2/asm/asm-parent/4.0/asm-parent-4.0.pom
[INFO] Downloaded: https://repo.maven.apache.org/maven2/org/ow2/asm/asm-parent/4.0/asm-parent-4.0.pom
(6 KB at 383.2 KB/sec)
[INFO] Downloading: https://repo.maven.apache.org/maven2/org/ow2/ow2/1.3/ow2-1.3.pom
[INFO] Downloaded: https://repo.maven.apache.org/maven2/org/ow2/ow2/1.3/ow2-1.3.pom (10 KB
at 663.3 KB/sec)
[INFO] Downloading: https://repo.maven.apache.org/maven2/org/ow2/asm/asm/4.0/asm-4.0.pom
[INFO] Downloaded: https://repo.maven.apache.org/maven2/org/ow2/asm/asm/4.0/asm-4.0.pom (2
KB at 134.8 KB/sec)
[INFO] Downloading: https://repo.maven.apache.org/maven2/org/ow2/asm/asm-commons/4.0/asm-commons-4.0.pom
[INFO] Downloaded: https://repo.maven.apache.org/maven2/org/ow2/asm/asm-commons/4.0/asm-commons-4.0.pom
(3 KB at 136.2 KB/sec)
[INFO] Downloading: https://repo.maven.apache.org/maven2/org/ow2/asm/asm-util/4.0/asm-util-4.0.pom
[INFO] Downloaded: https://repo.maven.apache.org/maven2/org/ow2/asm/asm-util/4.0/asm-util-4.0.pom
(3 KB at 145.5 KB/sec)
[INFO] Downloading: https://repo.maven.apache.org/maven2/org/ow2/asm/asm-analysis/4.0/asm-analysis-4.0.pom
[INFO] Downloaded: https://repo.maven.apache.org/maven2/org/ow2/asm/asm-analysis/4.0/asm-analysis-4.0.pom
(3 KB at 146.1 KB/sec)
[INFO] Downloading: https://repo.maven.apache.org/maven2/org/apache/ant/ant/1.8.1/ant-1.8.1.pom
[INFO] Downloaded: https://repo.maven.apache.org/maven2/org/apache/ant/ant/1.8.1/ant-1.8.1.pom
(9 KB at 613.8 KB/sec)
[INFO] Downloading: https://repo.maven.apache.org/maven2/org/apache/ant/ant-parent/1.8.1/ant-parent-1.8.1.pom
[INFO] Downloaded: https://repo.maven.apache.org/maven2/org/apache/ant/ant-parent/1.8.1/ant-parent-1.8.1.pom
(5 KB at 298.6 KB/sec)
[INFO] Downloading: https://repo.maven.apache.org/maven2/org/apache/maven/doxia/doxia-site-renderer/1.1.4/doxia-site-renderer-1.1.4.pom
[INFO] Downloaded: https://repo.maven.apache.org/maven2/org/apache/maven/doxia/doxia-site-renderer/1.1.4/doxia-site-renderer-1.1.4.pom
(6 KB at 426.9 KB/sec)
[INFO] Downloading: https://repo.maven.apache.org/maven2/org/apache/maven/doxia/doxia-sitetools/1.1.4/doxia-sitetools-1.1.4.pom
[INFO] Downloaded: https://repo.maven.apache.org/maven2/org/apache/maven/doxia/doxia-sitetools/1.1.4/doxia-sitetools-1.1.4.pom
(16 KB at 977.8 KB/sec)
[INFO] Downloading: https://repo.maven.apache.org/maven2/org/apache/maven/doxia/doxia-core/1.1.4/doxia-core-1.1.4.pom
[INFO] Downloaded: https://repo.maven.apache.org/maven2/org/apache/maven/doxia/doxia-core/1.1.4/doxia-core-1.1.4.pom
(4 KB at 242.3 KB/sec)
[INFO] Downloading: https://repo.maven.apache.org/maven2/org/apache/maven/doxia/doxia/1.1.4/doxia-1.1.4.pom
[INFO] Downloaded: https://repo.maven.apache.org/maven2/org/apache/maven/doxia/doxia/1.1.4/doxia-1.1.4.pom
(19 KB at 1152.0 KB/sec)
[INFO] Downloading: https://repo.maven.apache.org/maven2/org/apache/maven/doxia/doxia-sink-api/1.1.4/doxia-sink-api-1.1.4.pom
[INFO] Downloaded: https://repo.maven.apache.org/maven2/org/apache/maven/doxia/doxia-sink-api/1.1.4/doxia-sink-api-1.1.4.pom
(2 KB at 102.5 KB/sec)
[INFO] Downloading: https://repo.maven.apache.org/maven2/org/apache/maven/doxia/doxia-logging-api/1.1.4/doxia-logging-api-1.1.4.pom
[INFO] Downloaded: https://repo.maven.apache.org/maven2/org/apache/maven/doxia/doxia-logging-api/1.1.4/doxia-logging-api-1.1.4.pom
(2 KB at 110.2 KB/sec)
[INFO] Downloading: https://repo.maven.apache.org/maven2/org/codehaus/plexus/plexus-utils/1.5.12/plexus-utils-1.5.12.pom
[INFO] Downloaded: https://repo.maven.apache.org/maven2/org/codehaus/plexus/plexus-utils/1.5.12/plexus-utils-1.5.12.pom
(6 KB at 423.2 KB/sec)
[INFO] Downloading: https://repo.maven.apache.org/maven2/org/apache/maven/doxia/doxia-decoration-model/1.1.4/doxia-decoration-model-1.1.4.pom
[INFO] Downloaded: https://repo.maven.apache.org/maven2/org/apache/maven/doxia/doxia-decoration-model/1.1.4/doxia-decoration-model-1.1.4.pom
(3 KB at 193.7 KB/sec)
[INFO] Downloading: https://repo.maven.apache.org/maven2/org/apache/maven/doxia/doxia-module-xhtml/1.1.4/doxia-module-xhtml-1.1.4.pom
[INFO] Downloaded: https://repo.maven.apache.org/maven2/org/apache/maven/doxia/doxia-module-xhtml/1.1.4/doxia-module-xhtml-1.1.4.pom
(2 KB at 104.3 KB/sec)
[INFO] Downloading: https://repo.maven.apache.org/maven2/org/apache/maven/doxia/doxia-modules/1.1.4/doxia-modules-1.1.4.pom
[INFO] Downloaded: https://repo.maven.apache.org/maven2/org/apache/maven/doxia/doxia-modules/1.1.4/doxia-modules-1.1.4.pom
(3 KB at 158.7 KB/sec)
[INFO] Downloading: https://repo.maven.apache.org/maven2/org/apache/maven/doxia/doxia-module-fml/1.1.4/doxia-module-fml-1.1.4.pom
[INFO] Downloaded: https://repo.maven.apache.org/maven2/org/apache/maven/doxia/doxia-module-fml/1.1.4/doxia-module-fml-1.1.4.pom
(6 KB at 382.5 KB/sec)
[INFO] Downloading: https://repo.maven.apache.org/maven2/org/codehaus/groovy/groovy-all/2.0.1/groovy-all-2.0.1.pom
[INFO] Downloaded: https://repo.maven.apache.org/maven2/org/codehaus/groovy/groovy-all/2.0.1/groovy-all-2.0.1.pom
(18 KB at 1157.9 KB/sec)
[INFO] Downloading: https://repo.maven.apache.org/maven2/org/codehaus/plexus/plexus-utils/3.0.21/plexus-utils-3.0.21.pom
[INFO] Downloaded: https://repo.maven.apache.org/maven2/org/codehaus/plexus/plexus-utils/3.0.21/plexus-utils-3.0.21.pom
(4 KB at 286.2 KB/sec)
[INFO] Downloading: https://repo.maven.apache.org/maven2/org/apache/maven/shared/maven-invoker/2.2/maven-invoker-2.2.jar
[INFO] Downloading: https://repo.maven.apache.org/maven2/org/apache/maven/reporting/maven-reporting-impl/2.2/maven-reporting-impl-2.2.jar
[INFO] Downloading: https://repo.maven.apache.org/maven2/org/apache/maven/shared/maven-script-interpreter/1.1/maven-script-interpreter-1.1.jar
[INFO] Downloading: https://repo.maven.apache.org/maven2/org/codehaus/groovy/groovy/2.0.1/groovy-2.0.1.jar
[INFO] Downloading: https://repo.maven.apache.org/maven2/antlr/antlr/2.7.7/antlr-2.7.7.jar
[INFO] Downloaded: https://repo.maven.apache.org/maven2/org/apache/maven/reporting/maven-reporting-impl/2.2/maven-reporting-impl-2.2.jar
(17 KB at 914.8 KB/sec)
[INFO] Downloading: https://repo.maven.apache.org/maven2/org/ow2/asm/asm-tree/4.0/asm-tree-4.0.jar
[INFO] Downloaded: https://repo.maven.apache.org/maven2/org/apache/maven/shared/maven-script-interpreter/1.1/maven-script-interpreter-1.1.jar
(21 KB at 1209.9 KB/sec)
[INFO] Downloading: https://repo.maven.apache.org/maven2/org/ow2/asm/asm-commons/4.0/asm-commons-4.0.jar
[INFO] Downloaded: https://repo.maven.apache.org/maven2/org/apache/maven/shared/maven-invoker/2.2/maven-invoker-2.2.jar
(30 KB at 1553.6 KB/sec)
[INFO] Downloading: https://repo.maven.apache.org/maven2/org/ow2/asm/asm/4.0/asm-4.0.jar
[INFO] Downloaded: https://repo.maven.apache.org/maven2/org/ow2/asm/asm-tree/4.0/asm-tree-4.0.jar
(22 KB at 715.6 KB/sec)
[INFO] Downloading: https://repo.maven.apache.org/maven2/org/ow2/asm/asm-util/4.0/asm-util-4.0.jar
[INFO] Downloaded: https://repo.maven.apache.org/maven2/org/ow2/asm/asm/4.0/asm-4.0.jar (45
KB at 1404.5 KB/sec)
[INFO] Downloaded: https://repo.maven.apache.org/maven2/org/ow2/asm/asm-commons/4.0/asm-commons-4.0.jar
(37 KB at 1152.8 KB/sec)
[INFO] Downloading: https://repo.maven.apache.org/maven2/org/ow2/asm/asm-analysis/4.0/asm-analysis-4.0.jar
[INFO] Downloading: https://repo.maven.apache.org/maven2/org/apache/maven/doxia/doxia-site-renderer/1.1.4/doxia-site-renderer-1.1.4.jar
[INFO] Downloaded: https://repo.maven.apache.org/maven2/antlr/antlr/2.7.7/antlr-2.7.7.jar
(435 KB at 11443.5 KB/sec)
[INFO] Downloading: https://repo.maven.apache.org/maven2/org/apache/maven/doxia/doxia-decoration-model/1.1.4/doxia-decoration-model-1.1.4.jar
[INFO] Downloaded: https://repo.maven.apache.org/maven2/org/ow2/asm/asm-analysis/4.0/asm-analysis-4.0.jar
(20 KB at 416.4 KB/sec)
[INFO] Downloading: https://repo.maven.apache.org/maven2/org/apache/maven/doxia/doxia-module-xhtml/1.1.4/doxia-module-xhtml-1.1.4.jar
[INFO] Downloaded: https://repo.maven.apache.org/maven2/org/apache/maven/doxia/doxia-site-renderer/1.1.4/doxia-site-renderer-1.1.4.jar
(50 KB at 1012.0 KB/sec)
[INFO] Downloading: https://repo.maven.apache.org/maven2/org/apache/maven/doxia/doxia-module-fml/1.1.4/doxia-module-fml-1.1.4.jar
[INFO] Downloaded: https://repo.maven.apache.org/maven2/org/ow2/asm/asm-util/4.0/asm-util-4.0.jar
(37 KB at 708.4 KB/sec)
[INFO] Downloading: https://repo.maven.apache.org/maven2/org/codehaus/groovy/groovy-all/2.0.1/groovy-all-2.0.1.jar
[INFO] Downloaded: https://repo.maven.apache.org/maven2/org/apache/maven/doxia/doxia-decoration-model/1.1.4/doxia-decoration-model-1.1.4.jar
(52 KB at 964.1 KB/sec)
[INFO] Downloading: https://repo.maven.apache.org/maven2/org/apache/ant/ant/1.8.1/ant-1.8.1.jar
[INFO] Downloaded: https://repo.maven.apache.org/maven2/org/apache/maven/doxia/doxia-module-xhtml/1.1.4/doxia-module-xhtml-1.1.4.jar
(15 KB at 236.7 KB/sec)
[INFO] Downloading: https://repo.maven.apache.org/maven2/org/codehaus/plexus/plexus-utils/3.0.21/plexus-utils-3.0.21.jar
[INFO] Downloaded: https://repo.maven.apache.org/maven2/org/apache/maven/doxia/doxia-module-fml/1.1.4/doxia-module-fml-1.1.4.jar
(37 KB at 537.3 KB/sec)
[INFO] Downloading: https://repo.maven.apache.org/maven2/commons-io/commons-io/2.2/commons-io-2.2.jar
[INFO] Downloaded: https://repo.maven.apache.org/maven2/org/codehaus/plexus/plexus-utils/3.0.21/plexus-utils-3.0.21.jar
(240 KB at 2747.5 KB/sec)
[INFO] Downloaded: https://repo.maven.apache.org/maven2/commons-io/commons-io/2.2/commons-io-2.2.jar
(170 KB at 1842.6 KB/sec)
[INFO] Downloaded: https://repo.maven.apache.org/maven2/org/apache/ant/ant/1.8.1/ant-1.8.1.jar
(1479 KB at 11925.6 KB/sec)
[INFO] Downloaded: https://repo.maven.apache.org/maven2/org/codehaus/groovy/groovy/2.0.1/groovy-2.0.1.jar
(3194 KB at 17172.0 KB/sec)
[INFO] Downloaded: https://repo.maven.apache.org/maven2/org/codehaus/groovy/groovy-all/2.0.1/groovy-all-2.0.1.jar
(6047 KB at 27238.0 KB/sec)
[INFO] Installing <https://builds.apache.org/job/UIMA-Ruta%20Java%2011/ws/trunk/ruta-parent/pom.xml>
to <https://builds.apache.org/job/UIMA-Ruta%20Java%2011/ws/trunk/ruta-maven-plugin/target/local-repo/org/apache/uima/ruta-parent/2.7.1-SNAPSHOT/ruta-parent-2.7.1-SNAPSHOT.pom>
[INFO] Installing <https://builds.apache.org/job/UIMA-Ruta%20Java%2011/ws/trunk/ruta-basic-type/pom.xml>
to <https://builds.apache.org/job/UIMA-Ruta%20Java%2011/ws/trunk/ruta-maven-plugin/target/local-repo/org/apache/uima/ruta-basic-type/2.7.1-SNAPSHOT/ruta-basic-type-2.7.1-SNAPSHOT.pom>
[INFO] Installing <https://builds.apache.org/job/UIMA-Ruta%20Java%2011/ws/trunk/ruta-basic-type/target/ruta-basic-type-2.7.1-SNAPSHOT.jar>
to <https://builds.apache.org/job/UIMA-Ruta%20Java%2011/ws/trunk/ruta-maven-plugin/target/local-repo/org/apache/uima/ruta-basic-type/2.7.1-SNAPSHOT/ruta-basic-type-2.7.1-SNAPSHOT.jar>
[INFO] Installing <https://builds.apache.org/job/UIMA-Ruta%20Java%2011/ws/trunk/ruta-basic-type/pom.xml>
to <https://builds.apache.org/job/UIMA-Ruta%20Java%2011/ws/trunk/ruta-maven-plugin/target/local-repo/org/apache/uima/ruta-basic-type/2.7.1-SNAPSHOT/ruta-basic-type-2.7.1-SNAPSHOT.pom>
[INFO] Installing <https://builds.apache.org/job/UIMA-Ruta%20Java%2011/ws/trunk/ruta-typesystem/pom.xml>
to <https://builds.apache.org/job/UIMA-Ruta%20Java%2011/ws/trunk/ruta-maven-plugin/target/local-repo/org/apache/uima/ruta-typesystem/2.7.1-SNAPSHOT/ruta-typesystem-2.7.1-SNAPSHOT.pom>
[INFO] Installing <https://builds.apache.org/job/UIMA-Ruta%20Java%2011/ws/trunk/ruta-typesystem/target/ruta-typesystem-2.7.1-SNAPSHOT.jar>
to <https://builds.apache.org/job/UIMA-Ruta%20Java%2011/ws/trunk/ruta-maven-plugin/target/local-repo/org/apache/uima/ruta-typesystem/2.7.1-SNAPSHOT/ruta-typesystem-2.7.1-SNAPSHOT.jar>
[INFO] Installing <https://builds.apache.org/job/UIMA-Ruta%20Java%2011/ws/trunk/ruta-typesystem/pom.xml>
to <https://builds.apache.org/job/UIMA-Ruta%20Java%2011/ws/trunk/ruta-maven-plugin/target/local-repo/org/apache/uima/ruta-typesystem/2.7.1-SNAPSHOT/ruta-typesystem-2.7.1-SNAPSHOT.pom>
[INFO] Installing <https://builds.apache.org/job/UIMA-Ruta%20Java%2011/ws/trunk/ruta-core/pom.xml>
to <https://builds.apache.org/job/UIMA-Ruta%20Java%2011/ws/trunk/ruta-maven-plugin/target/local-repo/org/apache/uima/ruta-core/2.7.1-SNAPSHOT/ruta-core-2.7.1-SNAPSHOT.pom>
[INFO] Installing <https://builds.apache.org/job/UIMA-Ruta%20Java%2011/ws/trunk/ruta-core/target/ruta-core-2.7.1-SNAPSHOT.jar>
to <https://builds.apache.org/job/UIMA-Ruta%20Java%2011/ws/trunk/ruta-maven-plugin/target/local-repo/org/apache/uima/ruta-core/2.7.1-SNAPSHOT/ruta-core-2.7.1-SNAPSHOT.jar>
[INFO] Installing <https://builds.apache.org/job/UIMA-Ruta%20Java%2011/ws/trunk/ruta-core/pom.xml>
to <https://builds.apache.org/job/UIMA-Ruta%20Java%2011/ws/trunk/ruta-maven-plugin/target/local-repo/org/apache/uima/ruta-core/2.7.1-SNAPSHOT/ruta-core-2.7.1-SNAPSHOT.pom>
[INFO] Installing <https://builds.apache.org/job/UIMA-Ruta%20Java%2011/ws/trunk/ruta-core-ext/pom.xml>
to <https://builds.apache.org/job/UIMA-Ruta%20Java%2011/ws/trunk/ruta-maven-plugin/target/local-repo/org/apache/uima/ruta-core-ext/2.7.1-SNAPSHOT/ruta-core-ext-2.7.1-SNAPSHOT.pom>
[INFO] Installing <https://builds.apache.org/job/UIMA-Ruta%20Java%2011/ws/trunk/ruta-core-ext/target/ruta-core-ext-2.7.1-SNAPSHOT.jar>
to <https://builds.apache.org/job/UIMA-Ruta%20Java%2011/ws/trunk/ruta-maven-plugin/target/local-repo/org/apache/uima/ruta-core-ext/2.7.1-SNAPSHOT/ruta-core-ext-2.7.1-SNAPSHOT.jar>
[INFO] Installing <https://builds.apache.org/job/UIMA-Ruta%20Java%2011/ws/trunk/ruta-core-ext/pom.xml>
to <https://builds.apache.org/job/UIMA-Ruta%20Java%2011/ws/trunk/ruta-maven-plugin/target/local-repo/org/apache/uima/ruta-core-ext/2.7.1-SNAPSHOT/ruta-core-ext-2.7.1-SNAPSHOT.pom>
[INFO] Installing <https://builds.apache.org/job/UIMA-Ruta%20Java%2011/ws/trunk/ruta-ep-parent/pom.xml>
to <https://builds.apache.org/job/UIMA-Ruta%20Java%2011/ws/trunk/ruta-maven-plugin/target/local-repo/org/apache/uima/ruta-ep-parent/2.7.1-SNAPSHOT/ruta-ep-parent-2.7.1-SNAPSHOT.pom>
[INFO] Installing <https://builds.apache.org/job/UIMA-Ruta%20Java%2011/ws/trunk/ruta-ep-engine/pom.xml>
to <https://builds.apache.org/job/UIMA-Ruta%20Java%2011/ws/trunk/ruta-maven-plugin/target/local-repo/org/apache/uima/ruta-ep-engine/2.7.1-SNAPSHOT/ruta-ep-engine-2.7.1-SNAPSHOT.pom>
[INFO] Installing <https://builds.apache.org/job/UIMA-Ruta%20Java%2011/ws/trunk/ruta-ep-engine/target/org.apache.uima.ruta.engine_2.7.1.SNAPSHOT.jar>
to <https://builds.apache.org/job/UIMA-Ruta%20Java%2011/ws/trunk/ruta-maven-plugin/target/local-repo/org/apache/uima/ruta-ep-engine/2.7.1-SNAPSHOT/ruta-ep-engine-2.7.1-SNAPSHOT.jar>
[INFO] Installing <https://builds.apache.org/job/UIMA-Ruta%20Java%2011/ws/trunk/ruta-ep-engine/pom.xml>
to <https://builds.apache.org/job/UIMA-Ruta%20Java%2011/ws/trunk/ruta-maven-plugin/target/local-repo/org/apache/uima/ruta-ep-engine/2.7.1-SNAPSHOT/ruta-ep-engine-2.7.1-SNAPSHOT.pom>
[INFO] Installing <https://builds.apache.org/job/UIMA-Ruta%20Java%2011/ws/trunk/ruta-ep-ide/pom.xml>
to <https://builds.apache.org/job/UIMA-Ruta%20Java%2011/ws/trunk/ruta-maven-plugin/target/local-repo/org/apache/uima/ruta-ep-ide/2.7.1-SNAPSHOT/ruta-ep-ide-2.7.1-SNAPSHOT.pom>
[INFO] Installing <https://builds.apache.org/job/UIMA-Ruta%20Java%2011/ws/trunk/ruta-ep-ide/target/org.apache.uima.ruta.ide_2.7.1.SNAPSHOT.jar>
to <https://builds.apache.org/job/UIMA-Ruta%20Java%2011/ws/trunk/ruta-maven-plugin/target/local-repo/org/apache/uima/ruta-ep-ide/2.7.1-SNAPSHOT/ruta-ep-ide-2.7.1-SNAPSHOT.jar>
[INFO] Installing <https://builds.apache.org/job/UIMA-Ruta%20Java%2011/ws/trunk/ruta-ep-ide/pom.xml>
to <https://builds.apache.org/job/UIMA-Ruta%20Java%2011/ws/trunk/ruta-maven-plugin/target/local-repo/org/apache/uima/ruta-ep-ide/2.7.1-SNAPSHOT/ruta-ep-ide-2.7.1-SNAPSHOT.pom>
[INFO] Installing <https://builds.apache.org/job/UIMA-Ruta%20Java%2011/ws/trunk/ruta-ep-ide-ui/pom.xml>
to <https://builds.apache.org/job/UIMA-Ruta%20Java%2011/ws/trunk/ruta-maven-plugin/target/local-repo/org/apache/uima/ruta-ep-ide-ui/2.7.1-SNAPSHOT/ruta-ep-ide-ui-2.7.1-SNAPSHOT.pom>
[INFO] Installing <https://builds.apache.org/job/UIMA-Ruta%20Java%2011/ws/trunk/ruta-ep-ide-ui/target/org.apache.uima.ruta.ide.ui_2.7.1.SNAPSHOT.jar>
to <https://builds.apache.org/job/UIMA-Ruta%20Java%2011/ws/trunk/ruta-maven-plugin/target/local-repo/org/apache/uima/ruta-ep-ide-ui/2.7.1-SNAPSHOT/ruta-ep-ide-ui-2.7.1-SNAPSHOT.jar>
[INFO] Installing <https://builds.apache.org/job/UIMA-Ruta%20Java%2011/ws/trunk/ruta-ep-ide-ui/pom.xml>
to <https://builds.apache.org/job/UIMA-Ruta%20Java%2011/ws/trunk/ruta-maven-plugin/target/local-repo/org/apache/uima/ruta-ep-ide-ui/2.7.1-SNAPSHOT/ruta-ep-ide-ui-2.7.1-SNAPSHOT.pom>
[INFO] Installing <https://builds.apache.org/job/UIMA-Ruta%20Java%2011/ws/trunk/ruta-ep-caseditor/pom.xml>
to <https://builds.apache.org/job/UIMA-Ruta%20Java%2011/ws/trunk/ruta-maven-plugin/target/local-repo/org/apache/uima/ruta-ep-caseditor/2.7.1-SNAPSHOT/ruta-ep-caseditor-2.7.1-SNAPSHOT.pom>
[INFO] Installing <https://builds.apache.org/job/UIMA-Ruta%20Java%2011/ws/trunk/ruta-ep-caseditor/target/org.apache.uima.ruta.caseditor_2.7.1.SNAPSHOT.jar>
to <https://builds.apache.org/job/UIMA-Ruta%20Java%2011/ws/trunk/ruta-maven-plugin/target/local-repo/org/apache/uima/ruta-ep-caseditor/2.7.1-SNAPSHOT/ruta-ep-caseditor-2.7.1-SNAPSHOT.jar>
[INFO] Installing <https://builds.apache.org/job/UIMA-Ruta%20Java%2011/ws/trunk/ruta-ep-caseditor/pom.xml>
to <https://builds.apache.org/job/UIMA-Ruta%20Java%2011/ws/trunk/ruta-maven-plugin/target/local-repo/org/apache/uima/ruta-ep-caseditor/2.7.1-SNAPSHOT/ruta-ep-caseditor-2.7.1-SNAPSHOT.pom>
[INFO] Installing <https://builds.apache.org/job/UIMA-Ruta%20Java%2011/ws/trunk/ruta-ep-addons/pom.xml>
to <https://builds.apache.org/job/UIMA-Ruta%20Java%2011/ws/trunk/ruta-maven-plugin/target/local-repo/org/apache/uima/ruta-ep-addons/2.7.1-SNAPSHOT/ruta-ep-addons-2.7.1-SNAPSHOT.pom>
[INFO] Installing <https://builds.apache.org/job/UIMA-Ruta%20Java%2011/ws/trunk/ruta-ep-addons/target/org.apache.uima.ruta.addons_2.7.1.SNAPSHOT.jar>
to <https://builds.apache.org/job/UIMA-Ruta%20Java%2011/ws/trunk/ruta-maven-plugin/target/local-repo/org/apache/uima/ruta-ep-addons/2.7.1-SNAPSHOT/ruta-ep-addons-2.7.1-SNAPSHOT.jar>
[INFO] Installing <https://builds.apache.org/job/UIMA-Ruta%20Java%2011/ws/trunk/ruta-ep-addons/pom.xml>
to <https://builds.apache.org/job/UIMA-Ruta%20Java%2011/ws/trunk/ruta-maven-plugin/target/local-repo/org/apache/uima/ruta-ep-addons/2.7.1-SNAPSHOT/ruta-ep-addons-2.7.1-SNAPSHOT.pom>
[INFO] Installing <https://builds.apache.org/job/UIMA-Ruta%20Java%2011/ws/trunk/ruta-ep-textruler/pom.xml>
to <https://builds.apache.org/job/UIMA-Ruta%20Java%2011/ws/trunk/ruta-maven-plugin/target/local-repo/org/apache/uima/ruta-ep-textruler/2.7.1-SNAPSHOT/ruta-ep-textruler-2.7.1-SNAPSHOT.pom>
[INFO] Installing <https://builds.apache.org/job/UIMA-Ruta%20Java%2011/ws/trunk/ruta-ep-textruler/target/org.apache.uima.ruta.textruler_2.7.1.SNAPSHOT.jar>
to <https://builds.apache.org/job/UIMA-Ruta%20Java%2011/ws/trunk/ruta-maven-plugin/target/local-repo/org/apache/uima/ruta-ep-textruler/2.7.1-SNAPSHOT/ruta-ep-textruler-2.7.1-SNAPSHOT.jar>
[INFO] Installing <https://builds.apache.org/job/UIMA-Ruta%20Java%2011/ws/trunk/ruta-ep-textruler/pom.xml>
to <https://builds.apache.org/job/UIMA-Ruta%20Java%2011/ws/trunk/ruta-maven-plugin/target/local-repo/org/apache/uima/ruta-ep-textruler/2.7.1-SNAPSHOT/ruta-ep-textruler-2.7.1-SNAPSHOT.pom>
[INFO] Installing <https://builds.apache.org/job/UIMA-Ruta%20Java%2011/ws/trunk/ruta-ep-core-ext/pom.xml>
to <https://builds.apache.org/job/UIMA-Ruta%20Java%2011/ws/trunk/ruta-maven-plugin/target/local-repo/org/apache/uima/ruta-ep-core-ext/2.7.1-SNAPSHOT/ruta-ep-core-ext-2.7.1-SNAPSHOT.pom>
[INFO] Installing <https://builds.apache.org/job/UIMA-Ruta%20Java%2011/ws/trunk/ruta-ep-core-ext/target/org.apache.uima.ruta.core.ext_2.7.1.SNAPSHOT.jar>
to <https://builds.apache.org/job/UIMA-Ruta%20Java%2011/ws/trunk/ruta-maven-plugin/target/local-repo/org/apache/uima/ruta-ep-core-ext/2.7.1-SNAPSHOT/ruta-ep-core-ext-2.7.1-SNAPSHOT.jar>
[INFO] Installing <https://builds.apache.org/job/UIMA-Ruta%20Java%2011/ws/trunk/ruta-ep-core-ext/pom.xml>
to <https://builds.apache.org/job/UIMA-Ruta%20Java%2011/ws/trunk/ruta-maven-plugin/target/local-repo/org/apache/uima/ruta-ep-core-ext/2.7.1-SNAPSHOT/ruta-ep-core-ext-2.7.1-SNAPSHOT.pom>
[INFO] Installing <https://builds.apache.org/job/UIMA-Ruta%20Java%2011/ws/trunk/ruta-maven-plugin/pom.xml>
to <https://builds.apache.org/job/UIMA-Ruta%20Java%2011/ws/trunk/ruta-maven-plugin/target/local-repo/org/apache/uima/ruta-maven-plugin/2.7.1-SNAPSHOT/ruta-maven-plugin-2.7.1-SNAPSHOT.pom>
[INFO] Installing <https://builds.apache.org/job/UIMA-Ruta%20Java%2011/ws/trunk/ruta-maven-plugin/target/ruta-maven-plugin-2.7.1-SNAPSHOT.jar>
to <https://builds.apache.org/job/UIMA-Ruta%20Java%2011/ws/trunk/ruta-maven-plugin/target/local-repo/org/apache/uima/ruta-maven-plugin/2.7.1-SNAPSHOT/ruta-maven-plugin-2.7.1-SNAPSHOT.jar>
[INFO] 
[INFO] --- maven-invoker-plugin:2.0.0:run (integration-test) @ ruta-maven-plugin ---
[INFO] Building: multimodule/pom.xml
[INFO] ..FAILED (9.9 s)
[INFO]   The build exited with code 1. See <https://builds.apache.org/job/UIMA-Ruta%20Java%2011/ws/trunk/ruta-maven-plugin/target/it/multimodule/build.log>
for details.
[INFO] Building: conflictingShortName/pom.xml
[INFO] ..SUCCESS (17.3 s)
[INFO] Building: wordlists/pom.xml
[INFO] ..SUCCESS (14.9 s)
[INFO] Building: importByName/pom.xml
[INFO] ..SUCCESS (15.3 s)
[INFO] -------------------------------------------------
[INFO] Build Summary:
[INFO]   Passed: 3, Failed: 1, Errors: 0, Skipped: 0
[INFO] -------------------------------------------------
[ERROR] The following builds failed:
[ERROR] *  multimodule/pom.xml
[INFO] -------------------------------------------------
[INFO] ------------------------------------------------------------------------
[INFO] Reactor Summary:
[INFO] 
[INFO] Apache UIMA Ruta: ruta-parent ...................... SUCCESS [01:27 min]
[INFO] Apache UIMA Ruta: ruta-basic-type .................. SUCCESS [ 32.884 s]
[INFO] Apache UIMA Ruta: ruta-typesystem .................. SUCCESS [ 35.018 s]
[INFO] Apache UIMA Ruta: ruta-core ........................ SUCCESS [02:33 min]
[INFO] Apache UIMA Ruta: ruta-core-ext .................... SUCCESS [ 40.432 s]
[INFO] Apache UIMA Ruta: ruta-ep-parent ................... SUCCESS [08:45 min]
[INFO] Apache UIMA Ruta Eclipse: ruta-ep-engine ........... SUCCESS [ 35.739 s]
[INFO] Apache UIMA Ruta Eclipse: ruta-ep-ide .............. SUCCESS [06:07 min]
[INFO] Apache UIMA Ruta Eclipse: ruta-ep-ide-ui ........... SUCCESS [10:55 min]
[INFO] Apache UIMA Ruta Eclipse: ruta-ep-caseditor ........ SUCCESS [05:33 min]
[INFO] Apache UIMA Ruta Eclipse: ruta-ep-addons ........... SUCCESS [05:45 min]
[INFO] Apache UIMA Ruta Eclipse: ruta-ep-textruler ........ SUCCESS [05:59 min]
[INFO] Apache UIMA Ruta Eclipse: ruta-ep-core-ext ......... SUCCESS [04:27 min]
[INFO] Apache UIMA Maven: ruta-maven-plugin ............... FAILURE [01:29 min]
[INFO] Apache UIMA Maven: ruta-maven-archetype ............ SKIPPED
[INFO] Apache UIMA Ruta Documentation ..................... SKIPPED
[INFO] Apache UIMA Ruta Eclipse: ruta-eclipse-feature ..... SKIPPED
[INFO] Apache UIMA Ruta: ruta-ep-example-extensions ....... SKIPPED
[INFO] Apache UIMA Ruta: ruta-maven-example ............... SKIPPED
[INFO] Apache UIMA Ruta: ruta ............................. SKIPPED
[INFO] ------------------------------------------------------------------------
[INFO] BUILD FAILURE
[INFO] ------------------------------------------------------------------------
[INFO] Total time: 56:44 min
[INFO] Finished at: 2019-06-18T12:55:49+00:00
[INFO] Final Memory: 205M/717M
[INFO] ------------------------------------------------------------------------
Waiting for Jenkins to finish collecting data
[ERROR] Failed to execute goal org.apache.maven.plugins:maven-invoker-plugin:2.0.0:run (integration-test)
on project ruta-maven-plugin: 1 build failed. See console output above for details. ->
[Help 1]
[ERROR] 
[ERROR] To see the full stack trace of the errors, re-run Maven with the -e switch.
[ERROR] Re-run Maven using the -X switch to enable full debug logging.
[ERROR] 
[ERROR] For more information about the errors and possible solutions, please read the following
articles:
[ERROR] [Help 1] http://cwiki.apache.org/confluence/display/MAVEN/MojoFailureException
[ERROR] 
[ERROR] After correcting the problems, you can resume the build with the command
[ERROR]   mvn <goals> -rf :ruta-maven-plugin
[JENKINS] Archiving <https://builds.apache.org/job/UIMA-Ruta%20Java%2011/ws/trunk/ruta-ep-parent/pom.xml>
to org.apache.uima/ruta-ep-parent/2.7.1-SNAPSHOT/ruta-ep-parent-2.7.1-SNAPSHOT.pom
[JENKINS] Archiving <https://builds.apache.org/job/UIMA-Ruta%20Java%2011/ws/trunk/ruta-core-ext/pom.xml>
to org.apache.uima/ruta-core-ext/2.7.1-SNAPSHOT/ruta-core-ext-2.7.1-SNAPSHOT.pom
[JENKINS] Archiving <https://builds.apache.org/job/UIMA-Ruta%20Java%2011/ws/trunk/ruta-core-ext/target/ruta-core-ext-2.7.1-SNAPSHOT.jar>
to org.apache.uima/ruta-core-ext/2.7.1-SNAPSHOT/ruta-core-ext-2.7.1-SNAPSHOT.jar
[JENKINS] Archiving <https://builds.apache.org/job/UIMA-Ruta%20Java%2011/ws/trunk/ruta-ep-ide/pom.xml>
to org.apache.uima/ruta-ep-ide/2.7.1-SNAPSHOT/ruta-ep-ide-2.7.1-SNAPSHOT.pom
[JENKINS] Archiving <https://builds.apache.org/job/UIMA-Ruta%20Java%2011/ws/trunk/ruta-ep-ide/target/org.apache.uima.ruta.ide_2.7.1.SNAPSHOT.jar>
to org.apache.uima/ruta-ep-ide/2.7.1-SNAPSHOT/ruta-ep-ide-2.7.1-SNAPSHOT.jar
[Fast Archiver] Compressed 438.35 KB of artifacts by 29.2% relative to #8
[JENKINS] Archiving <https://builds.apache.org/job/UIMA-Ruta%20Java%2011/ws/trunk/ruta-ep-textruler/pom.xml>
to org.apache.uima/ruta-ep-textruler/2.7.1-SNAPSHOT/ruta-ep-textruler-2.7.1-SNAPSHOT.pom
[JENKINS] Archiving <https://builds.apache.org/job/UIMA-Ruta%20Java%2011/ws/trunk/ruta-ep-textruler/target/org.apache.uima.ruta.textruler_2.7.1.SNAPSHOT.jar>
to org.apache.uima/ruta-ep-textruler/2.7.1-SNAPSHOT/ruta-ep-textruler-2.7.1-SNAPSHOT.jar
[JENKINS] Archiving <https://builds.apache.org/job/UIMA-Ruta%20Java%2011/ws/trunk/ruta-ep-addons/pom.xml>
to org.apache.uima/ruta-ep-addons/2.7.1-SNAPSHOT/ruta-ep-addons-2.7.1-SNAPSHOT.pom
[JENKINS] Archiving <https://builds.apache.org/job/UIMA-Ruta%20Java%2011/ws/trunk/ruta-ep-addons/target/org.apache.uima.ruta.addons_2.7.1.SNAPSHOT.jar>
to org.apache.uima/ruta-ep-addons/2.7.1-SNAPSHOT/ruta-ep-addons-2.7.1-SNAPSHOT.jar
[JENKINS] Archiving <https://builds.apache.org/job/UIMA-Ruta%20Java%2011/ws/trunk/ruta-core/pom.xml>
to org.apache.uima/ruta-core/2.7.1-SNAPSHOT/ruta-core-2.7.1-SNAPSHOT.pom
[JENKINS] Archiving <https://builds.apache.org/job/UIMA-Ruta%20Java%2011/ws/trunk/ruta-core/target/ruta-core-2.7.1-SNAPSHOT.jar>
to org.apache.uima/ruta-core/2.7.1-SNAPSHOT/ruta-core-2.7.1-SNAPSHOT.jar
[Fast Archiver] Compressed 871.38 KB of artifacts by 14.7% relative to #8
[JENKINS] Archiving <https://builds.apache.org/job/UIMA-Ruta%20Java%2011/ws/trunk/ruta-eclipse-feature/pom.xml>
to org.apache.uima/ruta-eclipse-feature/2.7.1-SNAPSHOT/ruta-eclipse-feature-2.7.1-SNAPSHOT.pom
[Fast Archiver] No prior successful build to compare, so performing full copy of artifacts
[JENKINS] Archiving <https://builds.apache.org/job/UIMA-Ruta%20Java%2011/ws/trunk/example-projects/ruta-maven-example/pom.xml>
to org.apache.uima/ruta-maven-example/2.7.1-SNAPSHOT/ruta-maven-example-2.7.1-SNAPSHOT.pom
[Fast Archiver] No prior successful build to compare, so performing full copy of artifacts
[JENKINS] Archiving <https://builds.apache.org/job/UIMA-Ruta%20Java%2011/ws/trunk/ruta-ep-caseditor/pom.xml>
to org.apache.uima/ruta-ep-caseditor/2.7.1-SNAPSHOT/ruta-ep-caseditor-2.7.1-SNAPSHOT.pom
[JENKINS] Archiving <https://builds.apache.org/job/UIMA-Ruta%20Java%2011/ws/trunk/ruta-ep-caseditor/target/org.apache.uima.ruta.caseditor_2.7.1.SNAPSHOT.jar>
to org.apache.uima/ruta-ep-caseditor/2.7.1-SNAPSHOT/ruta-ep-caseditor-2.7.1-SNAPSHOT.jar
[JENKINS] Archiving <https://builds.apache.org/job/UIMA-Ruta%20Java%2011/ws/trunk/ruta-basic-type/pom.xml>
to org.apache.uima/ruta-basic-type/2.7.1-SNAPSHOT/ruta-basic-type-2.7.1-SNAPSHOT.pom
[JENKINS] Archiving <https://builds.apache.org/job/UIMA-Ruta%20Java%2011/ws/trunk/ruta-basic-type/target/ruta-basic-type-2.7.1-SNAPSHOT.jar>
to org.apache.uima/ruta-basic-type/2.7.1-SNAPSHOT/ruta-basic-type-2.7.1-SNAPSHOT.jar
[JENKINS] Archiving <https://builds.apache.org/job/UIMA-Ruta%20Java%2011/ws/trunk/ruta-ep-core-ext/pom.xml>
to org.apache.uima/ruta-ep-core-ext/2.7.1-SNAPSHOT/ruta-ep-core-ext-2.7.1-SNAPSHOT.pom
[JENKINS] Archiving <https://builds.apache.org/job/UIMA-Ruta%20Java%2011/ws/trunk/ruta-ep-core-ext/target/org.apache.uima.ruta.core.ext_2.7.1.SNAPSHOT.jar>
to org.apache.uima/ruta-ep-core-ext/2.7.1-SNAPSHOT/ruta-ep-core-ext-2.7.1-SNAPSHOT.jar
[JENKINS] Archiving <https://builds.apache.org/job/UIMA-Ruta%20Java%2011/ws/trunk/ruta-typesystem/pom.xml>
to org.apache.uima/ruta-typesystem/2.7.1-SNAPSHOT/ruta-typesystem-2.7.1-SNAPSHOT.pom
[JENKINS] Archiving <https://builds.apache.org/job/UIMA-Ruta%20Java%2011/ws/trunk/ruta-typesystem/target/ruta-typesystem-2.7.1-SNAPSHOT.jar>
to org.apache.uima/ruta-typesystem/2.7.1-SNAPSHOT/ruta-typesystem-2.7.1-SNAPSHOT.jar
[JENKINS] Archiving <https://builds.apache.org/job/UIMA-Ruta%20Java%2011/ws/trunk/ruta-maven-archetype/pom.xml>
to org.apache.uima/ruta-maven-archetype/2.7.1-SNAPSHOT/ruta-maven-archetype-2.7.1-SNAPSHOT.pom
[Fast Archiver] No prior successful build to compare, so performing full copy of artifacts
[JENKINS] Archiving <https://builds.apache.org/job/UIMA-Ruta%20Java%2011/ws/trunk/ruta-ep-engine/pom.xml>
to org.apache.uima/ruta-ep-engine/2.7.1-SNAPSHOT/ruta-ep-engine-2.7.1-SNAPSHOT.pom
[JENKINS] Archiving <https://builds.apache.org/job/UIMA-Ruta%20Java%2011/ws/trunk/ruta-ep-engine/target/org.apache.uima.ruta.engine_2.7.1.SNAPSHOT.jar>
to org.apache.uima/ruta-ep-engine/2.7.1-SNAPSHOT/ruta-ep-engine-2.7.1-SNAPSHOT.jar
[Fast Archiver] Compressed 7.31 MB of artifacts by 77.4% relative to #8
[JENKINS] Archiving <https://builds.apache.org/job/UIMA-Ruta%20Java%2011/ws/trunk/example-projects/ruta-ep-example-extensions/pom.xml>
to org.apache.uima/ruta-ep-example-extensions/2.7.1-SNAPSHOT/ruta-ep-example-extensions-2.7.1-SNAPSHOT.pom
[Fast Archiver] No prior successful build to compare, so performing full copy of artifacts
[JENKINS] Archiving <https://builds.apache.org/job/UIMA-Ruta%20Java%2011/ws/trunk/pom.xml>
to org.apache.uima/ruta/2.7.1-SNAPSHOT/ruta-2.7.1-SNAPSHOT.pom
[Fast Archiver] No prior successful build to compare, so performing full copy of artifacts
[JENKINS] Archiving <https://builds.apache.org/job/UIMA-Ruta%20Java%2011/ws/trunk/ruta-parent/pom.xml>
to org.apache.uima/ruta-parent/2.7.1-SNAPSHOT/ruta-parent-2.7.1-SNAPSHOT.pom
[JENKINS] Archiving <https://builds.apache.org/job/UIMA-Ruta%20Java%2011/ws/trunk/ruta-ep-ide-ui/pom.xml>
to org.apache.uima/ruta-ep-ide-ui/2.7.1-SNAPSHOT/ruta-ep-ide-ui-2.7.1-SNAPSHOT.pom
[JENKINS] Archiving <https://builds.apache.org/job/UIMA-Ruta%20Java%2011/ws/trunk/ruta-ep-ide-ui/target/org.apache.uima.ruta.ide.ui_2.7.1.SNAPSHOT.jar>
to org.apache.uima/ruta-ep-ide-ui/2.7.1-SNAPSHOT/ruta-ep-ide-ui-2.7.1-SNAPSHOT.jar
[JENKINS] Archiving <https://builds.apache.org/job/UIMA-Ruta%20Java%2011/ws/trunk/ruta-maven-plugin/pom.xml>
to org.apache.uima/ruta-maven-plugin/2.7.1-SNAPSHOT/ruta-maven-plugin-2.7.1-SNAPSHOT.pom
[JENKINS] Archiving <https://builds.apache.org/job/UIMA-Ruta%20Java%2011/ws/trunk/ruta-maven-plugin/target/ruta-maven-plugin-2.7.1-SNAPSHOT.jar>
to org.apache.uima/ruta-maven-plugin/2.7.1-SNAPSHOT/ruta-maven-plugin-2.7.1-SNAPSHOT.jar
[Fast Archiver] No prior successful build to compare, so performing full copy of artifacts
[JENKINS] Archiving <https://builds.apache.org/job/UIMA-Ruta%20Java%2011/ws/trunk/ruta-docbook/pom.xml>
to org.apache.uima/ruta-docbook/2.7.1-SNAPSHOT/ruta-docbook-2.7.1-SNAPSHOT.pom
[Fast Archiver] No prior successful build to compare, so performing full copy of artifacts
Sending e-mails to: dev@uima.apache.org
channel stopped
[WARNINGS] Skipping publisher since build result is FAILURE
[Cobertura] Publishing Cobertura coverage report...


Mime
View raw message