uima-dev mailing list archives

Site index · List index
Message view « Date » · « Thread »
Top « Date » · « Thread »
From Apache Jenkins Server <jenk...@builds.apache.org>
Subject Build failed in Jenkins: UIMA-DUCC #1615
Date Tue, 08 Oct 2019 19:52:58 GMT
See <https://builds.apache.org/job/UIMA-DUCC/1615/display/redirect?page=changes>

Changes:

[degenaro] UIMA-6014 DUCC site.ducc.properties should allow override of DUCC_HOME for WS display


------------------------------------------
[...truncated 425.42 KB...]
[INFO] Downloading: https://oss.sonatype.org/content/groups/jetty/org/eclipse/jetty/websocket/websocket-client/9.2.22.v20170606/websocket-client-9.2.22.v20170606.pom
[INFO] Downloading: http://repo1.maven.org/eclipse/org/eclipse/jetty/websocket/websocket-servlet/9.2.22.v20170606/websocket-servlet-9.2.22.v20170606.pom
[INFO] Downloading: http://repo1.maven.org/maven2/org/eclipse/jetty/websocket/websocket-servlet/9.2.22.v20170606/websocket-servlet-9.2.22.v20170606.pom
[INFO] Downloaded: http://repo1.maven.org/maven2/org/eclipse/jetty/websocket/websocket-servlet/9.2.22.v20170606/websocket-servlet-9.2.22.v20170606.pom
(3 KB at 157.1 KB/sec)
[INFO] Downloading: http://repo1.maven.org/eclipse/org/eclipse/jetty/jetty-servlet/9.2.22.v20170606/jetty-servlet-9.2.22.v20170606.pom
[INFO] Downloading: http://repo1.maven.org/maven2/org/eclipse/jetty/jetty-servlet/9.2.22.v20170606/jetty-servlet-9.2.22.v20170606.pom
[INFO] Downloaded: http://repo1.maven.org/maven2/org/eclipse/jetty/jetty-servlet/9.2.22.v20170606/jetty-servlet-9.2.22.v20170606.pom
(4 KB at 133.6 KB/sec)
[INFO] Downloading: http://repo1.maven.org/eclipse/org/eclipse/jetty/jetty-security/9.2.22.v20170606/jetty-security-9.2.22.v20170606.pom
[INFO] Downloading: http://repo1.maven.org/maven2/org/eclipse/jetty/jetty-security/9.2.22.v20170606/jetty-security-9.2.22.v20170606.pom
[INFO] Downloaded: http://repo1.maven.org/maven2/org/eclipse/jetty/jetty-security/9.2.22.v20170606/jetty-security-9.2.22.v20170606.pom
(3 KB at 150.7 KB/sec)
[INFO] Downloading: http://repo1.maven.org/eclipse/org/eclipse/jetty/jetty-http/9.2.22.v20170606/jetty-http-9.2.22.v20170606.pom
[INFO] Downloading: http://repo1.maven.org/maven2/org/eclipse/jetty/jetty-http/9.2.22.v20170606/jetty-http-9.2.22.v20170606.pom
[INFO] Downloaded: http://repo1.maven.org/maven2/org/eclipse/jetty/jetty-http/9.2.22.v20170606/jetty-http-9.2.22.v20170606.pom
(3 KB at 136.9 KB/sec)
[INFO] Downloading: http://repo1.maven.org/eclipse/org/eclipse/jetty/jetty-continuation/9.2.22.v20170606/jetty-continuation-9.2.22.v20170606.pom
[INFO] Downloading: http://repo1.maven.org/maven2/org/eclipse/jetty/jetty-continuation/9.2.22.v20170606/jetty-continuation-9.2.22.v20170606.pom
[INFO] Downloaded: http://repo1.maven.org/maven2/org/eclipse/jetty/jetty-continuation/9.2.22.v20170606/jetty-continuation-9.2.22.v20170606.pom
(2 KB at 109.3 KB/sec)
[INFO] Downloading: http://repo1.maven.org/eclipse/rome/rome/1.0/rome-1.0.pom
[INFO] Downloading: http://repo1.maven.org/maven2/rome/rome/1.0/rome-1.0.pom
[INFO] Downloaded: http://repo1.maven.org/maven2/rome/rome/1.0/rome-1.0.pom (7 KB at 341.4
KB/sec)
[INFO] Downloading: http://repo1.maven.org/eclipse/jdom/jdom/1.0/jdom-1.0.pom
[INFO] Downloading: http://repo1.maven.org/maven2/jdom/jdom/1.0/jdom-1.0.pom
[INFO] Downloaded: http://repo1.maven.org/maven2/jdom/jdom/1.0/jdom-1.0.pom (2 KB at 63.5
KB/sec)
[INFO] Downloading: http://repo1.maven.org/eclipse/org/springframework/spring-webmvc/4.3.9.RELEASE/spring-webmvc-4.3.9.RELEASE.pom
[INFO] Downloading: http://repo1.maven.org/maven2/org/springframework/spring-webmvc/4.3.9.RELEASE/spring-webmvc-4.3.9.RELEASE.pom
[INFO] Downloaded: http://repo1.maven.org/maven2/org/springframework/spring-webmvc/4.3.9.RELEASE/spring-webmvc-4.3.9.RELEASE.pom
(10 KB at 486.2 KB/sec)
[INFO] Downloading: http://repo1.maven.org/eclipse/org/springframework/spring-web/4.3.9.RELEASE/spring-web-4.3.9.RELEASE.pom
[INFO] Downloading: http://repo1.maven.org/maven2/org/springframework/spring-web/4.3.9.RELEASE/spring-web-4.3.9.RELEASE.pom
[INFO] Downloaded: http://repo1.maven.org/maven2/org/springframework/spring-web/4.3.9.RELEASE/spring-web-4.3.9.RELEASE.pom
(8 KB at 408.7 KB/sec)
[INFO] Downloading: http://repo1.maven.org/eclipse/org/apache/activemq/activemq-leveldb-store/5.15.2/activemq-leveldb-store-5.15.2.pom
[INFO] Downloading: http://repo1.maven.org/maven2/org/apache/activemq/activemq-leveldb-store/5.15.2/activemq-leveldb-store-5.15.2.pom
[INFO] Downloaded: http://repo1.maven.org/maven2/org/apache/activemq/activemq-leveldb-store/5.15.2/activemq-leveldb-store-5.15.2.pom
(21 KB at 734.4 KB/sec)
[INFO] Downloading: http://repo1.maven.org/eclipse/org/fusesource/hawtdispatch/hawtdispatch-scala-2.11/1.22/hawtdispatch-scala-2.11-1.22.pom
[INFO] Downloading: http://repo1.maven.org/maven2/org/fusesource/hawtdispatch/hawtdispatch-scala-2.11/1.22/hawtdispatch-scala-2.11-1.22.pom
[INFO] Downloaded: http://repo1.maven.org/maven2/org/fusesource/hawtdispatch/hawtdispatch-scala-2.11/1.22/hawtdispatch-scala-2.11-1.22.pom
(7 KB at 308.0 KB/sec)
[INFO] Downloading: http://repo1.maven.org/eclipse/org/iq80/leveldb/leveldb-api/0.9/leveldb-api-0.9.pom
[INFO] Downloading: http://repo1.maven.org/maven2/org/iq80/leveldb/leveldb-api/0.9/leveldb-api-0.9.pom
[INFO] Downloaded: http://repo1.maven.org/maven2/org/iq80/leveldb/leveldb-api/0.9/leveldb-api-0.9.pom
(697 B at 35.8 KB/sec)
[INFO] Downloading: http://repo1.maven.org/eclipse/org/iq80/leveldb/leveldb-project/0.9/leveldb-project-0.9.pom
[INFO] Downloading: http://repo1.maven.org/maven2/org/iq80/leveldb/leveldb-project/0.9/leveldb-project-0.9.pom
[INFO] Downloaded: http://repo1.maven.org/maven2/org/iq80/leveldb/leveldb-project/0.9/leveldb-project-0.9.pom
(4 KB at 204.6 KB/sec)
[INFO] Downloading: http://repo1.maven.org/eclipse/io/airlift/airbase/28/airbase-28.pom
[INFO] Downloading: http://repo1.maven.org/maven2/io/airlift/airbase/28/airbase-28.pom
[INFO] Downloaded: http://repo1.maven.org/maven2/io/airlift/airbase/28/airbase-28.pom (60
KB at 1992.5 KB/sec)
[INFO] Downloading: http://repo1.maven.org/eclipse/org/iq80/leveldb/leveldb/0.9/leveldb-0.9.pom
[INFO] Downloading: http://repo1.maven.org/maven2/org/iq80/leveldb/leveldb/0.9/leveldb-0.9.pom
[INFO] Downloaded: http://repo1.maven.org/maven2/org/iq80/leveldb/leveldb/0.9/leveldb-0.9.pom
(9 KB at 9.6 KB/sec)
[INFO] Downloading: http://repo1.maven.org/eclipse/org/fusesource/leveldbjni/leveldbjni/1.8/leveldbjni-1.8.pom
[INFO] Downloading: http://repo1.maven.org/maven2/org/fusesource/leveldbjni/leveldbjni/1.8/leveldbjni-1.8.pom
[INFO] Downloaded: http://repo1.maven.org/maven2/org/fusesource/leveldbjni/leveldbjni/1.8/leveldbjni-1.8.pom
(7 KB at 306.5 KB/sec)
[INFO] Downloading: http://repo1.maven.org/eclipse/org/fusesource/hawtjni/hawtjni-runtime/1.9/hawtjni-runtime-1.9.pom
[INFO] Downloading: http://repo1.maven.org/maven2/org/fusesource/hawtjni/hawtjni-runtime/1.9/hawtjni-runtime-1.9.pom
[INFO] Downloaded: http://repo1.maven.org/maven2/org/fusesource/hawtjni/hawtjni-runtime/1.9/hawtjni-runtime-1.9.pom
(2 KB at 4.4 KB/sec)
[INFO] Downloading: http://repo1.maven.org/eclipse/org/fusesource/hawtjni/hawtjni-project/1.9/hawtjni-project-1.9.pom
[INFO] Downloading: http://repo1.maven.org/maven2/org/fusesource/hawtjni/hawtjni-project/1.9/hawtjni-project-1.9.pom
[INFO] Downloaded: http://repo1.maven.org/maven2/org/fusesource/hawtjni/hawtjni-project/1.9/hawtjni-project-1.9.pom
(7 KB at 366.9 KB/sec)
[INFO] Downloading: http://repo1.maven.org/eclipse/org/iq80/leveldb/leveldb-api/0.6/leveldb-api-0.6.pom
[INFO] Downloading: http://repo1.maven.org/maven2/org/iq80/leveldb/leveldb-api/0.6/leveldb-api-0.6.pom
[INFO] Downloaded: http://repo1.maven.org/maven2/org/iq80/leveldb/leveldb-api/0.6/leveldb-api-0.6.pom
(690 B at 33.7 KB/sec)
[INFO] Downloading: http://repo1.maven.org/eclipse/org/iq80/leveldb/leveldb-project/0.6/leveldb-project-0.6.pom
[INFO] Downloading: http://repo1.maven.org/maven2/org/iq80/leveldb/leveldb-project/0.6/leveldb-project-0.6.pom
[INFO] Downloaded: http://repo1.maven.org/maven2/org/iq80/leveldb/leveldb-project/0.6/leveldb-project-0.6.pom
(17 KB at 700.5 KB/sec)
[INFO] Downloading: http://repo1.maven.org/eclipse/org/iq80/snappy/snappy/0.2/snappy-0.2.pom
[INFO] Downloading: http://repo1.maven.org/maven2/org/iq80/snappy/snappy/0.2/snappy-0.2.pom
[INFO] Downloaded: http://repo1.maven.org/maven2/org/iq80/snappy/snappy/0.2/snappy-0.2.pom
(14 KB at 629.1 KB/sec)
[INFO] Downloading: http://repo1.maven.org/eclipse/org/apache/hadoop/hadoop-core/1.0.0/hadoop-core-1.0.0.pom
[INFO] Downloading: http://repo1.maven.org/maven2/org/apache/hadoop/hadoop-core/1.0.0/hadoop-core-1.0.0.pom
[INFO] Downloaded: http://repo1.maven.org/maven2/org/apache/hadoop/hadoop-core/1.0.0/hadoop-core-1.0.0.pom
(5 KB at 236.1 KB/sec)
[INFO] Downloading: http://repo1.maven.org/eclipse/org/apache/activemq/activemq-log4j-appender/5.15.2/activemq-log4j-appender-5.15.2.pom
[INFO] Downloading: http://repo1.maven.org/maven2/org/apache/activemq/activemq-log4j-appender/5.15.2/activemq-log4j-appender-5.15.2.pom
[INFO] Downloaded: http://repo1.maven.org/maven2/org/apache/activemq/activemq-log4j-appender/5.15.2/activemq-log4j-appender-5.15.2.pom
(4 KB at 183.0 KB/sec)
[INFO] Downloading: http://repo1.maven.org/eclipse/org/apache/activemq/activemq-amqp/5.15.2/activemq-amqp-5.15.2.pom
[INFO] Downloading: http://repo1.maven.org/maven2/org/apache/activemq/activemq-amqp/5.15.2/activemq-amqp-5.15.2.pom
[INFO] Downloaded: http://repo1.maven.org/maven2/org/apache/activemq/activemq-amqp/5.15.2/activemq-amqp-5.15.2.pom
(11 KB at 542.7 KB/sec)
[INFO] Downloading: http://repo1.maven.org/eclipse/org/apache/qpid/proton-j/0.22.0/proton-j-0.22.0.pom
[INFO] Downloading: http://repo1.maven.org/maven2/org/apache/qpid/proton-j/0.22.0/proton-j-0.22.0.pom
[INFO] Downloaded: http://repo1.maven.org/maven2/org/apache/qpid/proton-j/0.22.0/proton-j-0.22.0.pom
(3 KB at 115.1 KB/sec)
[INFO] Downloading: http://repo1.maven.org/eclipse/org/apache/qpid/proton-j-parent/0.22.0/proton-j-parent-0.22.0.pom
[INFO] Downloading: http://repo1.maven.org/maven2/org/apache/qpid/proton-j-parent/0.22.0/proton-j-parent-0.22.0.pom
[INFO] Downloaded: http://repo1.maven.org/maven2/org/apache/qpid/proton-j-parent/0.22.0/proton-j-parent-0.22.0.pom
(8 KB at 394.4 KB/sec)
[INFO] Downloading: http://repo1.maven.org/eclipse/org/apache/activemq/activemq-partition/5.15.2/activemq-partition-5.15.2.pom
[INFO] Downloading: http://repo1.maven.org/maven2/org/apache/activemq/activemq-partition/5.15.2/activemq-partition-5.15.2.pom
[INFO] Downloaded: http://repo1.maven.org/maven2/org/apache/activemq/activemq-partition/5.15.2/activemq-partition-5.15.2.pom
(5 KB at 247.5 KB/sec)
[INFO] Downloading: http://repo1.maven.org/eclipse/org/linkedin/org.linkedin.zookeeper-impl/1.4.0/org.linkedin.zookeeper-impl-1.4.0.pom
[INFO] Downloading: http://repo1.maven.org/maven2/org/linkedin/org.linkedin.zookeeper-impl/1.4.0/org.linkedin.zookeeper-impl-1.4.0.pom
[INFO] Downloaded: http://repo1.maven.org/maven2/org/linkedin/org.linkedin.zookeeper-impl/1.4.0/org.linkedin.zookeeper-impl-1.4.0.pom
(3 KB at 118.3 KB/sec)
[INFO] Downloading: http://repo1.maven.org/eclipse/org/apache/zookeeper/zookeeper/3.3.3/zookeeper-3.3.3.pom
[INFO] Downloading: http://repo1.maven.org/maven2/org/apache/zookeeper/zookeeper/3.3.3/zookeeper-3.3.3.pom
[INFO] Downloaded: http://repo1.maven.org/maven2/org/apache/zookeeper/zookeeper/3.3.3/zookeeper-3.3.3.pom
(3 KB at 115.9 KB/sec)
[INFO] Downloading: http://repo1.maven.org/eclipse/org/linkedin/org.linkedin.util-core/1.7.1/org.linkedin.util-core-1.7.1.pom
[INFO] Downloading: http://repo1.maven.org/maven2/org/linkedin/org.linkedin.util-core/1.7.1/org.linkedin.util-core-1.7.1.pom
[INFO] Downloaded: http://repo1.maven.org/maven2/org/linkedin/org.linkedin.util-core/1.7.1/org.linkedin.util-core-1.7.1.pom
(2 KB at 94.5 KB/sec)
[INFO] Downloading: http://repo1.maven.org/eclipse/org/linkedin/org.linkedin.util-groovy/1.7.1/org.linkedin.util-groovy-1.7.1.pom
[INFO] Downloading: http://repo1.maven.org/maven2/org/linkedin/org.linkedin.util-groovy/1.7.1/org.linkedin.util-groovy-1.7.1.pom
[INFO] Downloaded: http://repo1.maven.org/maven2/org/linkedin/org.linkedin.util-groovy/1.7.1/org.linkedin.util-groovy-1.7.1.pom
(3 KB at 132.0 KB/sec)
[INFO] Downloading: http://repo1.maven.org/eclipse/org/slf4j/jul-to-slf4j/1.5.8/jul-to-slf4j-1.5.8.pom
[INFO] Downloading: http://repo1.maven.org/maven2/org/slf4j/jul-to-slf4j/1.5.8/jul-to-slf4j-1.5.8.pom
[INFO] Downloaded: http://repo1.maven.org/maven2/org/slf4j/jul-to-slf4j/1.5.8/jul-to-slf4j-1.5.8.pom
(2 KB at 58.5 KB/sec)
[INFO] Downloading: http://repo1.maven.org/eclipse/org/slf4j/slf4j-parent/1.5.8/slf4j-parent-1.5.8.pom
[INFO] Downloading: http://repo1.maven.org/maven2/org/slf4j/slf4j-parent/1.5.8/slf4j-parent-1.5.8.pom
[INFO] Downloaded: http://repo1.maven.org/maven2/org/slf4j/slf4j-parent/1.5.8/slf4j-parent-1.5.8.pom
(8 KB at 438.8 KB/sec)
[INFO] Downloading: http://repo1.maven.org/eclipse/org/apache/ant/ant/1.8.1/ant-1.8.1.pom
[INFO] Downloading: http://repo1.maven.org/maven2/org/apache/ant/ant/1.8.1/ant-1.8.1.pom
[INFO] Downloaded: http://repo1.maven.org/maven2/org/apache/ant/ant/1.8.1/ant-1.8.1.pom (9
KB at 429.6 KB/sec)
[INFO] Downloading: http://repo1.maven.org/eclipse/org/apache/ant/ant-parent/1.8.1/ant-parent-1.8.1.pom
[INFO] Downloading: http://repo1.maven.org/maven2/org/apache/ant/ant-parent/1.8.1/ant-parent-1.8.1.pom
[INFO] Downloaded: http://repo1.maven.org/maven2/org/apache/ant/ant-parent/1.8.1/ant-parent-1.8.1.pom
(5 KB at 209.0 KB/sec)
[INFO] Downloading: http://repo1.maven.org/eclipse/org/apache/ant/ant-launcher/1.8.1/ant-launcher-1.8.1.pom
[INFO] Downloading: http://repo1.maven.org/maven2/org/apache/ant/ant-launcher/1.8.1/ant-launcher-1.8.1.pom
[INFO] Downloaded: http://repo1.maven.org/maven2/org/apache/ant/ant-launcher/1.8.1/ant-launcher-1.8.1.pom
(3 KB at 122.5 KB/sec)
[INFO] Downloading: http://repo1.maven.org/eclipse/org/linkedin/org.linkedin.util-core/1.4.0/org.linkedin.util-core-1.4.0.pom
[INFO] Downloading: http://repo1.maven.org/maven2/org/linkedin/org.linkedin.util-core/1.4.0/org.linkedin.util-core-1.4.0.pom
[INFO] Downloaded: http://repo1.maven.org/maven2/org/linkedin/org.linkedin.util-core/1.4.0/org.linkedin.util-core-1.4.0.pom
(2 KB at 89.8 KB/sec)
[INFO] Downloading: http://repo1.maven.org/eclipse/org/slf4j/slf4j-log4j12/1.7.25/slf4j-log4j12-1.7.25.pom
[INFO] Downloading: http://repo1.maven.org/maven2/org/slf4j/slf4j-log4j12/1.7.25/slf4j-log4j12-1.7.25.pom
[INFO] Downloaded: http://repo1.maven.org/maven2/org/slf4j/slf4j-log4j12/1.7.25/slf4j-log4j12-1.7.25.pom
(2 KB at 61.4 KB/sec)
[INFO] Downloading: http://repo1.maven.org/eclipse/org/apache/activemq/activemq-runtime-config/5.15.2/activemq-runtime-config-5.15.2.pom
[INFO] Downloading: http://repo1.maven.org/maven2/org/apache/activemq/activemq-runtime-config/5.15.2/activemq-runtime-config-5.15.2.pom
[INFO] Downloaded: http://repo1.maven.org/maven2/org/apache/activemq/activemq-runtime-config/5.15.2/activemq-runtime-config-5.15.2.pom
(8 KB at 85.0 KB/sec)
[INFO] Downloading: http://repo1.maven.org/eclipse/org/jvnet/jaxb2_commons/jaxb2-basics-runtime/0.6.4/jaxb2-basics-runtime-0.6.4.pom
[INFO] Downloading: http://repo1.maven.org/maven2/org/jvnet/jaxb2_commons/jaxb2-basics-runtime/0.6.4/jaxb2-basics-runtime-0.6.4.pom
[INFO] Downloaded: http://repo1.maven.org/maven2/org/jvnet/jaxb2_commons/jaxb2-basics-runtime/0.6.4/jaxb2-basics-runtime-0.6.4.pom
(2 KB at 104.4 KB/sec)
[INFO] Downloading: http://repo1.maven.org/eclipse/org/jvnet/jaxb2_commons/jaxb2-basics-project/0.6.4/jaxb2-basics-project-0.6.4.pom
[INFO] Downloading: http://repo1.maven.org/maven2/org/jvnet/jaxb2_commons/jaxb2-basics-project/0.6.4/jaxb2-basics-project-0.6.4.pom
[INFO] Downloaded: http://repo1.maven.org/maven2/org/jvnet/jaxb2_commons/jaxb2-basics-project/0.6.4/jaxb2-basics-project-0.6.4.pom
(10 KB at 520.3 KB/sec)
[INFO] Downloading: http://repo1.maven.org/eclipse/org/apache/activemq/activemq-shiro/5.15.2/activemq-shiro-5.15.2.pom
[INFO] Downloading: http://repo1.maven.org/maven2/org/apache/activemq/activemq-shiro/5.15.2/activemq-shiro-5.15.2.pom
[INFO] Downloaded: http://repo1.maven.org/maven2/org/apache/activemq/activemq-shiro/5.15.2/activemq-shiro-5.15.2.pom
(7 KB at 295.4 KB/sec)
[INFO] Downloading: http://repo1.maven.org/eclipse/org/apache/shiro/shiro-core/1.2.4/shiro-core-1.2.4.pom
[INFO] Downloading: http://repo1.maven.org/maven2/org/apache/shiro/shiro-core/1.2.4/shiro-core-1.2.4.pom
[INFO] Downloaded: http://repo1.maven.org/maven2/org/apache/shiro/shiro-core/1.2.4/shiro-core-1.2.4.pom
(5 KB at 210.0 KB/sec)
[INFO] Downloading: http://repo1.maven.org/eclipse/org/apache/shiro/shiro-root/1.2.4/shiro-root-1.2.4.pom
[INFO] Downloading: http://repo1.maven.org/maven2/org/apache/shiro/shiro-root/1.2.4/shiro-root-1.2.4.pom
[INFO] Downloaded: http://repo1.maven.org/maven2/org/apache/shiro/shiro-root/1.2.4/shiro-root-1.2.4.pom
(45 KB at 1583.6 KB/sec)
[INFO] Downloading: http://repo1.maven.org/eclipse/org/apache/shiro/shiro-spring/1.2.4/shiro-spring-1.2.4.pom
[INFO] Downloading: http://repo1.maven.org/maven2/org/apache/shiro/shiro-spring/1.2.4/shiro-spring-1.2.4.pom
[INFO] Downloaded: http://repo1.maven.org/maven2/org/apache/shiro/shiro-spring/1.2.4/shiro-spring-1.2.4.pom
(4 KB at 207.8 KB/sec)
[INFO] Downloading: http://repo1.maven.org/eclipse/org/apache/shiro/shiro-web/1.2.4/shiro-web-1.2.4.pom
[INFO] Downloading: http://repo1.maven.org/maven2/org/apache/shiro/shiro-web/1.2.4/shiro-web-1.2.4.pom
[INFO] Downloaded: http://repo1.maven.org/maven2/org/apache/shiro/shiro-web/1.2.4/shiro-web-1.2.4.pom
(4 KB at 184.8 KB/sec)
[INFO] Downloading: http://repo1.maven.org/eclipse/org/apache/uima/uimaj-as-core/2.10.2/uimaj-as-core-2.10.2.pom
[INFO] Downloading: http://repo1.maven.org/maven2/org/apache/uima/uimaj-as-core/2.10.2/uimaj-as-core-2.10.2.pom
[INFO] Downloaded: http://repo1.maven.org/maven2/org/apache/uima/uimaj-as-core/2.10.2/uimaj-as-core-2.10.2.pom
(6 KB at 277.5 KB/sec)
[INFO] Downloading: http://repo1.maven.org/eclipse/org/apache/uima/uimaj-as-jms/2.10.2/uimaj-as-jms-2.10.2.pom
[INFO] Downloading: http://repo1.maven.org/maven2/org/apache/uima/uimaj-as-jms/2.10.2/uimaj-as-jms-2.10.2.pom
[INFO] Downloaded: http://repo1.maven.org/maven2/org/apache/uima/uimaj-as-jms/2.10.2/uimaj-as-jms-2.10.2.pom
(4 KB at 202.5 KB/sec)
[INFO] Downloading: http://repo1.maven.org/eclipse/org/apache/geronimo/specs/geronimo-servlet_3.0_spec/1.0/geronimo-servlet_3.0_spec-1.0.pom
[INFO] Downloading: http://repo1.maven.org/maven2/org/apache/geronimo/specs/geronimo-servlet_3.0_spec/1.0/geronimo-servlet_3.0_spec-1.0.pom
[INFO] Downloaded: http://repo1.maven.org/maven2/org/apache/geronimo/specs/geronimo-servlet_3.0_spec/1.0/geronimo-servlet_3.0_spec-1.0.pom
(7 KB at 320.9 KB/sec)
[INFO] Downloading: http://repo1.maven.org/eclipse/org/apache/activemq/activemq-camel/5.15.2/activemq-camel-5.15.2.pom
[INFO] Downloading: http://repo1.maven.org/maven2/org/apache/activemq/activemq-camel/5.15.2/activemq-camel-5.15.2.pom
[INFO] Downloaded: http://repo1.maven.org/maven2/org/apache/activemq/activemq-camel/5.15.2/activemq-camel-5.15.2.pom
(9 KB at 448.3 KB/sec)
[INFO] Downloading: http://repo1.maven.org/eclipse/org/apache/camel/camel-jms/2.19.3/camel-jms-2.19.3.pom
[INFO] Downloading: http://repo1.maven.org/maven2/org/apache/camel/camel-jms/2.19.3/camel-jms-2.19.3.pom
[INFO] Downloaded: http://repo1.maven.org/maven2/org/apache/camel/camel-jms/2.19.3/camel-jms-2.19.3.pom
(7 KB at 292.1 KB/sec)
[INFO] Downloading: http://repo1.maven.org/eclipse/org/springframework/spring-jms/4.3.10.RELEASE/spring-jms-4.3.10.RELEASE.pom
[INFO] Downloading: http://repo1.maven.org/maven2/org/springframework/spring-jms/4.3.10.RELEASE/spring-jms-4.3.10.RELEASE.pom
[INFO] Downloaded: http://repo1.maven.org/maven2/org/springframework/spring-jms/4.3.10.RELEASE/spring-jms-4.3.10.RELEASE.pom
(4 KB at 188.9 KB/sec)
[INFO] Downloading: http://repo1.maven.org/eclipse/org/springframework/spring-messaging/4.3.10.RELEASE/spring-messaging-4.3.10.RELEASE.pom
[INFO] Downloading: http://repo1.maven.org/maven2/org/springframework/spring-messaging/4.3.10.RELEASE/spring-messaging-4.3.10.RELEASE.pom
[INFO] Downloaded: http://repo1.maven.org/maven2/org/springframework/spring-messaging/4.3.10.RELEASE/spring-messaging-4.3.10.RELEASE.pom
(4 KB at 176.7 KB/sec)
[INFO] Downloading: http://repo1.maven.org/eclipse/org/apache/camel/camel-xstream/2.19.3/camel-xstream-2.19.3.pom
[INFO] Downloading: http://repo1.maven.org/maven2/org/apache/camel/camel-xstream/2.19.3/camel-xstream-2.19.3.pom
[INFO] Downloaded: http://repo1.maven.org/maven2/org/apache/camel/camel-xstream/2.19.3/camel-xstream-2.19.3.pom
(4 KB at 42.2 KB/sec)
[INFO] Downloading: http://repo1.maven.org/eclipse/org/codehaus/jettison/jettison/1.3.8/jettison-1.3.8.pom
[INFO] Downloading: http://repo1.maven.org/maven2/org/codehaus/jettison/jettison/1.3.8/jettison-1.3.8.pom
[INFO] Downloaded: http://repo1.maven.org/maven2/org/codehaus/jettison/jettison/1.3.8/jettison-1.3.8.pom
(8 KB at 371.5 KB/sec)
[INFO] ------------------------------------------------------------------------
[INFO] Reactor Summary:
[INFO] 
[INFO] Apache UIMA DUCC: uima-ducc-parent ................. SUCCESS [01:49 min]
[INFO] Apache UIMA DUCC: uima-ducc-workitem-v2 ............ SUCCESS [02:36 min]
[INFO] Apache UIMA DUCC: uima-ducc-user ................... FAILURE [ 30.586 s]
[INFO] Apache UIMA DUCC: uima-ducc-common ................. SKIPPED
[INFO] Apache UIMA DUCC: uima-ducc-pullservice ............ SKIPPED
[INFO] Apache UIMA DUCC: uima-ducc-container .............. SKIPPED
[INFO] Apache UIMA DUCC: uima-ducc-transport .............. SKIPPED
[INFO] Apache UIMA DUCC: uima-ducc-cli .................... SKIPPED
[INFO] Apache UIMA DUCC: uima-ducc-pm ..................... SKIPPED
[INFO] Apache UIMA DUCC: uima-ducc-rm ..................... SKIPPED
[INFO] Apache UIMA DUCC: uima-ducc-sm ..................... SKIPPED
[INFO] Apache UIMA DUCC: uima-ducc-database ............... SKIPPED
[INFO] Apache UIMA DUCC: uima-ducc-orchestrator ........... SKIPPED
[INFO] Apache UIMA DUCC: uima-ducc-agent .................. SKIPPED
[INFO] Apache UIMA DUCC: uima-ducc-duccdocs ............... SKIPPED
[INFO] Apache UIMA DUCC: uima-ducc-web .................... SKIPPED
[INFO] Apache UIMA DUCC: uima-ducc-examples ............... SKIPPED
[INFO] Apache UIMA DUCC: uima-ducc-spawn .................. SKIPPED
[INFO] Apache UIMA DUCC: uima-ducc-workitem-v3 ............ SKIPPED
[INFO] Apache UIMA-DUCC: uima-ducc ........................ SKIPPED
[INFO] ------------------------------------------------------------------------
[INFO] BUILD FAILURE
[INFO] ------------------------------------------------------------------------
[INFO] Total time: 05:34 min
[INFO] Finished at: 2019-10-08T19:52:14+00:00
[INFO] Final Memory: 87M/943M
[INFO] ------------------------------------------------------------------------
[ERROR] Failed to execute goal on project uima-ducc-user: Could not resolve dependencies for
project org.apache.uima:uima-ducc-user:jar:3.0.1-SNAPSHOT: Failed to collect dependencies
at org.apache.uima:uimaj-as-activemq:jar:2.10.2 -> org.apache.activemq:activemq-web:jar:5.15.2
-> org.eclipse.jetty.websocket:websocket-server:jar:9.2.22.v20170606 -> org.eclipse.jetty.websocket:websocket-client:jar:9.2.22.v20170606:
Failed to read artifact descriptor for org.eclipse.jetty.websocket:websocket-client:jar:9.2.22.v20170606:
Could not transfer artifact org.eclipse.jetty.websocket:websocket-client:pom:9.2.22.v20170606
from/to central (http://repo1.maven.org/maven2): Failed to transfer file: http://repo1.maven.org/maven2/org/eclipse/jetty/websocket/websocket-client/9.2.22.v20170606/websocket-client-9.2.22.v20170606.pom.
Return code is: 503 , ReasonPhrase:Maximum threads for service reached. -> [Help 1]
[ERROR] 
[ERROR] To see the full stack trace of the errors, re-run Maven with the -e switch.
[ERROR] Re-run Maven using the -X switch to enable full debug logging.
[ERROR] 
[ERROR] For more information about the errors and possible solutions, please read the following
articles:
[ERROR] [Help 1] http://cwiki.apache.org/confluence/display/MAVEN/DependencyResolutionException
[ERROR] 
[ERROR] After correcting the problems, you can resume the build with the command
[ERROR]   mvn <goals> -rf :uima-ducc-user
[JENKINS] Archiving <https://builds.apache.org/job/UIMA-DUCC/ws/trunk/uima-ducc-sm/pom.xml>
to org.apache.uima/uima-ducc-sm/3.0.1-SNAPSHOT/uima-ducc-sm-3.0.1-SNAPSHOT.pom
[JENKINS] Archiving <https://builds.apache.org/job/UIMA-DUCC/ws/trunk/uima-ducc-parent/pom.xml>
to org.apache.uima/uima-ducc-parent/3.0.1-SNAPSHOT/uima-ducc-parent-3.0.1-SNAPSHOT.pom
[JENKINS] Archiving <https://builds.apache.org/job/UIMA-DUCC/ws/trunk/uima-ducc-duccdocs/pom.xml>
to org.apache.uima/uima-ducc-duccdocs/3.0.1-SNAPSHOT/uima-ducc-duccdocs-3.0.1-SNAPSHOT.pom
[JENKINS] Archiving <https://builds.apache.org/job/UIMA-DUCC/ws/trunk/uima-ducc-pullservice/pom.xml>
to org.apache.uima/uima-ducc-pullservice/3.0.1-SNAPSHOT/uima-ducc-pullservice-3.0.1-SNAPSHOT.pom
[JENKINS] Archiving <https://builds.apache.org/job/UIMA-DUCC/ws/trunk/uima-ducc-pm/pom.xml>
to org.apache.uima/uima-ducc-pm/3.0.1-SNAPSHOT/uima-ducc-pm-3.0.1-SNAPSHOT.pom
[JENKINS] Archiving <https://builds.apache.org/job/UIMA-DUCC/ws/trunk/uima-ducc-database/pom.xml>
to org.apache.uima/uima-ducc-database/3.0.1-SNAPSHOT/uima-ducc-database-3.0.1-SNAPSHOT.pom
[JENKINS] Archiving <https://builds.apache.org/job/UIMA-DUCC/ws/trunk/uima-ducc-rm/pom.xml>
to org.apache.uima/uima-ducc-rm/3.0.1-SNAPSHOT/uima-ducc-rm-3.0.1-SNAPSHOT.pom
[JENKINS] Archiving <https://builds.apache.org/job/UIMA-DUCC/ws/trunk/uima-ducc-examples/pom.xml>
to org.apache.uima/uima-ducc-examples/3.0.1-SNAPSHOT/uima-ducc-examples-3.0.1-SNAPSHOT.pom
[JENKINS] Archiving <https://builds.apache.org/job/UIMA-DUCC/ws/trunk/uima-ducc-web/pom.xml>
to org.apache.uima/uima-ducc-web/3.0.1-SNAPSHOT/uima-ducc-web-3.0.1-SNAPSHOT.pom
[JENKINS] Archiving <https://builds.apache.org/job/UIMA-DUCC/ws/trunk/uima-ducc-workitem-v3/pom.xml>
to org.apache.uima/uima-ducc-workitem-v3/3.0.1-SNAPSHOT/uima-ducc-workitem-v3-3.0.1-SNAPSHOT.pom
[JENKINS] Archiving <https://builds.apache.org/job/UIMA-DUCC/ws/trunk/uima-ducc-workitem-v2/pom.xml>
to org.apache.uima/uima-ducc-workitem-v2/3.0.1-SNAPSHOT/uima-ducc-workitem-v2-3.0.1-SNAPSHOT.pom
[JENKINS] Archiving <https://builds.apache.org/job/UIMA-DUCC/ws/trunk/uima-ducc-workitem-v2/target/uima-ducc-workitem-v2-3.0.1-SNAPSHOT.jar>
to org.apache.uima/uima-ducc-workitem-v2/3.0.1-SNAPSHOT/uima-ducc-workitem-v2-3.0.1-SNAPSHOT.jar
[JENKINS] Archiving <https://builds.apache.org/job/UIMA-DUCC/ws/trunk/uima-ducc-container/pom.xml>
to org.apache.uima/uima-ducc-container/3.0.1-SNAPSHOT/uima-ducc-container-3.0.1-SNAPSHOT.pom
[JENKINS] Archiving <https://builds.apache.org/job/UIMA-DUCC/ws/trunk/uima-ducc-spawn/pom.xml>
to org.apache.uima/uima-ducc-spawn/3.0.1-SNAPSHOT/uima-ducc-spawn-3.0.1-SNAPSHOT.pom
[JENKINS] Archiving <https://builds.apache.org/job/UIMA-DUCC/ws/trunk/uima-ducc-common/pom.xml>
to org.apache.uima/uima-ducc-common/3.0.1-SNAPSHOT/uima-ducc-common-3.0.1-SNAPSHOT.pom
[JENKINS] Archiving <https://builds.apache.org/job/UIMA-DUCC/ws/trunk/pom.xml> to org.apache.uima/uima-ducc/3.0.1-SNAPSHOT/uima-ducc-3.0.1-SNAPSHOT.pom
[JENKINS] Archiving <https://builds.apache.org/job/UIMA-DUCC/ws/trunk/uima-ducc-agent/pom.xml>
to org.apache.uima/uima-ducc-agent/3.0.1-SNAPSHOT/uima-ducc-agent-3.0.1-SNAPSHOT.pom
[JENKINS] Archiving <https://builds.apache.org/job/UIMA-DUCC/ws/trunk/uima-ducc-user/pom.xml>
to org.apache.uima/uima-ducc-user/3.0.1-SNAPSHOT/uima-ducc-user-3.0.1-SNAPSHOT.pom
[JENKINS] Archiving <https://builds.apache.org/job/UIMA-DUCC/ws/trunk/uima-ducc-orchestrator/pom.xml>
to org.apache.uima/uima-ducc-orchestrator/3.0.1-SNAPSHOT/uima-ducc-orchestrator-3.0.1-SNAPSHOT.pom
[JENKINS] Archiving <https://builds.apache.org/job/UIMA-DUCC/ws/trunk/uima-ducc-transport/pom.xml>
to org.apache.uima/uima-ducc-transport/3.0.1-SNAPSHOT/uima-ducc-transport-3.0.1-SNAPSHOT.pom
[JENKINS] Archiving <https://builds.apache.org/job/UIMA-DUCC/ws/trunk/uima-ducc-cli/pom.xml>
to org.apache.uima/uima-ducc-cli/3.0.1-SNAPSHOT/uima-ducc-cli-3.0.1-SNAPSHOT.pom
No mail will be sent out, as 'UIMA-DUCC » Apache UIMA DUCC: uima-ducc-sm #1615' does not
have a result yet. Please make sure you set a proper result in case of pipeline/build scripts.
No mail will be sent out, as 'UIMA-DUCC » Apache UIMA DUCC: uima-ducc-parent #1615' does
not have a result yet. Please make sure you set a proper result in case of pipeline/build
scripts.
No mail will be sent out, as 'UIMA-DUCC » Apache UIMA DUCC: uima-ducc-duccdocs #1615' does
not have a result yet. Please make sure you set a proper result in case of pipeline/build
scripts.
No mail will be sent out, as 'UIMA-DUCC » Apache UIMA DUCC: uima-ducc-pullservice #1615'
does not have a result yet. Please make sure you set a proper result in case of pipeline/build
scripts.
No mail will be sent out, as 'UIMA-DUCC » Apache UIMA DUCC: uima-ducc-pm #1615' does not
have a result yet. Please make sure you set a proper result in case of pipeline/build scripts.
No mail will be sent out, as 'UIMA-DUCC » Apache UIMA DUCC: uima-ducc-database #1615' does
not have a result yet. Please make sure you set a proper result in case of pipeline/build
scripts.
No mail will be sent out, as 'UIMA-DUCC » Apache UIMA DUCC: uima-ducc-rm #1615' does not
have a result yet. Please make sure you set a proper result in case of pipeline/build scripts.
No mail will be sent out, as 'UIMA-DUCC » Apache UIMA DUCC: uima-ducc-examples #1615' does
not have a result yet. Please make sure you set a proper result in case of pipeline/build
scripts.
No mail will be sent out, as 'UIMA-DUCC » Apache UIMA DUCC: uima-ducc-web #1615' does not
have a result yet. Please make sure you set a proper result in case of pipeline/build scripts.
No mail will be sent out, as 'UIMA-DUCC » Apache UIMA DUCC: uima-ducc-workitem-v3 #1615'
does not have a result yet. Please make sure you set a proper result in case of pipeline/build
scripts.
No mail will be sent out, as 'UIMA-DUCC » Apache UIMA DUCC: uima-ducc-workitem-v2 #1615'
does not have a result yet. Please make sure you set a proper result in case of pipeline/build
scripts.
No mail will be sent out, as 'UIMA-DUCC » Apache UIMA DUCC: uima-ducc-container #1615'
does not have a result yet. Please make sure you set a proper result in case of pipeline/build
scripts.
No mail will be sent out, as 'UIMA-DUCC » Apache UIMA DUCC: uima-ducc-spawn #1615' does
not have a result yet. Please make sure you set a proper result in case of pipeline/build
scripts.
No mail will be sent out, as 'UIMA-DUCC » Apache UIMA DUCC: uima-ducc-common #1615' does
not have a result yet. Please make sure you set a proper result in case of pipeline/build
scripts.
No mail will be sent out, as 'UIMA-DUCC » Apache UIMA-DUCC: uima-ducc #1615' does not have
a result yet. Please make sure you set a proper result in case of pipeline/build scripts.
No mail will be sent out, as 'UIMA-DUCC » Apache UIMA DUCC: uima-ducc-agent #1615' does
not have a result yet. Please make sure you set a proper result in case of pipeline/build
scripts.
Sending e-mails to: dev@uima.apache.org
No mail will be sent out, as 'UIMA-DUCC » Apache UIMA DUCC: uima-ducc-orchestrator #1615'
does not have a result yet. Please make sure you set a proper result in case of pipeline/build
scripts.
No mail will be sent out, as 'UIMA-DUCC » Apache UIMA DUCC: uima-ducc-transport #1615'
does not have a result yet. Please make sure you set a proper result in case of pipeline/build
scripts.
No mail will be sent out, as 'UIMA-DUCC » Apache UIMA DUCC: uima-ducc-cli #1615' does not
have a result yet. Please make sure you set a proper result in case of pipeline/build scripts.
channel stopped
[WARNINGS] Skipping publisher since build result is FAILURE

Mime
View raw message