uima-dev mailing list archives

Site index · List index
Message view « Date » · « Thread »
Top « Date » · « Thread »
From Apache Jenkins Server <jenk...@builds.apache.org>
Subject Build failed in Jenkins: UIMA-Ruta Java 11 #16
Date Tue, 22 Oct 2019 16:54:09 GMT
See <https://builds.apache.org/job/UIMA-Ruta%20Java%2011/16/display/redirect?page=changes>

Changes:

[vmorari] UIMA-5431: fixed bug by updating the deprecated implementation of dependencies.


------------------------------------------
[...truncated 1.98 MB...]
[WARNING] The POM for org.eclipse.m2e:lifecycle-mapping:jar:1.0.0 is missing, no dependency
information available
[WARNING] Failed to retrieve plugin descriptor for org.eclipse.m2e:lifecycle-mapping:1.0.0:
Plugin org.eclipse.m2e:lifecycle-mapping:1.0.0 or one of its dependencies could not be resolved:
Failure to find org.eclipse.m2e:lifecycle-mapping:jar:1.0.0 in https://repo.maven.apache.org/maven2
was cached in the local repository, resolution will not be reattempted until the update interval
of central has elapsed or updates are forced
[INFO] 
[INFO] --- maven-clean-plugin:3.1.0:clean (default-clean) @ ruta-maven-plugin ---
[TASKS] Scanning folder '<https://builds.apache.org/job/UIMA-Ruta%20Java%2011/ws/trunk/ruta-maven-plugin'>
for files matching the pattern '**/*.java' - excludes: 
[TASKS] Found 9 files to scan for tasks
Found 1 open tasks.
[INFO] 
[INFO] --- build-helper-maven-plugin:3.0.0:parse-version (parse-project-version) @ ruta-maven-plugin
---
[INFO] 
[INFO] --- uima-build-helper-maven-plugin:7:parse-date-time (set buildYear and buildMonth)
@ ruta-maven-plugin ---
[INFO] 
[INFO] --- maven-enforcer-plugin:3.0.0-M2:enforce (enforce-maven-version) @ ruta-maven-plugin
---
[INFO] 
[INFO] --- maven-enforcer-plugin:3.0.0-M2:enforce (enforce-versions) @ ruta-maven-plugin ---
[INFO] 
[INFO] --- maven-plugin-plugin:3.5.2:helpmojo (generate-helpmojo) @ ruta-maven-plugin ---
[INFO] Using 'UTF-8' encoding to read mojo source files.
[INFO] java-annotations mojo extractor found 0 mojo descriptor.
[INFO] 
[INFO] --- maven-remote-resources-plugin:1.5:process (process-resource-bundles) @ ruta-maven-plugin
---
[INFO] 
[INFO] --- maven-remote-resources-plugin:1.5:process (default) @ ruta-maven-plugin ---
[INFO] 
[INFO] --- maven-resources-plugin:3.1.0:resources (default-resources) @ ruta-maven-plugin
---
[INFO] Using 'UTF-8' encoding to copy filtered resources.
[INFO] Copying 1 resource
[INFO] Copying 3 resources
[INFO] Copying 3 resources
[INFO] 
[INFO] --- maven-compiler-plugin:3.8.0:compile (default-compile) @ ruta-maven-plugin ---
[INFO] Changes detected - recompiling the module!
[INFO] Compiling 5 source files to <https://builds.apache.org/job/UIMA-Ruta%20Java%2011/ws/trunk/ruta-maven-plugin/target/classes>
[INFO] 
[INFO] --- maven-plugin-plugin:3.5.2:descriptor (default-descriptor) @ ruta-maven-plugin ---
[INFO] Using 'UTF-8' encoding to read mojo source files.
[INFO] java-annotations mojo extractor found 4 mojo descriptors.
[INFO] 
[INFO] --- maven-resources-plugin:3.1.0:testResources (default-testResources) @ ruta-maven-plugin
---
[INFO] Using 'UTF-8' encoding to copy filtered resources.
[INFO] Copying 2 resources
[INFO] Copying 3 resources
[INFO] Copying 3 resources
[INFO] 
[INFO] --- maven-compiler-plugin:3.8.0:testCompile (default-testCompile) @ ruta-maven-plugin
---
[INFO] Changes detected - recompiling the module!
[INFO] Compiling 1 source file to <https://builds.apache.org/job/UIMA-Ruta%20Java%2011/ws/trunk/ruta-maven-plugin/target/test-classes>
[INFO] 
[INFO] --- maven-surefire-plugin:2.22.1:test (default-test) @ ruta-maven-plugin ---
[INFO] 
[INFO] -------------------------------------------------------
[INFO]  T E S T S
[INFO] -------------------------------------------------------
[INFO] Running org.apache.uima.ruta.maven.RutaGenerateDescriptorMojoTest
[debug] Classpath entry: <https://builds.apache.org/job/UIMA-Ruta%20Java%2011/ws/trunk/ruta-maven-plugin/target/project-simple-test/src/main/java>
[debug] Classpath entry: <https://builds.apache.org/job/UIMA-Ruta%20Java%2011/ws/trunk/ruta-maven-plugin/target/project-simple-test/target/generated-sources/ruta/descriptor>
[debug] Classpath entry: <https://builds.apache.org/job/UIMA-Ruta%20Java%2011/ws/trunk/ruta-maven-plugin/target/project-simple-test/src/main/resources>
[debug] Classpath entry: <https://builds.apache.org/job/UIMA-Ruta%20Java%2011/ws/trunk/ruta-maven-plugin/target/project-simple-test/target/classes>
[debug] Writing descriptor to: <https://builds.apache.org/job/UIMA-Ruta%20Java%2011/ws/trunk/ruta-maven-plugin/target/project-simple-test/target/generated-sources/ruta/descriptor/SimpleEngine.xml>
[debug] Writing descriptor to: <https://builds.apache.org/job/UIMA-Ruta%20Java%2011/ws/trunk/ruta-maven-plugin/target/project-simple-test/target/generated-sources/ruta/descriptor/SimpleTypeSystem.xml>
[INFO] Tests run: 1, Failures: 0, Errors: 0, Skipped: 0, Time elapsed: 2.537 s - in org.apache.uima.ruta.maven.RutaGenerateDescriptorMojoTest
[INFO] 
[INFO] Results:
[INFO] 
[INFO] Tests run: 1, Failures: 0, Errors: 0, Skipped: 0
[INFO] 
[JENKINS] Recording test results
[INFO] 
[INFO] --- maven-antrun-plugin:1.8:run (dup-meta-jar-cleanup) @ ruta-maven-plugin ---
[INFO] Executing tasks

main:
[INFO] Executed tasks
[INFO] 
[INFO] --- maven-resources-plugin:3.1.0:copy-resources (copy customized bin LICENSE file)
@ ruta-maven-plugin ---
[INFO] Using 'UTF-8' encoding to copy filtered resources.
[INFO] skip non existing resourceDirectory <https://builds.apache.org/job/UIMA-Ruta%20Java%2011/ws/trunk/ruta-maven-plugin/src/main/readme_bin>
[INFO] 
[INFO] --- maven-jar-plugin:3.1.0:jar (default-jar) @ ruta-maven-plugin ---
[INFO] Building jar: <https://builds.apache.org/job/UIMA-Ruta%20Java%2011/ws/trunk/ruta-maven-plugin/target/ruta-maven-plugin-2.7.1-SNAPSHOT.jar>
[INFO] 
[INFO] --- maven-plugin-plugin:3.5.2:addPluginArtifactMetadata (default-addPluginArtifactMetadata)
@ ruta-maven-plugin ---
[INFO] 
[INFO] --- maven-site-plugin:3.7.1:attach-descriptor (attach-descriptor) @ ruta-maven-plugin
---
[INFO] Skipping because packaging 'maven-plugin' is not pom.
[INFO] 
[INFO] --- maven-invoker-plugin:2.0.0:install (integration-test) @ ruta-maven-plugin ---
[INFO] Installing <https://builds.apache.org/job/UIMA-Ruta%20Java%2011/ws/trunk/ruta-parent/pom.xml>
to <https://builds.apache.org/job/UIMA-Ruta%20Java%2011/ws/trunk/ruta-maven-plugin/target/local-repo/org/apache/uima/ruta-parent/2.7.1-SNAPSHOT/ruta-parent-2.7.1-SNAPSHOT.pom>
[INFO] Installing <https://builds.apache.org/job/UIMA-Ruta%20Java%2011/ws/trunk/ruta-basic-type/pom.xml>
to <https://builds.apache.org/job/UIMA-Ruta%20Java%2011/ws/trunk/ruta-maven-plugin/target/local-repo/org/apache/uima/ruta-basic-type/2.7.1-SNAPSHOT/ruta-basic-type-2.7.1-SNAPSHOT.pom>
[INFO] Installing <https://builds.apache.org/job/UIMA-Ruta%20Java%2011/ws/trunk/ruta-basic-type/target/ruta-basic-type-2.7.1-SNAPSHOT.jar>
to <https://builds.apache.org/job/UIMA-Ruta%20Java%2011/ws/trunk/ruta-maven-plugin/target/local-repo/org/apache/uima/ruta-basic-type/2.7.1-SNAPSHOT/ruta-basic-type-2.7.1-SNAPSHOT.jar>
[INFO] Installing <https://builds.apache.org/job/UIMA-Ruta%20Java%2011/ws/trunk/ruta-basic-type/pom.xml>
to <https://builds.apache.org/job/UIMA-Ruta%20Java%2011/ws/trunk/ruta-maven-plugin/target/local-repo/org/apache/uima/ruta-basic-type/2.7.1-SNAPSHOT/ruta-basic-type-2.7.1-SNAPSHOT.pom>
[INFO] Installing <https://builds.apache.org/job/UIMA-Ruta%20Java%2011/ws/trunk/ruta-typesystem/pom.xml>
to <https://builds.apache.org/job/UIMA-Ruta%20Java%2011/ws/trunk/ruta-maven-plugin/target/local-repo/org/apache/uima/ruta-typesystem/2.7.1-SNAPSHOT/ruta-typesystem-2.7.1-SNAPSHOT.pom>
[INFO] Installing <https://builds.apache.org/job/UIMA-Ruta%20Java%2011/ws/trunk/ruta-typesystem/target/ruta-typesystem-2.7.1-SNAPSHOT.jar>
to <https://builds.apache.org/job/UIMA-Ruta%20Java%2011/ws/trunk/ruta-maven-plugin/target/local-repo/org/apache/uima/ruta-typesystem/2.7.1-SNAPSHOT/ruta-typesystem-2.7.1-SNAPSHOT.jar>
[INFO] Installing <https://builds.apache.org/job/UIMA-Ruta%20Java%2011/ws/trunk/ruta-typesystem/pom.xml>
to <https://builds.apache.org/job/UIMA-Ruta%20Java%2011/ws/trunk/ruta-maven-plugin/target/local-repo/org/apache/uima/ruta-typesystem/2.7.1-SNAPSHOT/ruta-typesystem-2.7.1-SNAPSHOT.pom>
[INFO] Installing <https://builds.apache.org/job/UIMA-Ruta%20Java%2011/ws/trunk/ruta-core/pom.xml>
to <https://builds.apache.org/job/UIMA-Ruta%20Java%2011/ws/trunk/ruta-maven-plugin/target/local-repo/org/apache/uima/ruta-core/2.7.1-SNAPSHOT/ruta-core-2.7.1-SNAPSHOT.pom>
[INFO] Installing <https://builds.apache.org/job/UIMA-Ruta%20Java%2011/ws/trunk/ruta-core/target/ruta-core-2.7.1-SNAPSHOT.jar>
to <https://builds.apache.org/job/UIMA-Ruta%20Java%2011/ws/trunk/ruta-maven-plugin/target/local-repo/org/apache/uima/ruta-core/2.7.1-SNAPSHOT/ruta-core-2.7.1-SNAPSHOT.jar>
[INFO] Installing <https://builds.apache.org/job/UIMA-Ruta%20Java%2011/ws/trunk/ruta-core/pom.xml>
to <https://builds.apache.org/job/UIMA-Ruta%20Java%2011/ws/trunk/ruta-maven-plugin/target/local-repo/org/apache/uima/ruta-core/2.7.1-SNAPSHOT/ruta-core-2.7.1-SNAPSHOT.pom>
[INFO] Installing <https://builds.apache.org/job/UIMA-Ruta%20Java%2011/ws/trunk/ruta-core-ext/pom.xml>
to <https://builds.apache.org/job/UIMA-Ruta%20Java%2011/ws/trunk/ruta-maven-plugin/target/local-repo/org/apache/uima/ruta-core-ext/2.7.1-SNAPSHOT/ruta-core-ext-2.7.1-SNAPSHOT.pom>
[INFO] Installing <https://builds.apache.org/job/UIMA-Ruta%20Java%2011/ws/trunk/ruta-core-ext/target/ruta-core-ext-2.7.1-SNAPSHOT.jar>
to <https://builds.apache.org/job/UIMA-Ruta%20Java%2011/ws/trunk/ruta-maven-plugin/target/local-repo/org/apache/uima/ruta-core-ext/2.7.1-SNAPSHOT/ruta-core-ext-2.7.1-SNAPSHOT.jar>
[INFO] Installing <https://builds.apache.org/job/UIMA-Ruta%20Java%2011/ws/trunk/ruta-core-ext/pom.xml>
to <https://builds.apache.org/job/UIMA-Ruta%20Java%2011/ws/trunk/ruta-maven-plugin/target/local-repo/org/apache/uima/ruta-core-ext/2.7.1-SNAPSHOT/ruta-core-ext-2.7.1-SNAPSHOT.pom>
[INFO] Installing <https://builds.apache.org/job/UIMA-Ruta%20Java%2011/ws/trunk/ruta-ep-parent/pom.xml>
to <https://builds.apache.org/job/UIMA-Ruta%20Java%2011/ws/trunk/ruta-maven-plugin/target/local-repo/org/apache/uima/ruta-ep-parent/2.7.1-SNAPSHOT/ruta-ep-parent-2.7.1-SNAPSHOT.pom>
[INFO] Installing <https://builds.apache.org/job/UIMA-Ruta%20Java%2011/ws/trunk/ruta-ep-engine/pom.xml>
to <https://builds.apache.org/job/UIMA-Ruta%20Java%2011/ws/trunk/ruta-maven-plugin/target/local-repo/org/apache/uima/ruta-ep-engine/2.7.1-SNAPSHOT/ruta-ep-engine-2.7.1-SNAPSHOT.pom>
[INFO] Installing <https://builds.apache.org/job/UIMA-Ruta%20Java%2011/ws/trunk/ruta-ep-engine/target/org.apache.uima.ruta.engine_2.7.1.SNAPSHOT.jar>
to <https://builds.apache.org/job/UIMA-Ruta%20Java%2011/ws/trunk/ruta-maven-plugin/target/local-repo/org/apache/uima/ruta-ep-engine/2.7.1-SNAPSHOT/ruta-ep-engine-2.7.1-SNAPSHOT.jar>
[INFO] Installing <https://builds.apache.org/job/UIMA-Ruta%20Java%2011/ws/trunk/ruta-ep-engine/pom.xml>
to <https://builds.apache.org/job/UIMA-Ruta%20Java%2011/ws/trunk/ruta-maven-plugin/target/local-repo/org/apache/uima/ruta-ep-engine/2.7.1-SNAPSHOT/ruta-ep-engine-2.7.1-SNAPSHOT.pom>
[INFO] Installing <https://builds.apache.org/job/UIMA-Ruta%20Java%2011/ws/trunk/ruta-ep-ide/pom.xml>
to <https://builds.apache.org/job/UIMA-Ruta%20Java%2011/ws/trunk/ruta-maven-plugin/target/local-repo/org/apache/uima/ruta-ep-ide/2.7.1-SNAPSHOT/ruta-ep-ide-2.7.1-SNAPSHOT.pom>
[INFO] Installing <https://builds.apache.org/job/UIMA-Ruta%20Java%2011/ws/trunk/ruta-ep-ide/target/org.apache.uima.ruta.ide_2.7.1.SNAPSHOT.jar>
to <https://builds.apache.org/job/UIMA-Ruta%20Java%2011/ws/trunk/ruta-maven-plugin/target/local-repo/org/apache/uima/ruta-ep-ide/2.7.1-SNAPSHOT/ruta-ep-ide-2.7.1-SNAPSHOT.jar>
[INFO] Installing <https://builds.apache.org/job/UIMA-Ruta%20Java%2011/ws/trunk/ruta-ep-ide/pom.xml>
to <https://builds.apache.org/job/UIMA-Ruta%20Java%2011/ws/trunk/ruta-maven-plugin/target/local-repo/org/apache/uima/ruta-ep-ide/2.7.1-SNAPSHOT/ruta-ep-ide-2.7.1-SNAPSHOT.pom>
[INFO] Installing <https://builds.apache.org/job/UIMA-Ruta%20Java%2011/ws/trunk/ruta-ep-ide-ui/pom.xml>
to <https://builds.apache.org/job/UIMA-Ruta%20Java%2011/ws/trunk/ruta-maven-plugin/target/local-repo/org/apache/uima/ruta-ep-ide-ui/2.7.1-SNAPSHOT/ruta-ep-ide-ui-2.7.1-SNAPSHOT.pom>
[INFO] Installing <https://builds.apache.org/job/UIMA-Ruta%20Java%2011/ws/trunk/ruta-ep-ide-ui/target/org.apache.uima.ruta.ide.ui_2.7.1.SNAPSHOT.jar>
to <https://builds.apache.org/job/UIMA-Ruta%20Java%2011/ws/trunk/ruta-maven-plugin/target/local-repo/org/apache/uima/ruta-ep-ide-ui/2.7.1-SNAPSHOT/ruta-ep-ide-ui-2.7.1-SNAPSHOT.jar>
[INFO] Installing <https://builds.apache.org/job/UIMA-Ruta%20Java%2011/ws/trunk/ruta-ep-ide-ui/pom.xml>
to <https://builds.apache.org/job/UIMA-Ruta%20Java%2011/ws/trunk/ruta-maven-plugin/target/local-repo/org/apache/uima/ruta-ep-ide-ui/2.7.1-SNAPSHOT/ruta-ep-ide-ui-2.7.1-SNAPSHOT.pom>
[INFO] Installing <https://builds.apache.org/job/UIMA-Ruta%20Java%2011/ws/trunk/ruta-ep-caseditor/pom.xml>
to <https://builds.apache.org/job/UIMA-Ruta%20Java%2011/ws/trunk/ruta-maven-plugin/target/local-repo/org/apache/uima/ruta-ep-caseditor/2.7.1-SNAPSHOT/ruta-ep-caseditor-2.7.1-SNAPSHOT.pom>
[INFO] Installing <https://builds.apache.org/job/UIMA-Ruta%20Java%2011/ws/trunk/ruta-ep-caseditor/target/org.apache.uima.ruta.caseditor_2.7.1.SNAPSHOT.jar>
to <https://builds.apache.org/job/UIMA-Ruta%20Java%2011/ws/trunk/ruta-maven-plugin/target/local-repo/org/apache/uima/ruta-ep-caseditor/2.7.1-SNAPSHOT/ruta-ep-caseditor-2.7.1-SNAPSHOT.jar>
[INFO] Installing <https://builds.apache.org/job/UIMA-Ruta%20Java%2011/ws/trunk/ruta-ep-caseditor/pom.xml>
to <https://builds.apache.org/job/UIMA-Ruta%20Java%2011/ws/trunk/ruta-maven-plugin/target/local-repo/org/apache/uima/ruta-ep-caseditor/2.7.1-SNAPSHOT/ruta-ep-caseditor-2.7.1-SNAPSHOT.pom>
[INFO] Installing <https://builds.apache.org/job/UIMA-Ruta%20Java%2011/ws/trunk/ruta-ep-addons/pom.xml>
to <https://builds.apache.org/job/UIMA-Ruta%20Java%2011/ws/trunk/ruta-maven-plugin/target/local-repo/org/apache/uima/ruta-ep-addons/2.7.1-SNAPSHOT/ruta-ep-addons-2.7.1-SNAPSHOT.pom>
[INFO] Installing <https://builds.apache.org/job/UIMA-Ruta%20Java%2011/ws/trunk/ruta-ep-addons/target/org.apache.uima.ruta.addons_2.7.1.SNAPSHOT.jar>
to <https://builds.apache.org/job/UIMA-Ruta%20Java%2011/ws/trunk/ruta-maven-plugin/target/local-repo/org/apache/uima/ruta-ep-addons/2.7.1-SNAPSHOT/ruta-ep-addons-2.7.1-SNAPSHOT.jar>
[INFO] Installing <https://builds.apache.org/job/UIMA-Ruta%20Java%2011/ws/trunk/ruta-ep-addons/pom.xml>
to <https://builds.apache.org/job/UIMA-Ruta%20Java%2011/ws/trunk/ruta-maven-plugin/target/local-repo/org/apache/uima/ruta-ep-addons/2.7.1-SNAPSHOT/ruta-ep-addons-2.7.1-SNAPSHOT.pom>
[INFO] Installing <https://builds.apache.org/job/UIMA-Ruta%20Java%2011/ws/trunk/ruta-ep-textruler/pom.xml>
to <https://builds.apache.org/job/UIMA-Ruta%20Java%2011/ws/trunk/ruta-maven-plugin/target/local-repo/org/apache/uima/ruta-ep-textruler/2.7.1-SNAPSHOT/ruta-ep-textruler-2.7.1-SNAPSHOT.pom>
[INFO] Installing <https://builds.apache.org/job/UIMA-Ruta%20Java%2011/ws/trunk/ruta-ep-textruler/target/org.apache.uima.ruta.textruler_2.7.1.SNAPSHOT.jar>
to <https://builds.apache.org/job/UIMA-Ruta%20Java%2011/ws/trunk/ruta-maven-plugin/target/local-repo/org/apache/uima/ruta-ep-textruler/2.7.1-SNAPSHOT/ruta-ep-textruler-2.7.1-SNAPSHOT.jar>
[INFO] Installing <https://builds.apache.org/job/UIMA-Ruta%20Java%2011/ws/trunk/ruta-ep-textruler/pom.xml>
to <https://builds.apache.org/job/UIMA-Ruta%20Java%2011/ws/trunk/ruta-maven-plugin/target/local-repo/org/apache/uima/ruta-ep-textruler/2.7.1-SNAPSHOT/ruta-ep-textruler-2.7.1-SNAPSHOT.pom>
[INFO] Installing <https://builds.apache.org/job/UIMA-Ruta%20Java%2011/ws/trunk/ruta-ep-core-ext/pom.xml>
to <https://builds.apache.org/job/UIMA-Ruta%20Java%2011/ws/trunk/ruta-maven-plugin/target/local-repo/org/apache/uima/ruta-ep-core-ext/2.7.1-SNAPSHOT/ruta-ep-core-ext-2.7.1-SNAPSHOT.pom>
[INFO] Installing <https://builds.apache.org/job/UIMA-Ruta%20Java%2011/ws/trunk/ruta-ep-core-ext/target/org.apache.uima.ruta.core.ext_2.7.1.SNAPSHOT.jar>
to <https://builds.apache.org/job/UIMA-Ruta%20Java%2011/ws/trunk/ruta-maven-plugin/target/local-repo/org/apache/uima/ruta-ep-core-ext/2.7.1-SNAPSHOT/ruta-ep-core-ext-2.7.1-SNAPSHOT.jar>
[INFO] Installing <https://builds.apache.org/job/UIMA-Ruta%20Java%2011/ws/trunk/ruta-ep-core-ext/pom.xml>
to <https://builds.apache.org/job/UIMA-Ruta%20Java%2011/ws/trunk/ruta-maven-plugin/target/local-repo/org/apache/uima/ruta-ep-core-ext/2.7.1-SNAPSHOT/ruta-ep-core-ext-2.7.1-SNAPSHOT.pom>
[INFO] Installing <https://builds.apache.org/job/UIMA-Ruta%20Java%2011/ws/trunk/ruta-maven-plugin/pom.xml>
to <https://builds.apache.org/job/UIMA-Ruta%20Java%2011/ws/trunk/ruta-maven-plugin/target/local-repo/org/apache/uima/ruta-maven-plugin/2.7.1-SNAPSHOT/ruta-maven-plugin-2.7.1-SNAPSHOT.pom>
[INFO] Installing <https://builds.apache.org/job/UIMA-Ruta%20Java%2011/ws/trunk/ruta-maven-plugin/target/ruta-maven-plugin-2.7.1-SNAPSHOT.jar>
to <https://builds.apache.org/job/UIMA-Ruta%20Java%2011/ws/trunk/ruta-maven-plugin/target/local-repo/org/apache/uima/ruta-maven-plugin/2.7.1-SNAPSHOT/ruta-maven-plugin-2.7.1-SNAPSHOT.jar>
[INFO] 
[INFO] --- maven-invoker-plugin:2.0.0:run (integration-test) @ ruta-maven-plugin ---
[INFO] Building: importByName/pom.xml
[INFO] ..SUCCESS (16.0 s)
[INFO] Building: multimodule/pom.xml
[INFO] ..FAILED (7.1 s)
[INFO]   The build exited with code 1. See <https://builds.apache.org/job/UIMA-Ruta%20Java%2011/ws/trunk/ruta-maven-plugin/target/it/multimodule/build.log>
for details.
[INFO] Building: wordlists/pom.xml
[INFO] ..SUCCESS (11.6 s)
[INFO] Building: conflictingShortName/pom.xml
[INFO] ..SUCCESS (11.7 s)
[INFO] -------------------------------------------------
[INFO] Build Summary:
[INFO]   Passed: 3, Failed: 1, Errors: 0, Skipped: 0
[INFO] -------------------------------------------------
[ERROR] The following builds failed:
[ERROR] *  multimodule/pom.xml
[INFO] -------------------------------------------------
[INFO] ------------------------------------------------------------------------
[INFO] Reactor Summary:
[INFO] 
[INFO] Apache UIMA Ruta: ruta-parent ...................... SUCCESS [02:32 min]
[INFO] Apache UIMA Ruta: ruta-basic-type .................. SUCCESS [ 40.862 s]
[INFO] Apache UIMA Ruta: ruta-typesystem .................. SUCCESS [ 34.026 s]
[INFO] Apache UIMA Ruta: ruta-core ........................ SUCCESS [02:37 min]
[INFO] Apache UIMA Ruta: ruta-core-ext .................... SUCCESS [ 44.924 s]
[INFO] Apache UIMA Ruta: ruta-ep-parent ................... SUCCESS [04:59 min]
[INFO] Apache UIMA Ruta Eclipse: ruta-ep-engine ........... SUCCESS [ 29.973 s]
[INFO] Apache UIMA Ruta Eclipse: ruta-ep-ide .............. SUCCESS [08:01 min]
[INFO] Apache UIMA Ruta Eclipse: ruta-ep-ide-ui ........... SUCCESS [09:37 min]
[INFO] Apache UIMA Ruta Eclipse: ruta-ep-caseditor ........ SUCCESS [05:35 min]
[INFO] Apache UIMA Ruta Eclipse: ruta-ep-addons ........... SUCCESS [04:58 min]
[INFO] Apache UIMA Ruta Eclipse: ruta-ep-textruler ........ SUCCESS [06:08 min]
[INFO] Apache UIMA Ruta Eclipse: ruta-ep-core-ext ......... SUCCESS [04:50 min]
[INFO] Apache UIMA Maven: ruta-maven-plugin ............... FAILURE [01:11 min]
[INFO] Apache UIMA Maven: ruta-maven-archetype ............ SKIPPED
[INFO] Apache UIMA Ruta Documentation ..................... SKIPPED
[INFO] Apache UIMA Ruta Eclipse: ruta-eclipse-feature ..... SKIPPED
[INFO] Apache UIMA Ruta: ruta-ep-example-extensions ....... SKIPPED
[INFO] Apache UIMA Ruta: ruta-maven-example ............... SKIPPED
[INFO] Apache UIMA Ruta: ruta ............................. SKIPPED
[INFO] ------------------------------------------------------------------------
[INFO] BUILD FAILURE
[INFO] ------------------------------------------------------------------------
[INFO] Total time: 54:29 min
[INFO] Finished at: 2019-10-22T16:53:27+00:00
[INFO] Final Memory: 211M/727M
[INFO] ------------------------------------------------------------------------
Waiting for Jenkins to finish collecting data
[ERROR] Failed to execute goal org.apache.maven.plugins:maven-invoker-plugin:2.0.0:run (integration-test)
on project ruta-maven-plugin: 1 build failed. See console output above for details. ->
[Help 1]
[ERROR] 
[ERROR] To see the full stack trace of the errors, re-run Maven with the -e switch.
[ERROR] Re-run Maven using the -X switch to enable full debug logging.
[ERROR] 
[ERROR] For more information about the errors and possible solutions, please read the following
articles:
[ERROR] [Help 1] http://cwiki.apache.org/confluence/display/MAVEN/MojoFailureException
[ERROR] 
[ERROR] After correcting the problems, you can resume the build with the command
[ERROR]   mvn <goals> -rf :ruta-maven-plugin
[JENKINS] Archiving <https://builds.apache.org/job/UIMA-Ruta%20Java%2011/ws/trunk/ruta-ep-parent/pom.xml>
to org.apache.uima/ruta-ep-parent/2.7.1-SNAPSHOT/ruta-ep-parent-2.7.1-SNAPSHOT.pom
[JENKINS] Archiving <https://builds.apache.org/job/UIMA-Ruta%20Java%2011/ws/trunk/ruta-core-ext/pom.xml>
to org.apache.uima/ruta-core-ext/2.7.1-SNAPSHOT/ruta-core-ext-2.7.1-SNAPSHOT.pom
[JENKINS] Archiving <https://builds.apache.org/job/UIMA-Ruta%20Java%2011/ws/trunk/ruta-core-ext/target/ruta-core-ext-2.7.1-SNAPSHOT.jar>
to org.apache.uima/ruta-core-ext/2.7.1-SNAPSHOT/ruta-core-ext-2.7.1-SNAPSHOT.jar
[JENKINS] Archiving <https://builds.apache.org/job/UIMA-Ruta%20Java%2011/ws/trunk/ruta-ep-ide/pom.xml>
to org.apache.uima/ruta-ep-ide/2.7.1-SNAPSHOT/ruta-ep-ide-2.7.1-SNAPSHOT.pom
[JENKINS] Archiving <https://builds.apache.org/job/UIMA-Ruta%20Java%2011/ws/trunk/ruta-ep-ide/target/org.apache.uima.ruta.ide_2.7.1.SNAPSHOT.jar>
to org.apache.uima/ruta-ep-ide/2.7.1-SNAPSHOT/ruta-ep-ide-2.7.1-SNAPSHOT.jar
[Fast Archiver] Compressed 438.35 KB of artifacts by 29.2% relative to #15
[JENKINS] Archiving <https://builds.apache.org/job/UIMA-Ruta%20Java%2011/ws/trunk/ruta-ep-textruler/pom.xml>
to org.apache.uima/ruta-ep-textruler/2.7.1-SNAPSHOT/ruta-ep-textruler-2.7.1-SNAPSHOT.pom
[JENKINS] Archiving <https://builds.apache.org/job/UIMA-Ruta%20Java%2011/ws/trunk/ruta-ep-textruler/target/org.apache.uima.ruta.textruler_2.7.1.SNAPSHOT.jar>
to org.apache.uima/ruta-ep-textruler/2.7.1-SNAPSHOT/ruta-ep-textruler-2.7.1-SNAPSHOT.jar
[JENKINS] Archiving <https://builds.apache.org/job/UIMA-Ruta%20Java%2011/ws/trunk/ruta-ep-addons/pom.xml>
to org.apache.uima/ruta-ep-addons/2.7.1-SNAPSHOT/ruta-ep-addons-2.7.1-SNAPSHOT.pom
[JENKINS] Archiving <https://builds.apache.org/job/UIMA-Ruta%20Java%2011/ws/trunk/ruta-ep-addons/target/org.apache.uima.ruta.addons_2.7.1.SNAPSHOT.jar>
to org.apache.uima/ruta-ep-addons/2.7.1-SNAPSHOT/ruta-ep-addons-2.7.1-SNAPSHOT.jar
[JENKINS] Archiving <https://builds.apache.org/job/UIMA-Ruta%20Java%2011/ws/trunk/ruta-core/pom.xml>
to org.apache.uima/ruta-core/2.7.1-SNAPSHOT/ruta-core-2.7.1-SNAPSHOT.pom
[JENKINS] Archiving <https://builds.apache.org/job/UIMA-Ruta%20Java%2011/ws/trunk/ruta-core/target/ruta-core-2.7.1-SNAPSHOT.jar>
to org.apache.uima/ruta-core/2.7.1-SNAPSHOT/ruta-core-2.7.1-SNAPSHOT.jar
[Fast Archiver] Compressed 871.38 KB of artifacts by 14.7% relative to #15
[JENKINS] Archiving <https://builds.apache.org/job/UIMA-Ruta%20Java%2011/ws/trunk/ruta-eclipse-feature/pom.xml>
to org.apache.uima/ruta-eclipse-feature/2.7.1-SNAPSHOT/ruta-eclipse-feature-2.7.1-SNAPSHOT.pom
[Fast Archiver] No prior successful build to compare, so performing full copy of artifacts
[JENKINS] Archiving <https://builds.apache.org/job/UIMA-Ruta%20Java%2011/ws/trunk/example-projects/ruta-maven-example/pom.xml>
to org.apache.uima/ruta-maven-example/2.7.1-SNAPSHOT/ruta-maven-example-2.7.1-SNAPSHOT.pom
[Fast Archiver] No prior successful build to compare, so performing full copy of artifacts
[JENKINS] Archiving <https://builds.apache.org/job/UIMA-Ruta%20Java%2011/ws/trunk/ruta-ep-caseditor/pom.xml>
to org.apache.uima/ruta-ep-caseditor/2.7.1-SNAPSHOT/ruta-ep-caseditor-2.7.1-SNAPSHOT.pom
[JENKINS] Archiving <https://builds.apache.org/job/UIMA-Ruta%20Java%2011/ws/trunk/ruta-ep-caseditor/target/org.apache.uima.ruta.caseditor_2.7.1.SNAPSHOT.jar>
to org.apache.uima/ruta-ep-caseditor/2.7.1-SNAPSHOT/ruta-ep-caseditor-2.7.1-SNAPSHOT.jar
[JENKINS] Archiving <https://builds.apache.org/job/UIMA-Ruta%20Java%2011/ws/trunk/ruta-basic-type/pom.xml>
to org.apache.uima/ruta-basic-type/2.7.1-SNAPSHOT/ruta-basic-type-2.7.1-SNAPSHOT.pom
[JENKINS] Archiving <https://builds.apache.org/job/UIMA-Ruta%20Java%2011/ws/trunk/ruta-basic-type/target/ruta-basic-type-2.7.1-SNAPSHOT.jar>
to org.apache.uima/ruta-basic-type/2.7.1-SNAPSHOT/ruta-basic-type-2.7.1-SNAPSHOT.jar
[JENKINS] Archiving <https://builds.apache.org/job/UIMA-Ruta%20Java%2011/ws/trunk/ruta-ep-core-ext/pom.xml>
to org.apache.uima/ruta-ep-core-ext/2.7.1-SNAPSHOT/ruta-ep-core-ext-2.7.1-SNAPSHOT.pom
[JENKINS] Archiving <https://builds.apache.org/job/UIMA-Ruta%20Java%2011/ws/trunk/ruta-ep-core-ext/target/org.apache.uima.ruta.core.ext_2.7.1.SNAPSHOT.jar>
to org.apache.uima/ruta-ep-core-ext/2.7.1-SNAPSHOT/ruta-ep-core-ext-2.7.1-SNAPSHOT.jar
[JENKINS] Archiving <https://builds.apache.org/job/UIMA-Ruta%20Java%2011/ws/trunk/ruta-typesystem/pom.xml>
to org.apache.uima/ruta-typesystem/2.7.1-SNAPSHOT/ruta-typesystem-2.7.1-SNAPSHOT.pom
[JENKINS] Archiving <https://builds.apache.org/job/UIMA-Ruta%20Java%2011/ws/trunk/ruta-typesystem/target/ruta-typesystem-2.7.1-SNAPSHOT.jar>
to org.apache.uima/ruta-typesystem/2.7.1-SNAPSHOT/ruta-typesystem-2.7.1-SNAPSHOT.jar
[JENKINS] Archiving <https://builds.apache.org/job/UIMA-Ruta%20Java%2011/ws/trunk/ruta-maven-archetype/pom.xml>
to org.apache.uima/ruta-maven-archetype/2.7.1-SNAPSHOT/ruta-maven-archetype-2.7.1-SNAPSHOT.pom
[Fast Archiver] No prior successful build to compare, so performing full copy of artifacts
[JENKINS] Archiving <https://builds.apache.org/job/UIMA-Ruta%20Java%2011/ws/trunk/ruta-ep-engine/pom.xml>
to org.apache.uima/ruta-ep-engine/2.7.1-SNAPSHOT/ruta-ep-engine-2.7.1-SNAPSHOT.pom
[JENKINS] Archiving <https://builds.apache.org/job/UIMA-Ruta%20Java%2011/ws/trunk/ruta-ep-engine/target/org.apache.uima.ruta.engine_2.7.1.SNAPSHOT.jar>
to org.apache.uima/ruta-ep-engine/2.7.1-SNAPSHOT/ruta-ep-engine-2.7.1-SNAPSHOT.jar
[Fast Archiver] Compressed 7.31 MB of artifacts by 77.4% relative to #15
[JENKINS] Archiving <https://builds.apache.org/job/UIMA-Ruta%20Java%2011/ws/trunk/example-projects/ruta-ep-example-extensions/pom.xml>
to org.apache.uima/ruta-ep-example-extensions/2.7.1-SNAPSHOT/ruta-ep-example-extensions-2.7.1-SNAPSHOT.pom
[Fast Archiver] No prior successful build to compare, so performing full copy of artifacts
[JENKINS] Archiving <https://builds.apache.org/job/UIMA-Ruta%20Java%2011/ws/trunk/pom.xml>
to org.apache.uima/ruta/2.7.1-SNAPSHOT/ruta-2.7.1-SNAPSHOT.pom
[Fast Archiver] No prior successful build to compare, so performing full copy of artifacts
[JENKINS] Archiving <https://builds.apache.org/job/UIMA-Ruta%20Java%2011/ws/trunk/ruta-parent/pom.xml>
to org.apache.uima/ruta-parent/2.7.1-SNAPSHOT/ruta-parent-2.7.1-SNAPSHOT.pom
[JENKINS] Archiving <https://builds.apache.org/job/UIMA-Ruta%20Java%2011/ws/trunk/ruta-ep-ide-ui/pom.xml>
to org.apache.uima/ruta-ep-ide-ui/2.7.1-SNAPSHOT/ruta-ep-ide-ui-2.7.1-SNAPSHOT.pom
[JENKINS] Archiving <https://builds.apache.org/job/UIMA-Ruta%20Java%2011/ws/trunk/ruta-ep-ide-ui/target/org.apache.uima.ruta.ide.ui_2.7.1.SNAPSHOT.jar>
to org.apache.uima/ruta-ep-ide-ui/2.7.1-SNAPSHOT/ruta-ep-ide-ui-2.7.1-SNAPSHOT.jar
[JENKINS] Archiving <https://builds.apache.org/job/UIMA-Ruta%20Java%2011/ws/trunk/ruta-maven-plugin/pom.xml>
to org.apache.uima/ruta-maven-plugin/2.7.1-SNAPSHOT/ruta-maven-plugin-2.7.1-SNAPSHOT.pom
[JENKINS] Archiving <https://builds.apache.org/job/UIMA-Ruta%20Java%2011/ws/trunk/ruta-maven-plugin/target/ruta-maven-plugin-2.7.1-SNAPSHOT.jar>
to org.apache.uima/ruta-maven-plugin/2.7.1-SNAPSHOT/ruta-maven-plugin-2.7.1-SNAPSHOT.jar
[Fast Archiver] No prior successful build to compare, so performing full copy of artifacts
[JENKINS] Archiving <https://builds.apache.org/job/UIMA-Ruta%20Java%2011/ws/trunk/ruta-docbook/pom.xml>
to org.apache.uima/ruta-docbook/2.7.1-SNAPSHOT/ruta-docbook-2.7.1-SNAPSHOT.pom
[Fast Archiver] No prior successful build to compare, so performing full copy of artifacts
No mail will be sent out, as 'UIMA-Ruta Java 11 » Apache UIMA Ruta: ruta-ep-parent #16'
does not have a result yet. Please make sure you set a proper result in case of pipeline/build
scripts.
No mail will be sent out, as 'UIMA-Ruta Java 11 » Apache UIMA Ruta: ruta-core-ext #16'
does not have a result yet. Please make sure you set a proper result in case of pipeline/build
scripts.
No mail will be sent out, as 'UIMA-Ruta Java 11 » Apache UIMA Ruta Eclipse: ruta-ep-ide
#16' does not have a result yet. Please make sure you set a proper result in case of pipeline/build
scripts.
No mail will be sent out, as 'UIMA-Ruta Java 11 » Apache UIMA Ruta Eclipse: ruta-ep-textruler
#16' does not have a result yet. Please make sure you set a proper result in case of pipeline/build
scripts.
No mail will be sent out, as 'UIMA-Ruta Java 11 » Apache UIMA Ruta Eclipse: ruta-ep-addons
#16' does not have a result yet. Please make sure you set a proper result in case of pipeline/build
scripts.
No mail will be sent out, as 'UIMA-Ruta Java 11 » Apache UIMA Ruta: ruta-core #16' does
not have a result yet. Please make sure you set a proper result in case of pipeline/build
scripts.
No mail will be sent out, as 'UIMA-Ruta Java 11 » Apache UIMA Ruta Eclipse: ruta-eclipse-feature
#16' does not have a result yet. Please make sure you set a proper result in case of pipeline/build
scripts.
No mail will be sent out, as 'UIMA-Ruta Java 11 » Apache UIMA Ruta: ruta-maven-example
#16' does not have a result yet. Please make sure you set a proper result in case of pipeline/build
scripts.
No mail will be sent out, as 'UIMA-Ruta Java 11 » Apache UIMA Ruta Eclipse: ruta-ep-caseditor
#16' does not have a result yet. Please make sure you set a proper result in case of pipeline/build
scripts.
No mail will be sent out, as 'UIMA-Ruta Java 11 » Apache UIMA Ruta: ruta-basic-type #16'
does not have a result yet. Please make sure you set a proper result in case of pipeline/build
scripts.
No mail will be sent out, as 'UIMA-Ruta Java 11 » Apache UIMA Ruta Eclipse: ruta-ep-core-ext
#16' does not have a result yet. Please make sure you set a proper result in case of pipeline/build
scripts.
No mail will be sent out, as 'UIMA-Ruta Java 11 » Apache UIMA Ruta: ruta-typesystem #16'
does not have a result yet. Please make sure you set a proper result in case of pipeline/build
scripts.
No mail will be sent out, as 'UIMA-Ruta Java 11 » Apache UIMA Maven: ruta-maven-archetype
#16' does not have a result yet. Please make sure you set a proper result in case of pipeline/build
scripts.
No mail will be sent out, as 'UIMA-Ruta Java 11 » Apache UIMA Ruta Eclipse: ruta-ep-engine
#16' does not have a result yet. Please make sure you set a proper result in case of pipeline/build
scripts.
No mail will be sent out, as 'UIMA-Ruta Java 11 » Apache UIMA Ruta: ruta-ep-example-extensions
#16' does not have a result yet. Please make sure you set a proper result in case of pipeline/build
scripts.
No mail will be sent out, as 'UIMA-Ruta Java 11 » Apache UIMA Ruta: ruta #16' does not
have a result yet. Please make sure you set a proper result in case of pipeline/build scripts.
No mail will be sent out, as 'UIMA-Ruta Java 11 » Apache UIMA Ruta: ruta-parent #16' does
not have a result yet. Please make sure you set a proper result in case of pipeline/build
scripts.
No mail will be sent out, as 'UIMA-Ruta Java 11 » Apache UIMA Ruta Eclipse: ruta-ep-ide-ui
#16' does not have a result yet. Please make sure you set a proper result in case of pipeline/build
scripts.
Sending e-mails to: dev@uima.apache.org
No mail will be sent out, as 'UIMA-Ruta Java 11 » Apache UIMA Ruta Documentation #16' does
not have a result yet. Please make sure you set a proper result in case of pipeline/build
scripts.
channel stopped
[WARNINGS] Skipping publisher since build result is FAILURE
[Cobertura] Publishing Cobertura coverage report...


Mime
View raw message