unomi-commits mailing list archives

Site index · List index
Message view « Date » · « Thread »
Top « Date » · « Thread »
From Apache Jenkins Server <jenk...@builds.apache.org>
Subject Build failed in Jenkins: unomi-master #10
Date Fri, 01 Apr 2016 13:07:49 GMT
See <https://builds.apache.org/job/unomi-master/10/changes>

Changes:

[draier] UNOMI-20 : Fixed range values

------------------------------------------
[...truncated 10179 lines...]
2016-04-01 12:51:21,632 | INFO  | FelixStartLevel  | FeaturesServiceImpl              | 20
- org.apache.karaf.features.core - 3.0.2 | Installing feature region 3.0.2
2016-04-01 12:51:21,730 | INFO  | FelixStartLevel  | FeaturesServiceImpl              | 20
- org.apache.karaf.features.core - 3.0.2 | Installing feature unomi-kar 1.0.1-incubating-SNAPSHOT
2016-04-01 12:51:21,732 | INFO  | FelixStartLevel  | FeaturesServiceImpl              | 20
- org.apache.karaf.features.core - 3.0.2 | Installing feature war 3.0.2
2016-04-01 12:51:21,732 | INFO  | FelixStartLevel  | FeaturesServiceImpl              | 20
- org.apache.karaf.features.core - 3.0.2 | Installing feature http 3.0.2
2016-04-01 12:51:21,733 | INFO  | FelixStartLevel  | FeaturesServiceImpl              | 20
- org.apache.karaf.features.core - 3.0.2 | Installing feature pax-http 3.1.2
2016-04-01 12:51:21,734 | INFO  | FelixStartLevel  | FeaturesServiceImpl              | 20
- org.apache.karaf.features.core - 3.0.2 | Installing feature pax-jetty 8.1.15.v20140411
2016-04-01 12:51:21,852 | INFO  | FelixStartLevel  | FeaturesServiceImpl              | 20
- org.apache.karaf.features.core - 3.0.2 | Installing feature pax-war 3.1.2
2016-04-01 12:51:21,852 | INFO  | FelixStartLevel  | FeaturesServiceImpl              | 20
- org.apache.karaf.features.core - 3.0.2 | Installing feature pax-http-whiteboard 3.1.2
2016-04-01 12:51:21,951 | INFO  | FelixStartLevel  | FeaturesServiceImpl              | 20
- org.apache.karaf.features.core - 3.0.2 | Installing feature cxf 2.7.11
2016-04-01 12:51:21,952 | INFO  | FelixStartLevel  | FeaturesServiceImpl              | 20
- org.apache.karaf.features.core - 3.0.2 | Installing feature spring 3.2.11.RELEASE_1
2016-04-01 12:51:21,989 | INFO  | FelixStartLevel  | FeaturesServiceImpl              | 20
- org.apache.karaf.features.core - 3.0.2 | Installing feature spring-dm 1.2.1
2016-04-01 12:51:22,019 | INFO  | FelixStartLevel  | FeaturesServiceImpl              | 20
- org.apache.karaf.features.core - 3.0.2 | Installing feature cxf-core 2.7.11
2016-04-01 12:51:22,020 | INFO  | FelixStartLevel  | FeaturesServiceImpl              | 20
- org.apache.karaf.features.core - 3.0.2 | Installing feature cxf-specs 2.7.11
2016-04-01 12:51:22,114 | INFO  | FelixStartLevel  | FeaturesServiceImpl              | 20
- org.apache.karaf.features.core - 3.0.2 | Installing feature cxf-jaxws 2.7.11
2016-04-01 12:51:22,115 | INFO  | FelixStartLevel  | FeaturesServiceImpl              | 20
- org.apache.karaf.features.core - 3.0.2 | Installing feature cxf-databinding-jaxb 2.7.11
2016-04-01 12:51:22,120 | INFO  | FelixStartLevel  | FeaturesServiceImpl              | 20
- org.apache.karaf.features.core - 3.0.2 | Installing feature cxf-bindings-soap 2.7.11
2016-04-01 12:51:22,130 | INFO  | FelixStartLevel  | FeaturesServiceImpl              | 20
- org.apache.karaf.features.core - 3.0.2 | Installing feature cxf-http 2.7.11
2016-04-01 12:51:22,131 | INFO  | FelixStartLevel  | FeaturesServiceImpl              | 20
- org.apache.karaf.features.core - 3.0.2 | Installing feature http-whiteboard 3.0.2
2016-04-01 12:51:22,146 | INFO  | FelixStartLevel  | FeaturesServiceImpl              | 20
- org.apache.karaf.features.core - 3.0.2 | Installing feature cxf-jaxrs 2.7.11
2016-04-01 12:51:22,170 | INFO  | FelixStartLevel  | FeaturesServiceImpl              | 20
- org.apache.karaf.features.core - 3.0.2 | Installing feature cxf-databinding-aegis 2.7.11
2016-04-01 12:51:22,175 | INFO  | FelixStartLevel  | FeaturesServiceImpl              | 20
- org.apache.karaf.features.core - 3.0.2 | Installing feature cxf-databinding-xmlbeans 2.7.11
2016-04-01 12:51:22,186 | INFO  | FelixStartLevel  | FeaturesServiceImpl              | 20
- org.apache.karaf.features.core - 3.0.2 | Installing feature cxf-bindings-corba 2.7.11
2016-04-01 12:51:22,191 | INFO  | FelixStartLevel  | FeaturesServiceImpl              | 20
- org.apache.karaf.features.core - 3.0.2 | Installing feature cxf-bindings-coloc 2.7.11
2016-04-01 12:51:22,196 | INFO  | FelixStartLevel  | FeaturesServiceImpl              | 20
- org.apache.karaf.features.core - 3.0.2 | Installing feature cxf-bindings-object 2.7.11
2016-04-01 12:51:22,197 | INFO  | FelixStartLevel  | FeaturesServiceImpl              | 20
- org.apache.karaf.features.core - 3.0.2 | Installing feature cxf-transports-local 2.7.11
2016-04-01 12:51:22,207 | INFO  | FelixStartLevel  | FeaturesServiceImpl              | 20
- org.apache.karaf.features.core - 3.0.2 | Installing feature cxf-http-jetty 2.7.11
2016-04-01 12:51:22,208 | INFO  | FelixStartLevel  | FeaturesServiceImpl              | 20
- org.apache.karaf.features.core - 3.0.2 | Installing feature jetty 8.1.9.v20130131
2016-04-01 12:51:22,214 | INFO  | FelixStartLevel  | FeaturesServiceImpl              | 20
- org.apache.karaf.features.core - 3.0.2 | Installing feature cxf-transports-jms 2.7.11
2016-04-01 12:51:22,215 | INFO  | FelixStartLevel  | FeaturesServiceImpl              | 20
- org.apache.karaf.features.core - 3.0.2 | Installing feature spring-jms 3.2.11.RELEASE_1
2016-04-01 12:51:22,215 | INFO  | FelixStartLevel  | FeaturesServiceImpl              | 20
- org.apache.karaf.features.core - 3.0.2 | Installing feature spring-tx 3.2.11.RELEASE_1
2016-04-01 12:51:22,240 | INFO  | FelixStartLevel  | FeaturesServiceImpl              | 20
- org.apache.karaf.features.core - 3.0.2 | Installing feature cxf-transports-udp 2.7.11
2016-04-01 12:51:22,248 | INFO  | FelixStartLevel  | FeaturesServiceImpl              | 20
- org.apache.karaf.features.core - 3.0.2 | Installing feature cxf-xjc-runtime 2.7.11
2016-04-01 12:51:22,249 | INFO  | FelixStartLevel  | FeaturesServiceImpl              | 20
- org.apache.karaf.features.core - 3.0.2 | Installing feature cxf-jaxb 2.7.11
2016-04-01 12:51:22,268 | INFO  | FelixStartLevel  | FeaturesServiceImpl              | 20
- org.apache.karaf.features.core - 3.0.2 | Installing feature cxf-ws-security 2.7.11
2016-04-01 12:51:22,268 | INFO  | FelixStartLevel  | FeaturesServiceImpl              | 20
- org.apache.karaf.features.core - 3.0.2 | Installing feature cxf-ws-policy 2.7.11
2016-04-01 12:51:22,278 | INFO  | FelixStartLevel  | FeaturesServiceImpl              | 20
- org.apache.karaf.features.core - 3.0.2 | Installing feature wss4j 1.6.15
2016-04-01 12:51:22,344 | INFO  | FelixStartLevel  | FeaturesServiceImpl              | 20
- org.apache.karaf.features.core - 3.0.2 | Installing feature cxf-ws-addr 2.7.11
2016-04-01 12:51:22,368 | INFO  | FelixStartLevel  | FeaturesServiceImpl              | 20
- org.apache.karaf.features.core - 3.0.2 | Installing feature cxf-ws-rm 2.7.11
2016-04-01 12:51:22,378 | INFO  | FelixStartLevel  | FeaturesServiceImpl              | 20
- org.apache.karaf.features.core - 3.0.2 | Installing feature cxf-ws-mex 2.7.11
2016-04-01 12:51:22,384 | INFO  | FelixStartLevel  | FeaturesServiceImpl              | 20
- org.apache.karaf.features.core - 3.0.2 | Installing feature cxf-javascript 2.7.11
2016-04-01 12:51:22,390 | INFO  | FelixStartLevel  | FeaturesServiceImpl              | 20
- org.apache.karaf.features.core - 3.0.2 | Installing feature cxf-frontend-javascript 2.7.11
2016-04-01 12:51:22,400 | INFO  | FelixStartLevel  | FeaturesServiceImpl              | 20
- org.apache.karaf.features.core - 3.0.2 | Installing feature cxf-features-clustering 2.7.11
2016-04-01 12:51:22,412 | INFO  | FelixStartLevel  | FeaturesServiceImpl              | 20
- org.apache.karaf.features.core - 3.0.2 | Installing feature openwebbeans 1.2.6
2016-04-01 12:51:22,412 | INFO  | FelixStartLevel  | FeaturesServiceImpl              | 20
- org.apache.karaf.features.core - 3.0.2 | Installing feature pax-cdi-openwebbeans 0.8.0
2016-04-01 12:51:22,412 | INFO  | FelixStartLevel  | FeaturesServiceImpl              | 20
- org.apache.karaf.features.core - 3.0.2 | Installing feature pax-cdi 0.8.0
2016-04-01 12:51:22,413 | INFO  | FelixStartLevel  | FeaturesServiceImpl              | 20
- org.apache.karaf.features.core - 3.0.2 | Installing feature scr 3.0.2
2016-04-01 12:51:22,536 | INFO  | FelixStartLevel  | FeaturesServiceImpl              | 20
- org.apache.karaf.features.core - 3.0.2 | Installing feature pax-cdi-web-openwebbeans 0.8.0
2016-04-01 12:51:22,537 | INFO  | FelixStartLevel  | FeaturesServiceImpl              | 20
- org.apache.karaf.features.core - 3.0.2 | Installing feature pax-cdi-web 0.8.0
SUREFIRE-859: Java HotSpot(TM) 64-Bit Server VM warning: INFO: os::commit_memory(0x00000007cc900000,
529530880, 0) failed; error='Cannot allocate memory' (errno=12)
#
# There is insufficient memory for the Java Runtime Environment to continue.
# Native memory allocation (malloc) failed to allocate 529530880 bytes for committing reserved
memory.
# An error report file with more information is saved as:
# <https://builds.apache.org/job/unomi-master/ws/itests/hs_err_pid28101.log>

Results :

Tests run: 0, Failures: 0, Errors: 0, Skipped: 0

[JENKINS] Recording test results
[INFO] ------------------------------------------------------------------------
[INFO] Reactor Summary:
[INFO] 
[INFO] Apache Unomi :: Root Project ....................... SUCCESS [ 16.071 s]
[INFO] Apache Unomi :: Specification API .................. SUCCESS [ 18.252 s]
[INFO] Apache Unomi :: Persistence :: SPI (Service Provider Interface) SUCCESS [ 14.799 s]
[INFO] Apache Unomi :: Persistence :: ElasticSearch ....... SUCCESS [  5.214 s]
[INFO] Apache Unomi :: Persistence :: ElasticSearch :: Core SUCCESS [ 50.336 s]
[INFO] Apache Unomi :: Persistence :: ElasticSearch :: Plugins SUCCESS [  4.771 s]
[INFO] Apache Unomi :: Persistence :: ElasticSearch :: Plugins :: Security SUCCESS [ 18.710
s]
[INFO] Apache Unomi :: Core Services ...................... SUCCESS [ 24.019 s]
[INFO] Apache Unomi :: REST API ........................... SUCCESS [ 50.223 s]
[INFO] Apache Unomi :: Core Web Application ............... SUCCESS [ 21.001 s]
[INFO] Apache Unomi :: Plugins ............................ SUCCESS [  5.087 s]
[INFO] Apache Unomi :: Plugins :: Base Actions and Conditions SUCCESS [ 13.990 s]
[INFO] Apache Unomi :: Plugins :: Request reading actions . SUCCESS [ 17.776 s]
[INFO] Apache Unomi :: Plugins :: Mail notifications actions SUCCESS [  9.966 s]
[INFO] Apache Unomi :: Plugins :: Rules and Actions for optimization tests (A/B testing) SUCCESS
[ 10.208 s]
[INFO] Apache Unomi :: Plugins :: Hover event support ..... SUCCESS [ 11.735 s]
[INFO] Apache Unomi :: Plugins :: Conditions based on past events SUCCESS [ 10.246 s]
[INFO] Apache Unomi :: Plugins :: Conditions for events that need to be tracked SUCCESS [
15.687 s]
[INFO] Apache Unomi :: Extensions ......................... SUCCESS [  6.820 s]
[INFO] Apache Unomi :: Extensions :: Lists ................ SUCCESS [  4.834 s]
[INFO] Apache Unomi :: Extensions :: Lists :: Service ..... SUCCESS [  9.280 s]
[INFO] Apache Unomi :: Extensions :: Lists :: REST API .... SUCCESS [ 10.373 s]
[INFO] Apache Unomi :: Extensions :: Privacy .............. SUCCESS [  6.498 s]
[INFO] Apache Unomi :: Extensions :: Privacy :: Services .. SUCCESS [ 10.586 s]
[INFO] Apache Unomi :: Extensions :: Privacy :: REST API .. SUCCESS [ 12.671 s]
[INFO] Apache Unomi :: Extensions :: Geonames Database .... SUCCESS [  5.411 s]
[INFO] Apache Unomi :: Extensions :: Geonames Database :: Service SUCCESS [ 12.943 s]
[INFO] Apache Unomi :: Extensions :: Geonames Database :: REST API SUCCESS [  9.390 s]
[INFO] Apache Unomi :: Karaf KAR package .................. SUCCESS [ 44.687 s]
[INFO] Apache Unomi :: Samples ............................ SUCCESS [  5.120 s]
[INFO] Apache Unomi :: Samples :: Tweet Button plugin ..... SUCCESS [ 14.588 s]
[INFO] Apache Unomi :: Distribution Package ............... SUCCESS [02:16 min]
[INFO] Apache Unomi :: Integration Tests .................. FAILURE [ 35.693 s]
[INFO] Apache Unomi :: Performance Tests .................. SKIPPED
[INFO] ------------------------------------------------------------------------
[INFO] BUILD FAILURE
[INFO] ------------------------------------------------------------------------
[INFO] Total time: 12:15 min
[INFO] Finished at: 2016-04-01T12:52:04+00:00
[INFO] Final Memory: 164M/972M
[INFO] ------------------------------------------------------------------------
Waiting for Jenkins to finish collecting data
[ERROR] Failed to execute goal org.apache.maven.plugins:maven-surefire-plugin:2.18.1:test
(default-test) on project unomi-itests: Execution default-test of goal org.apache.maven.plugins:maven-surefire-plugin:2.18.1:test
failed: The forked VM terminated without properly saying goodbye. VM crash or System.exit
called?
[ERROR] Command was /bin/sh -c cd <https://builds.apache.org/job/unomi-master/ws/itests>
&& /home/jenkins/jenkins-slave/tools/hudson.model.JDK/jdk-1.7u51/jre/bin/java -jar
<https://builds.apache.org/job/unomi-master/ws/itests/target/surefire/surefirebooter8592484593987786064.jar>
<https://builds.apache.org/job/unomi-master/ws/itests/target/surefire/surefire1688879914631826996tmp>
<https://builds.apache.org/job/unomi-master/ws/itests/target/surefire/surefire_06138130415499413001tmp>
[ERROR] -> [Help 1]
org.apache.maven.lifecycle.LifecycleExecutionException: Failed to execute goal org.apache.maven.plugins:maven-surefire-plugin:2.18.1:test
(default-test) on project unomi-itests: Execution default-test of goal org.apache.maven.plugins:maven-surefire-plugin:2.18.1:test
failed: The forked VM terminated without properly saying goodbye. VM crash or System.exit
called?
Command was /bin/sh -c cd <https://builds.apache.org/job/unomi-master/ws/itests> &&
/home/jenkins/jenkins-slave/tools/hudson.model.JDK/jdk-1.7u51/jre/bin/java -jar <https://builds.apache.org/job/unomi-master/ws/itests/target/surefire/surefirebooter8592484593987786064.jar>
<https://builds.apache.org/job/unomi-master/ws/itests/target/surefire/surefire1688879914631826996tmp>
<https://builds.apache.org/job/unomi-master/ws/itests/target/surefire/surefire_06138130415499413001tmp>
	at org.apache.maven.lifecycle.internal.MojoExecutor.execute(MojoExecutor.java:224)
	at org.apache.maven.lifecycle.internal.MojoExecutor.execute(MojoExecutor.java:153)
	at org.apache.maven.lifecycle.internal.MojoExecutor.execute(MojoExecutor.java:145)
	at org.apache.maven.lifecycle.internal.LifecycleModuleBuilder.buildProject(LifecycleModuleBuilder.java:116)
	at org.apache.maven.lifecycle.internal.LifecycleModuleBuilder.buildProject(LifecycleModuleBuilder.java:80)
	at org.apache.maven.lifecycle.internal.builder.singlethreaded.SingleThreadedBuilder.build(SingleThreadedBuilder.java:51)
	at org.apache.maven.lifecycle.internal.LifecycleStarter.execute(LifecycleStarter.java:128)
	at org.apache.maven.DefaultMaven.doExecute(DefaultMaven.java:307)
	at org.apache.maven.DefaultMaven.doExecute(DefaultMaven.java:193)
	at org.apache.maven.DefaultMaven.execute(DefaultMaven.java:106)
	at org.jvnet.hudson.maven3.launcher.Maven32Launcher.main(Maven32Launcher.java:132)
	at sun.reflect.NativeMethodAccessorImpl.invoke0(Native Method)
	at sun.reflect.NativeMethodAccessorImpl.invoke(NativeMethodAccessorImpl.java:57)
	at sun.reflect.DelegatingMethodAccessorImpl.invoke(DelegatingMethodAccessorImpl.java:43)
	at java.lang.reflect.Method.invoke(Method.java:606)
	at org.codehaus.plexus.classworlds.launcher.Launcher.launchStandard(Launcher.java:330)
	at org.codehaus.plexus.classworlds.launcher.Launcher.launch(Launcher.java:238)
	at jenkins.maven3.agent.Maven32Main.launch(Maven32Main.java:186)
	at sun.reflect.NativeMethodAccessorImpl.invoke0(Native Method)
	at sun.reflect.NativeMethodAccessorImpl.invoke(NativeMethodAccessorImpl.java:57)
	at sun.reflect.DelegatingMethodAccessorImpl.invoke(DelegatingMethodAccessorImpl.java:43)
	at java.lang.reflect.Method.invoke(Method.java:606)
	at hudson.maven.Maven3Builder.call(Maven3Builder.java:136)
	at hudson.maven.Maven3Builder.call(Maven3Builder.java:71)
	at hudson.remoting.UserRequest.perform(UserRequest.java:120)
	at hudson.remoting.UserRequest.perform(UserRequest.java:48)
	at hudson.remoting.Request$2.run(Request.java:326)
	at hudson.remoting.InterceptingExecutorService$1.call(InterceptingExecutorService.java:68)
	at java.util.concurrent.FutureTask.run(FutureTask.java:262)
	at java.util.concurrent.ThreadPoolExecutor.runWorker(ThreadPoolExecutor.java:1145)
	at java.util.concurrent.ThreadPoolExecutor$Worker.run(ThreadPoolExecutor.java:615)
	at java.lang.Thread.run(Thread.java:744)
Caused by: org.apache.maven.plugin.PluginExecutionException: Execution default-test of goal
org.apache.maven.plugins:maven-surefire-plugin:2.18.1:test failed: The forked VM terminated
without properly saying goodbye. VM crash or System.exit called?
Command was /bin/sh -c cd <https://builds.apache.org/job/unomi-master/ws/itests> &&
/home/jenkins/jenkins-slave/tools/hudson.model.JDK/jdk-1.7u51/jre/bin/java -jar <https://builds.apache.org/job/unomi-master/ws/itests/target/surefire/surefirebooter8592484593987786064.jar>
<https://builds.apache.org/job/unomi-master/ws/itests/target/surefire/surefire1688879914631826996tmp>
<https://builds.apache.org/job/unomi-master/ws/itests/target/surefire/surefire_06138130415499413001tmp>
	at org.apache.maven.plugin.DefaultBuildPluginManager.executeMojo(DefaultBuildPluginManager.java:145)
	at org.apache.maven.lifecycle.internal.MojoExecutor.execute(MojoExecutor.java:208)
	... 31 more
Caused by: java.lang.RuntimeException: The forked VM terminated without properly saying goodbye.
VM crash or System.exit called?
Command was /bin/sh -c cd <https://builds.apache.org/job/unomi-master/ws/itests> &&
/home/jenkins/jenkins-slave/tools/hudson.model.JDK/jdk-1.7u51/jre/bin/java -jar <https://builds.apache.org/job/unomi-master/ws/itests/target/surefire/surefirebooter8592484593987786064.jar>
<https://builds.apache.org/job/unomi-master/ws/itests/target/surefire/surefire1688879914631826996tmp>
<https://builds.apache.org/job/unomi-master/ws/itests/target/surefire/surefire_06138130415499413001tmp>
	at org.apache.maven.plugin.surefire.booterclient.ForkStarter.fork(ForkStarter.java:515)
	at org.apache.maven.plugin.surefire.booterclient.ForkStarter.fork(ForkStarter.java:380)
	at org.apache.maven.plugin.surefire.booterclient.ForkStarter.run(ForkStarter.java:167)
	at org.apache.maven.plugin.surefire.AbstractSurefireMojo.executeProvider(AbstractSurefireMojo.java:990)
	at org.apache.maven.plugin.surefire.AbstractSurefireMojo.executeAfterPreconditionsChecked(AbstractSurefireMojo.java:824)
	at org.apache.maven.plugin.surefire.AbstractSurefireMojo.execute(AbstractSurefireMojo.java:722)
	at org.apache.maven.plugin.DefaultBuildPluginManager.executeMojo(DefaultBuildPluginManager.java:134)
	... 32 more
[ERROR] 
[ERROR] Re-run Maven using the -X switch to enable full debug logging.
[ERROR] 
[ERROR] For more information about the errors and possible solutions, please read the following
articles:
[ERROR] [Help 1] http://cwiki.apache.org/confluence/display/MAVEN/PluginExecutionException
[ERROR] 
[ERROR] After correcting the problems, you can resume the build with the command
[ERROR]   mvn <goals> -rf :unomi-itests
[JENKINS] Archiving <https://builds.apache.org/job/unomi-master/ws/pom.xml> to org.apache.unomi/unomi-root/1.0.1-incubating-SNAPSHOT/unomi-root-1.0.1-incubating-SNAPSHOT.pom
[JENKINS] Archiving <https://builds.apache.org/job/unomi-master/ws/target/unomi-root-1.0.1-incubating-SNAPSHOT-site.xml>
to org.apache.unomi/unomi-root/1.0.1-incubating-20160401.124010-3/unomi-root-1.0.1-incubating-20160401.124010-3-site.xml
[JENKINS] Archiving <https://builds.apache.org/job/unomi-master/ws/samples/pom.xml>
to org.apache.unomi/samples/1.0.1-incubating-SNAPSHOT/samples-1.0.1-incubating-SNAPSHOT.pom
[JENKINS] Archiving <https://builds.apache.org/job/unomi-master/ws/services/pom.xml>
to org.apache.unomi/unomi-services/1.0.1-incubating-SNAPSHOT/unomi-services-1.0.1-incubating-SNAPSHOT.pom
[JENKINS] Archiving <https://builds.apache.org/job/unomi-master/ws/services/target/unomi-services-1.0.1-incubating-SNAPSHOT.jar>
to org.apache.unomi/unomi-services/1.0.1-incubating-20160401.124232-3/unomi-services-1.0.1-incubating-20160401.124232-3.jar
[JENKINS] Archiving <https://builds.apache.org/job/unomi-master/ws/services/src/main/resources/org.apache.unomi.services.cfg>
to org.apache.unomi/unomi-services/1.0.1-incubating-20160401.124232-3/unomi-services-1.0.1-incubating-20160401.124232-3-servicescfg.cfg
[JENKINS] Archiving <https://builds.apache.org/job/unomi-master/ws/services/src/main/resources/org.apache.unomi.thirdparty.cfg>
to org.apache.unomi/unomi-services/1.0.1-incubating-20160401.124232-3/unomi-services-1.0.1-incubating-20160401.124232-3-thirdpartycfg.cfg
Compressed 1.93 MB of artifacts by 84.4% relative to #7
[JENKINS] Archiving <https://builds.apache.org/job/unomi-master/ws/rest/pom.xml> to
org.apache.unomi/unomi-rest/1.0.1-incubating-SNAPSHOT/unomi-rest-1.0.1-incubating-SNAPSHOT.pom
[JENKINS] Archiving <https://builds.apache.org/job/unomi-master/ws/rest/target/unomi-rest-1.0.1-incubating-SNAPSHOT.jar>
to org.apache.unomi/unomi-rest/1.0.1-incubating-20160401.124329-3/unomi-rest-1.0.1-incubating-20160401.124329-3.jar
[JENKINS] Archiving <https://builds.apache.org/job/unomi-master/ws/plugins/hover-event/pom.xml>
to org.apache.unomi/unomi-plugins-hover-event/1.0.1-incubating-SNAPSHOT/unomi-plugins-hover-event-1.0.1-incubating-SNAPSHOT.pom
[JENKINS] Archiving <https://builds.apache.org/job/unomi-master/ws/plugins/hover-event/target/unomi-plugins-hover-event-1.0.1-incubating-SNAPSHOT.jar>
to org.apache.unomi/unomi-plugins-hover-event/1.0.1-incubating-20160401.124506-3/unomi-plugins-hover-event-1.0.1-incubating-20160401.124506-3.jar
[JENKINS] Archiving <https://builds.apache.org/job/unomi-master/ws/api/pom.xml> to org.apache.unomi/unomi-api/1.0.1-incubating-SNAPSHOT/unomi-api-1.0.1-incubating-SNAPSHOT.pom
[JENKINS] Archiving <https://builds.apache.org/job/unomi-master/ws/api/target/unomi-api-1.0.1-incubating-SNAPSHOT.jar>
to org.apache.unomi/unomi-api/1.0.1-incubating-20160401.124031-3/unomi-api-1.0.1-incubating-20160401.124031-3.jar
[JENKINS] Archiving <https://builds.apache.org/job/unomi-master/ws/extensions/lists-extension/services/pom.xml>
to org.apache.unomi/cxs-lists-extension-services/1.0.1-incubating-SNAPSHOT/cxs-lists-extension-services-1.0.1-incubating-SNAPSHOT.pom
[JENKINS] Archiving <https://builds.apache.org/job/unomi-master/ws/extensions/lists-extension/services/target/cxs-lists-extension-services-1.0.1-incubating-SNAPSHOT.jar>
to org.apache.unomi/cxs-lists-extension-services/1.0.1-incubating-20160401.124558-3/cxs-lists-extension-services-1.0.1-incubating-20160401.124558-3.jar
[JENKINS] Archiving <https://builds.apache.org/job/unomi-master/ws/plugins/request/pom.xml>
to org.apache.unomi/unomi-plugins-request/1.0.1-incubating-SNAPSHOT/unomi-plugins-request-1.0.1-incubating-SNAPSHOT.pom
[JENKINS] Archiving <https://builds.apache.org/job/unomi-master/ws/plugins/request/target/unomi-plugins-request-1.0.1-incubating-SNAPSHOT.jar>
to org.apache.unomi/unomi-plugins-request/1.0.1-incubating-20160401.124428-3/unomi-plugins-request-1.0.1-incubating-20160401.124428-3.jar
[JENKINS] Archiving <https://builds.apache.org/job/unomi-master/ws/plugins/request/src/main/resources/org.apache.unomi.plugins.request.cfg>
to org.apache.unomi/unomi-plugins-request/1.0.1-incubating-20160401.124428-3/unomi-plugins-request-1.0.1-incubating-20160401.124428-3-requestcfg.cfg
Compressed 1.18 MB of artifacts by 68.6% relative to #7
[JENKINS] Archiving <https://builds.apache.org/job/unomi-master/ws/extensions/geonames/rest/pom.xml>
to org.apache.unomi/cxs-geonames-rest/1.0.1-incubating-SNAPSHOT/cxs-geonames-rest-1.0.1-incubating-SNAPSHOT.pom
[JENKINS] Archiving <https://builds.apache.org/job/unomi-master/ws/extensions/geonames/rest/target/cxs-geonames-rest-1.0.1-incubating-SNAPSHOT.jar>
to org.apache.unomi/cxs-geonames-rest/1.0.1-incubating-20160401.124713-3/cxs-geonames-rest-1.0.1-incubating-20160401.124713-3.jar
[JENKINS] Archiving <https://builds.apache.org/job/unomi-master/ws/performance-tests/pom.xml>
to org.apache.unomi/unomi-performance-tests/1.0.1-incubating-SNAPSHOT/unomi-performance-tests-1.0.1-incubating-SNAPSHOT.pom
[JENKINS] Archiving <https://builds.apache.org/job/unomi-master/ws/persistence-elasticsearch/core/pom.xml>
to org.apache.unomi/unomi-persistence-elasticsearch-core/1.0.1-incubating-SNAPSHOT/unomi-persistence-elasticsearch-core-1.0.1-incubating-SNAPSHOT.pom
[JENKINS] Archiving <https://builds.apache.org/job/unomi-master/ws/persistence-elasticsearch/core/target/unomi-persistence-elasticsearch-core-1.0.1-incubating-SNAPSHOT.jar>
to org.apache.unomi/unomi-persistence-elasticsearch-core/1.0.1-incubating-20160401.124134-3/unomi-persistence-elasticsearch-core-1.0.1-incubating-20160401.124134-3.jar
[JENKINS] Archiving <https://builds.apache.org/job/unomi-master/ws/persistence-elasticsearch/core/src/main/resources/org.apache.unomi.persistence.elasticsearch.cfg>
to org.apache.unomi/unomi-persistence-elasticsearch-core/1.0.1-incubating-20160401.124134-3/unomi-persistence-elasticsearch-core-1.0.1-incubating-20160401.124134-3-elasticsearchcfg.cfg
[JENKINS] Archiving <https://builds.apache.org/job/unomi-master/ws/persistence-elasticsearch/core/src/main/resources/elasticsearch.yml>
to org.apache.unomi/unomi-persistence-elasticsearch-core/1.0.1-incubating-20160401.124134-3/unomi-persistence-elasticsearch-core-1.0.1-incubating-20160401.124134-3-elasticsearchconfig.yml
Compressed 40.07 MB of artifacts by 75.5% relative to #7
[JENKINS] Archiving <https://builds.apache.org/job/unomi-master/ws/plugins/tracked-event/pom.xml>
to org.apache.unomi/unomi-plugins-tracked-event/1.0.1-incubating-SNAPSHOT/unomi-plugins-tracked-event-1.0.1-incubating-SNAPSHOT.pom
[JENKINS] Archiving <https://builds.apache.org/job/unomi-master/ws/plugins/tracked-event/target/unomi-plugins-tracked-event-1.0.1-incubating-SNAPSHOT.jar>
to org.apache.unomi/unomi-plugins-tracked-event/1.0.1-incubating-20160401.124530-3/unomi-plugins-tracked-event-1.0.1-incubating-20160401.124530-3.jar
[JENKINS] Archiving <https://builds.apache.org/job/unomi-master/ws/extensions/privacy-extension/services/pom.xml>
to org.apache.unomi/cxs-privacy-extension-services/1.0.1-incubating-SNAPSHOT/cxs-privacy-extension-services-1.0.1-incubating-SNAPSHOT.pom
[JENKINS] Archiving <https://builds.apache.org/job/unomi-master/ws/extensions/privacy-extension/services/target/cxs-privacy-extension-services-1.0.1-incubating-SNAPSHOT.jar>
to org.apache.unomi/cxs-privacy-extension-services/1.0.1-incubating-20160401.124628-3/cxs-privacy-extension-services-1.0.1-incubating-20160401.124628-3.jar
[JENKINS] Archiving <https://builds.apache.org/job/unomi-master/ws/package/pom.xml>
to org.apache.unomi/unomi/1.0.1-incubating-SNAPSHOT/unomi-1.0.1-incubating-SNAPSHOT.pom
[JENKINS] Archiving <https://builds.apache.org/job/unomi-master/ws/package/pom.xml>
to org.apache.unomi/unomi/1.0.1-incubating-20160401.124941-3/unomi-1.0.1-incubating-20160401.124941-3.pom
[JENKINS] Archiving <https://builds.apache.org/job/unomi-master/ws/package/target/unomi-1.0.1-incubating-SNAPSHOT.tar.gz>
to org.apache.unomi/unomi/1.0.1-incubating-20160401.124941-3/unomi-1.0.1-incubating-20160401.124941-3.tar.gz
[JENKINS] Archiving <https://builds.apache.org/job/unomi-master/ws/package/target/unomi-1.0.1-incubating-SNAPSHOT.zip>
to org.apache.unomi/unomi/1.0.1-incubating-20160401.124941-3/unomi-1.0.1-incubating-20160401.124941-3.zip
[JENKINS] Archiving <https://builds.apache.org/job/unomi-master/ws/package/target/unomi-1.0.1-incubating-SNAPSHOT-src.tar.gz>
to org.apache.unomi/unomi/1.0.1-incubating-20160401.124941-3/unomi-1.0.1-incubating-20160401.124941-3-src.tar.gz
[JENKINS] Archiving <https://builds.apache.org/job/unomi-master/ws/package/target/unomi-1.0.1-incubating-SNAPSHOT-src.zip>
to org.apache.unomi/unomi/1.0.1-incubating-20160401.124941-3/unomi-1.0.1-incubating-20160401.124941-3-src.zip
Compressed 219.43 MB of artifacts by 26.3% relative to #7
[JENKINS] Archiving <https://builds.apache.org/job/unomi-master/ws/samples/tweet-button-plugin/pom.xml>
to org.apache.unomi/tweet-button-plugin/1.0.1-incubating-SNAPSHOT/tweet-button-plugin-1.0.1-incubating-SNAPSHOT.pom
[JENKINS] Archiving <https://builds.apache.org/job/unomi-master/ws/samples/tweet-button-plugin/target/tweet-button-plugin-1.0.1-incubating-SNAPSHOT.jar>
to org.apache.unomi/tweet-button-plugin/1.0.1-incubating-20160401.124821-3/tweet-button-plugin-1.0.1-incubating-20160401.124821-3.jar
[JENKINS] Archiving <https://builds.apache.org/job/unomi-master/ws/persistence-elasticsearch/plugins/security/pom.xml>
to org.apache.unomi/unomi-persistence-elasticsearch-plugins-security/1.0.1-incubating-SNAPSHOT/unomi-persistence-elasticsearch-plugins-security-1.0.1-incubating-SNAPSHOT.pom
[JENKINS] Archiving <https://builds.apache.org/job/unomi-master/ws/persistence-elasticsearch/plugins/security/target/unomi-persistence-elasticsearch-plugins-security-1.0.1-incubating-SNAPSHOT.jar>
to org.apache.unomi/unomi-persistence-elasticsearch-plugins-security/1.0.1-incubating-20160401.124207-3/unomi-persistence-elasticsearch-plugins-security-1.0.1-incubating-20160401.124207-3.jar
[JENKINS] Archiving <https://builds.apache.org/job/unomi-master/ws/persistence-elasticsearch/plugins/security/target/unomi-persistence-elasticsearch-plugins-security-1.0.1-incubating-SNAPSHOT-sources.jar>
to org.apache.unomi/unomi-persistence-elasticsearch-plugins-security/1.0.1-incubating-20160401.124207-3/unomi-persistence-elasticsearch-plugins-security-1.0.1-incubating-20160401.124207-3-sources.jar
[JENKINS] Archiving <https://builds.apache.org/job/unomi-master/ws/persistence-elasticsearch/plugins/security/target/releases/unomi-persistence-elasticsearch-plugins-security-1.0.1-incubating-SNAPSHOT.zip>
to org.apache.unomi/unomi-persistence-elasticsearch-plugins-security/1.0.1-incubating-20160401.124207-3/unomi-persistence-elasticsearch-plugins-security-1.0.1-incubating-20160401.124207-3.zip
[JENKINS] Archiving <https://builds.apache.org/job/unomi-master/ws/extensions/pom.xml>
to org.apache.unomi/unomi-extensions/1.0.1-incubating-SNAPSHOT/unomi-extensions-1.0.1-incubating-SNAPSHOT.pom
[JENKINS] Archiving <https://builds.apache.org/job/unomi-master/ws/extensions/lists-extension/rest/pom.xml>
to org.apache.unomi/cxs-lists-extension-rest/1.0.1-incubating-SNAPSHOT/cxs-lists-extension-rest-1.0.1-incubating-SNAPSHOT.pom
[JENKINS] Archiving <https://builds.apache.org/job/unomi-master/ws/extensions/lists-extension/rest/target/cxs-lists-extension-rest-1.0.1-incubating-SNAPSHOT.jar>
to org.apache.unomi/cxs-lists-extension-rest/1.0.1-incubating-20160401.124609-3/cxs-lists-extension-rest-1.0.1-incubating-20160401.124609-3.jar
[JENKINS] Archiving <https://builds.apache.org/job/unomi-master/ws/extensions/geonames/pom.xml>
to org.apache.unomi/cxs-geonames/1.0.1-incubating-SNAPSHOT/cxs-geonames-1.0.1-incubating-SNAPSHOT.pom
[JENKINS] Archiving <https://builds.apache.org/job/unomi-master/ws/plugins/pom.xml>
to org.apache.unomi/unomi-plugins/1.0.1-incubating-SNAPSHOT/unomi-plugins-1.0.1-incubating-SNAPSHOT.pom
[JENKINS] Archiving <https://builds.apache.org/job/unomi-master/ws/plugins/mail/pom.xml>
to org.apache.unomi/unomi-plugins-mail/1.0.1-incubating-SNAPSHOT/unomi-plugins-mail-1.0.1-incubating-SNAPSHOT.pom
[JENKINS] Archiving <https://builds.apache.org/job/unomi-master/ws/plugins/mail/target/unomi-plugins-mail-1.0.1-incubating-SNAPSHOT.jar>
to org.apache.unomi/unomi-plugins-mail/1.0.1-incubating-20160401.124443-3/unomi-plugins-mail-1.0.1-incubating-20160401.124443-3.jar
Compressed 346.53 KB of artifacts by 73.9% relative to #7
[JENKINS] Archiving <https://builds.apache.org/job/unomi-master/ws/extensions/privacy-extension/rest/pom.xml>
to org.apache.unomi/cxs-privacy-extension-rest/1.0.1-incubating-SNAPSHOT/cxs-privacy-extension-rest-1.0.1-incubating-SNAPSHOT.pom
[JENKINS] Archiving <https://builds.apache.org/job/unomi-master/ws/extensions/privacy-extension/rest/target/cxs-privacy-extension-rest-1.0.1-incubating-SNAPSHOT.jar>
to org.apache.unomi/cxs-privacy-extension-rest/1.0.1-incubating-20160401.124638-3/cxs-privacy-extension-rest-1.0.1-incubating-20160401.124638-3.jar
[JENKINS] Archiving <https://builds.apache.org/job/unomi-master/ws/extensions/lists-extension/pom.xml>
to org.apache.unomi/cxs-lists-extension/1.0.1-incubating-SNAPSHOT/cxs-lists-extension-1.0.1-incubating-SNAPSHOT.pom
[JENKINS] Archiving <https://builds.apache.org/job/unomi-master/ws/kar/pom.xml> to org.apache.unomi/unomi-kar/1.0.1-incubating-SNAPSHOT/unomi-kar-1.0.1-incubating-SNAPSHOT.pom
[JENKINS] Archiving <https://builds.apache.org/job/unomi-master/ws/kar/target/unomi-kar-1.0.1-incubating-SNAPSHOT.kar>
to org.apache.unomi/unomi-kar/1.0.1-incubating-20160401.124734-3/unomi-kar-1.0.1-incubating-20160401.124734-3.kar
[JENKINS] Archiving <https://builds.apache.org/job/unomi-master/ws/kar/target/feature/feature.xml>
to org.apache.unomi/unomi-kar/1.0.1-incubating-20160401.124734-3/unomi-kar-1.0.1-incubating-20160401.124734-3-features.xml
[JENKINS] Archiving <https://builds.apache.org/job/unomi-master/ws/plugins/optimization-test/pom.xml>
to org.apache.unomi/unomi-plugins-optimization-test/1.0.1-incubating-SNAPSHOT/unomi-plugins-optimization-test-1.0.1-incubating-SNAPSHOT.pom
[JENKINS] Archiving <https://builds.apache.org/job/unomi-master/ws/plugins/optimization-test/target/unomi-plugins-optimization-test-1.0.1-incubating-SNAPSHOT.jar>
to org.apache.unomi/unomi-plugins-optimization-test/1.0.1-incubating-20160401.124452-3/unomi-plugins-optimization-test-1.0.1-incubating-20160401.124452-3.jar
[JENKINS] Archiving <https://builds.apache.org/job/unomi-master/ws/plugins/past-event/pom.xml>
to org.apache.unomi/unomi-plugins-past-event/1.0.1-incubating-SNAPSHOT/unomi-plugins-past-event-1.0.1-incubating-SNAPSHOT.pom
[JENKINS] Archiving <https://builds.apache.org/job/unomi-master/ws/plugins/past-event/target/unomi-plugins-past-event-1.0.1-incubating-SNAPSHOT.jar>
to org.apache.unomi/unomi-plugins-past-event/1.0.1-incubating-20160401.124518-3/unomi-plugins-past-event-1.0.1-incubating-20160401.124518-3.jar
[JENKINS] Archiving <https://builds.apache.org/job/unomi-master/ws/persistence-elasticsearch/plugins/pom.xml>
to org.apache.unomi/unomi-persistence-elasticsearch-plugins/1.0.1-incubating-SNAPSHOT/unomi-persistence-elasticsearch-plugins-1.0.1-incubating-SNAPSHOT.pom
[JENKINS] Archiving <https://builds.apache.org/job/unomi-master/ws/extensions/privacy-extension/pom.xml>
to org.apache.unomi/cxs-privacy-extension/1.0.1-incubating-SNAPSHOT/cxs-privacy-extension-1.0.1-incubating-SNAPSHOT.pom
[JENKINS] Archiving <https://builds.apache.org/job/unomi-master/ws/persistence-spi/pom.xml>
to org.apache.unomi/unomi-persistence-spi/1.0.1-incubating-SNAPSHOT/unomi-persistence-spi-1.0.1-incubating-SNAPSHOT.pom
[JENKINS] Archiving <https://builds.apache.org/job/unomi-master/ws/persistence-spi/target/unomi-persistence-spi-1.0.1-incubating-SNAPSHOT.jar>
to org.apache.unomi/unomi-persistence-spi/1.0.1-incubating-20160401.124047-3/unomi-persistence-spi-1.0.1-incubating-20160401.124047-3.jar
Compressed 725.41 KB of artifacts by 88.2% relative to #7
[JENKINS] Archiving <https://builds.apache.org/job/unomi-master/ws/wab/pom.xml> to org.apache.unomi/unomi-wab/1.0.1-incubating-SNAPSHOT/unomi-wab-1.0.1-incubating-SNAPSHOT.pom
[JENKINS] Archiving <https://builds.apache.org/job/unomi-master/ws/wab/target/unomi-wab-1.0.1-incubating-SNAPSHOT.jar>
to org.apache.unomi/unomi-wab/1.0.1-incubating-20160401.124344-3/unomi-wab-1.0.1-incubating-20160401.124344-3.jar
[JENKINS] Archiving <https://builds.apache.org/job/unomi-master/ws/wab/src/main/resources/org.apache.unomi.web.cfg>
to org.apache.unomi/unomi-wab/1.0.1-incubating-20160401.124344-3/unomi-wab-1.0.1-incubating-20160401.124344-3-unomicfg.cfg
Compressed 280.35 KB of artifacts by 68.5% relative to #7
[JENKINS] Archiving <https://builds.apache.org/job/unomi-master/ws/extensions/geonames/services/pom.xml>
to org.apache.unomi/cxs-geonames-services/1.0.1-incubating-SNAPSHOT/cxs-geonames-services-1.0.1-incubating-SNAPSHOT.pom
[JENKINS] Archiving <https://builds.apache.org/job/unomi-master/ws/extensions/geonames/services/target/cxs-geonames-services-1.0.1-incubating-SNAPSHOT.jar>
to org.apache.unomi/cxs-geonames-services/1.0.1-incubating-20160401.124659-3/cxs-geonames-services-1.0.1-incubating-20160401.124659-3.jar
[JENKINS] Archiving <https://builds.apache.org/job/unomi-master/ws/extensions/geonames/services/src/main/resources/org.apache.unomi.geonames.cfg>
to org.apache.unomi/cxs-geonames-services/1.0.1-incubating-20160401.124659-3/cxs-geonames-services-1.0.1-incubating-20160401.124659-3-geonamescfg.cfg
Compressed 1.07 MB of artifacts by 87.3% relative to #7
[JENKINS] Archiving <https://builds.apache.org/job/unomi-master/ws/plugins/baseplugin/pom.xml>
to org.apache.unomi/unomi-plugins-base/1.0.1-incubating-SNAPSHOT/unomi-plugins-base-1.0.1-incubating-SNAPSHOT.pom
[JENKINS] Archiving <https://builds.apache.org/job/unomi-master/ws/plugins/baseplugin/target/unomi-plugins-base-1.0.1-incubating-SNAPSHOT.jar>
to org.apache.unomi/unomi-plugins-base/1.0.1-incubating-20160401.124412-3/unomi-plugins-base-1.0.1-incubating-20160401.124412-3.jar
Compressed 1.89 MB of artifacts by 86.1% relative to #7
[JENKINS] Archiving <https://builds.apache.org/job/unomi-master/ws/persistence-elasticsearch/pom.xml>
to org.apache.unomi/unomi-persistence-elasticsearch/1.0.1-incubating-SNAPSHOT/unomi-persistence-elasticsearch-1.0.1-incubating-SNAPSHOT.pom
[JENKINS] Archiving <https://builds.apache.org/job/unomi-master/ws/itests/pom.xml> to
org.apache.unomi/unomi-itests/1.0.1-incubating-SNAPSHOT/unomi-itests-1.0.1-incubating-SNAPSHOT.pom
Sending e-mails to: commits@unomi.incubator.apache.org
Sending e-mails to: commits@unomi.incubator.apache.org
channel stopped


Mime
View raw message