unomi-commits mailing list archives

Site index · List index
Message view « Date » · « Thread »
Top « Date » · « Thread »
From Apache Jenkins Server <jenk...@builds.apache.org>
Subject Build failed in Jenkins: unomi-master #11
Date Fri, 08 Apr 2016 09:40:57 GMT
See <https://builds.apache.org/job/unomi-master/11/changes>

Changes:

[draier] UNOMI-22 : Iterates on sub conditions and check match on session or

------------------------------------------
Started by an SCM change
[EnvInject] - Loading node environment variables.
Building remotely on ubuntu-us1 (Ubuntu ubuntu ubuntu-us golang-ppa) in workspace <https://builds.apache.org/job/unomi-master/ws/>
 > git rev-parse --is-inside-work-tree # timeout=10
Fetching changes from the remote Git repository
 > git config remote.origin.url https://git-wip-us.apache.org/repos/asf/incubator-unomi.git
# timeout=10
Fetching upstream changes from https://git-wip-us.apache.org/repos/asf/incubator-unomi.git
 > git --version # timeout=10
 > git -c core.askpass=true fetch --tags --progress https://git-wip-us.apache.org/repos/asf/incubator-unomi.git
+refs/heads/*:refs/remotes/origin/*
 > git rev-parse refs/remotes/origin/master^{commit} # timeout=10
 > git rev-parse refs/remotes/origin/origin/master^{commit} # timeout=10
Checking out Revision 358c4df04a01ef00dfb27632976e42ad4e572f79 (refs/remotes/origin/master)
 > git config core.sparsecheckout # timeout=10
 > git checkout -f 358c4df04a01ef00dfb27632976e42ad4e572f79
 > git rev-list 8dfd6ac2c4ee00d83dc28cb1a7aaf1096d268d71 # timeout=10
Parsing POMs
Established TCP socket on 47857
maven32-agent.jar already up to date
maven32-interceptor.jar already up to date
maven3-interceptor-commons.jar already up to date
[unomi-master] $ /home/jenkins/jenkins-slave/tools/hudson.model.JDK/jdk-1.7u51/bin/java -Xmx2g
-Xms256m -XX:MaxPermSize=512m -cp /home/jenkins/jenkins-slave/maven32-agent.jar:/home/jenkins/jenkins-slave/tools/hudson.tasks.Maven_MavenInstallation/maven-3.3.3/boot/plexus-classworlds-2.5.2.jar:/home/jenkins/jenkins-slave/tools/hudson.tasks.Maven_MavenInstallation/maven-3.3.3/conf/logging
jenkins.maven3.agent.Maven32Main /home/jenkins/jenkins-slave/tools/hudson.tasks.Maven_MavenInstallation/maven-3.3.3
/home/jenkins/jenkins-slave/slave.jar /home/jenkins/jenkins-slave/maven32-interceptor.jar
/home/jenkins/jenkins-slave/maven3-interceptor-commons.jar 47857
<===[JENKINS REMOTING CAPACITY]===>   channel started
Executing Maven:  -B -f <https://builds.apache.org/job/unomi-master/ws/pom.xml> -Dmaven.repo.local=/home/jenkins/jenkins-slave/maven-repositories/0
-B -e clean deploy
[INFO] Error stacktraces are turned on.
[INFO] Scanning for projects...
[INFO] ------------------------------------------------------------------------
[INFO] Reactor Build Order:
[INFO] 
[INFO] Apache Unomi :: Root Project
[INFO] Apache Unomi :: Specification API
[INFO] Apache Unomi :: Persistence :: SPI (Service Provider Interface)
[INFO] Apache Unomi :: Persistence :: ElasticSearch
[INFO] Apache Unomi :: Persistence :: ElasticSearch :: Core
[INFO] Apache Unomi :: Persistence :: ElasticSearch :: Plugins
[INFO] Apache Unomi :: Persistence :: ElasticSearch :: Plugins :: Security
[INFO] Apache Unomi :: Core Services
[INFO] Apache Unomi :: REST API
[INFO] Apache Unomi :: Core Web Application
[INFO] Apache Unomi :: Plugins
[INFO] Apache Unomi :: Plugins :: Base Actions and Conditions
[INFO] Apache Unomi :: Plugins :: Request reading actions
[INFO] Apache Unomi :: Plugins :: Mail notifications actions
[INFO] Apache Unomi :: Plugins :: Rules and Actions for optimization tests (A/B testing)
[INFO] Apache Unomi :: Plugins :: Hover event support
[INFO] Apache Unomi :: Plugins :: Conditions based on past events
[INFO] Apache Unomi :: Plugins :: Conditions for events that need to be tracked
[INFO] Apache Unomi :: Extensions
[INFO] Apache Unomi :: Extensions :: Lists
[INFO] Apache Unomi :: Extensions :: Lists :: Service
[INFO] Apache Unomi :: Extensions :: Lists :: REST API
[INFO] Apache Unomi :: Extensions :: Privacy
[INFO] Apache Unomi :: Extensions :: Privacy :: Services
[INFO] Apache Unomi :: Extensions :: Privacy :: REST API
[INFO] Apache Unomi :: Extensions :: Geonames Database
[INFO] Apache Unomi :: Extensions :: Geonames Database :: Service
[INFO] Apache Unomi :: Extensions :: Geonames Database :: REST API
[INFO] Apache Unomi :: Karaf KAR package
[INFO] Apache Unomi :: Samples
[INFO] Apache Unomi :: Samples :: Tweet Button plugin
[INFO] Apache Unomi :: Distribution Package
[INFO] Apache Unomi :: Integration Tests
[INFO] Apache Unomi :: Performance Tests
[INFO]                                                                         
[INFO] ------------------------------------------------------------------------
[INFO] Building Apache Unomi :: Root Project 1.0.1-incubating-SNAPSHOT
[INFO] ------------------------------------------------------------------------
[INFO] 
[INFO] --- maven-clean-plugin:2.5:clean (default-clean) @ unomi-root ---
[INFO] Deleting <https://builds.apache.org/job/unomi-master/ws/target>
[INFO] 
[INFO] --- maven-remote-resources-plugin:1.5:process (default) @ unomi-root ---
[INFO] 
[INFO] --- maven-site-plugin:3.3:attach-descriptor (attach-descriptor) @ unomi-root ---
[INFO] 
[INFO] --- apache-rat-plugin:0.11:check (default) @ unomi-root ---
[INFO] 51 implicit excludes (use -debug for more details).
[INFO] Exclude: **/NOTICE.template
[INFO] Exclude: **/NOTICE-generated
[INFO] Exclude: **/target/**/*
[INFO] Exclude: **/.git/**/*
[INFO] Exclude: **/.idea/**/*
[INFO] Exclude: **/*.iml
[INFO] Exclude: **/*.ipr
[INFO] Exclude: **/*.iws
[INFO] Exclude: **/.*
[INFO] Exclude: **/eclipse-classes/**/*
[INFO] Exclude: **/dependency-reduced-pom.xml
[INFO] Exclude: **/.settings/**
[INFO] Exclude: **/bin/**
[INFO] Exclude: **/goal.txt
[INFO] Exclude: **/grep.txt
[INFO] Exclude: **/edit.txt
[INFO] Exclude: **/wc.txt
[INFO] Exclude: **/foo
[INFO] Exclude: **/org.ops4j.pax.exam.TestContainerFactory
[INFO] Exclude: **/maven-metadata-local.xml
[INFO] Exclude: **/src/test/resources/data/*.txt
[INFO] Exclude: **/keystore
[INFO] Exclude: **/*.css
[INFO] Exclude: **/*.ssp
[INFO] Exclude: **/*.conf
[INFO] Exclude: **/*.mf
[INFO] Exclude: **/*.json
[INFO] Exclude: **/*.key
[INFO] Exclude: .repository/**
[INFO] Exclude: **/*.jar
[INFO] Exclude: **/src/main/webapp/WEB-INF/beans.xml
[INFO] Exclude: **/src/main/webapp/robots.txt
[INFO] Exclude: **/src/main/resources/elasticsearch.yml
[INFO] 318 resources included (use -debug for more details)
Warning:  org.apache.xerces.jaxp.SAXParserImpl$JAXPSAXParser: Property 'http://www.oracle.com/xml/jaxp/properties/entityExpansionLimit'
is not recognized.
Compiler warnings:
  WARNING:  'org.apache.xerces.jaxp.SAXParserImpl: Property 'http://javax.xml.XMLConstants/property/accessExternalDTD'
is not recognized.'
Warning:  org.apache.xerces.parsers.SAXParser: Feature 'http://javax.xml.XMLConstants/feature/secure-processing'
is not recognized.
Warning:  org.apache.xerces.parsers.SAXParser: Property 'http://javax.xml.XMLConstants/property/accessExternalDTD'
is not recognized.
Warning:  org.apache.xerces.parsers.SAXParser: Property 'http://www.oracle.com/xml/jaxp/properties/entityExpansionLimit'
is not recognized.
[INFO] Rat check: Summary of files. Unapproved: 1 unknown: 1 generated: 0 approved: 298 licence.
[INFO] ------------------------------------------------------------------------
[INFO] Reactor Summary:
[INFO] 
[INFO] Apache Unomi :: Root Project ....................... FAILURE [ 11.447 s]
[INFO] Apache Unomi :: Specification API .................. SKIPPED
[INFO] Apache Unomi :: Persistence :: SPI (Service Provider Interface) SKIPPED
[INFO] Apache Unomi :: Persistence :: ElasticSearch ....... SKIPPED
[INFO] Apache Unomi :: Persistence :: ElasticSearch :: Core SKIPPED
[INFO] Apache Unomi :: Persistence :: ElasticSearch :: Plugins SKIPPED
[INFO] Apache Unomi :: Persistence :: ElasticSearch :: Plugins :: Security SKIPPED
[INFO] Apache Unomi :: Core Services ...................... SKIPPED
[INFO] Apache Unomi :: REST API ........................... SKIPPED
[INFO] Apache Unomi :: Core Web Application ............... SKIPPED
[INFO] Apache Unomi :: Plugins ............................ SKIPPED
[INFO] Apache Unomi :: Plugins :: Base Actions and Conditions SKIPPED
[INFO] Apache Unomi :: Plugins :: Request reading actions . SKIPPED
[INFO] Apache Unomi :: Plugins :: Mail notifications actions SKIPPED
[INFO] Apache Unomi :: Plugins :: Rules and Actions for optimization tests (A/B testing) SKIPPED
[INFO] Apache Unomi :: Plugins :: Hover event support ..... SKIPPED
[INFO] Apache Unomi :: Plugins :: Conditions based on past events SKIPPED
[INFO] Apache Unomi :: Plugins :: Conditions for events that need to be tracked SKIPPED
[INFO] Apache Unomi :: Extensions ......................... SKIPPED
[INFO] Apache Unomi :: Extensions :: Lists ................ SKIPPED
[INFO] Apache Unomi :: Extensions :: Lists :: Service ..... SKIPPED
[INFO] Apache Unomi :: Extensions :: Lists :: REST API .... SKIPPED
[INFO] Apache Unomi :: Extensions :: Privacy .............. SKIPPED
[INFO] Apache Unomi :: Extensions :: Privacy :: Services .. SKIPPED
[INFO] Apache Unomi :: Extensions :: Privacy :: REST API .. SKIPPED
[INFO] Apache Unomi :: Extensions :: Geonames Database .... SKIPPED
[INFO] Apache Unomi :: Extensions :: Geonames Database :: Service SKIPPED
[INFO] Apache Unomi :: Extensions :: Geonames Database :: REST API SKIPPED
[INFO] Apache Unomi :: Karaf KAR package .................. SKIPPED
[INFO] Apache Unomi :: Samples ............................ SKIPPED
[INFO] Apache Unomi :: Samples :: Tweet Button plugin ..... SKIPPED
[INFO] Apache Unomi :: Distribution Package ............... SKIPPED
[INFO] Apache Unomi :: Integration Tests .................. SKIPPED
[INFO] Apache Unomi :: Performance Tests .................. SKIPPED
[INFO] ------------------------------------------------------------------------
[INFO] BUILD FAILURE
[INFO] ------------------------------------------------------------------------
[INFO] Total time: 35.576 s
[INFO] Finished at: 2016-04-08T09:40:29+00:00
[INFO] Final Memory: 36M/455M
[INFO] ------------------------------------------------------------------------
[ERROR] Failed to execute goal org.apache.rat:apache-rat-plugin:0.11:check (default) on project
unomi-root: Too many files with unapproved license: 1 See RAT report in: <https://builds.apache.org/job/unomi-master/ws/target/unomi-root-1.0.1-incubating-SNAPSHOT.rat>
-> [Help 1]
org.apache.maven.lifecycle.LifecycleExecutionException: Failed to execute goal org.apache.rat:apache-rat-plugin:0.11:check
(default) on project unomi-root: Too many files with unapproved license: 1 See RAT report
in: <https://builds.apache.org/job/unomi-master/ws/target/unomi-root-1.0.1-incubating-SNAPSHOT.rat>
	at org.apache.maven.lifecycle.internal.MojoExecutor.execute(MojoExecutor.java:212)
	at org.apache.maven.lifecycle.internal.MojoExecutor.execute(MojoExecutor.java:153)
	at org.apache.maven.lifecycle.internal.MojoExecutor.execute(MojoExecutor.java:145)
	at org.apache.maven.lifecycle.internal.LifecycleModuleBuilder.buildProject(LifecycleModuleBuilder.java:116)
	at org.apache.maven.lifecycle.internal.LifecycleModuleBuilder.buildProject(LifecycleModuleBuilder.java:80)
	at org.apache.maven.lifecycle.internal.builder.singlethreaded.SingleThreadedBuilder.build(SingleThreadedBuilder.java:51)
	at org.apache.maven.lifecycle.internal.LifecycleStarter.execute(LifecycleStarter.java:128)
	at org.apache.maven.DefaultMaven.doExecute(DefaultMaven.java:307)
	at org.apache.maven.DefaultMaven.doExecute(DefaultMaven.java:193)
	at org.apache.maven.DefaultMaven.execute(DefaultMaven.java:106)
	at org.jvnet.hudson.maven3.launcher.Maven32Launcher.main(Maven32Launcher.java:132)
	at sun.reflect.NativeMethodAccessorImpl.invoke0(Native Method)
	at sun.reflect.NativeMethodAccessorImpl.invoke(NativeMethodAccessorImpl.java:57)
	at sun.reflect.DelegatingMethodAccessorImpl.invoke(DelegatingMethodAccessorImpl.java:43)
	at java.lang.reflect.Method.invoke(Method.java:606)
	at org.codehaus.plexus.classworlds.launcher.Launcher.launchStandard(Launcher.java:330)
	at org.codehaus.plexus.classworlds.launcher.Launcher.launch(Launcher.java:238)
	at jenkins.maven3.agent.Maven32Main.launch(Maven32Main.java:186)
	at sun.reflect.NativeMethodAccessorImpl.invoke0(Native Method)
	at sun.reflect.NativeMethodAccessorImpl.invoke(NativeMethodAccessorImpl.java:57)
	at sun.reflect.DelegatingMethodAccessorImpl.invoke(DelegatingMethodAccessorImpl.java:43)
	at java.lang.reflect.Method.invoke(Method.java:606)
	at hudson.maven.Maven3Builder.call(Maven3Builder.java:136)
	at hudson.maven.Maven3Builder.call(Maven3Builder.java:71)
	at hudson.remoting.UserRequest.perform(UserRequest.java:120)
	at hudson.remoting.UserRequest.perform(UserRequest.java:48)
	at hudson.remoting.Request$2.run(Request.java:326)
	at hudson.remoting.InterceptingExecutorService$1.call(InterceptingExecutorService.java:68)
	at java.util.concurrent.FutureTask.run(FutureTask.java:262)
	at java.util.concurrent.ThreadPoolExecutor.runWorker(ThreadPoolExecutor.java:1145)
	at java.util.concurrent.ThreadPoolExecutor$Worker.run(ThreadPoolExecutor.java:615)
	at java.lang.Thread.run(Thread.java:744)
Caused by: org.apache.rat.mp.RatCheckException: Too many files with unapproved license: 1
See RAT report in: <https://builds.apache.org/job/unomi-master/ws/target/unomi-root-1.0.1-incubating-SNAPSHOT.rat>
	at org.apache.rat.mp.RatCheckMojo.check(RatCheckMojo.java:194)
	at org.apache.rat.mp.RatCheckMojo.execute(RatCheckMojo.java:182)
	at org.apache.maven.plugin.DefaultBuildPluginManager.executeMojo(DefaultBuildPluginManager.java:134)
	at org.apache.maven.lifecycle.internal.MojoExecutor.execute(MojoExecutor.java:208)
	... 31 more
[ERROR] 
[ERROR] Re-run Maven using the -X switch to enable full debug logging.
[ERROR] 
[ERROR] For more information about the errors and possible solutions, please read the following
articles:
[ERROR] [Help 1] http://cwiki.apache.org/confluence/display/MAVEN/MojoFailureException
[JENKINS] Archiving <https://builds.apache.org/job/unomi-master/ws/pom.xml> to org.apache.unomi/unomi-root/1.0.1-incubating-SNAPSHOT/unomi-root-1.0.1-incubating-SNAPSHOT.pom
[JENKINS] Archiving <https://builds.apache.org/job/unomi-master/ws/target/unomi-root-1.0.1-incubating-SNAPSHOT-site.xml>
to org.apache.unomi/unomi-root/1.0.1-incubating-SNAPSHOT/unomi-root-1.0.1-incubating-SNAPSHOT-site.xml
[JENKINS] Archiving <https://builds.apache.org/job/unomi-master/ws/samples/pom.xml>
to org.apache.unomi/samples/1.0.1-incubating-SNAPSHOT/samples-1.0.1-incubating-SNAPSHOT.pom
[JENKINS] Archiving <https://builds.apache.org/job/unomi-master/ws/services/pom.xml>
to org.apache.unomi/unomi-services/1.0.1-incubating-SNAPSHOT/unomi-services-1.0.1-incubating-SNAPSHOT.pom
[JENKINS] Archiving <https://builds.apache.org/job/unomi-master/ws/rest/pom.xml> to
org.apache.unomi/unomi-rest/1.0.1-incubating-SNAPSHOT/unomi-rest-1.0.1-incubating-SNAPSHOT.pom
[JENKINS] Archiving <https://builds.apache.org/job/unomi-master/ws/plugins/hover-event/pom.xml>
to org.apache.unomi/unomi-plugins-hover-event/1.0.1-incubating-SNAPSHOT/unomi-plugins-hover-event-1.0.1-incubating-SNAPSHOT.pom
[JENKINS] Archiving <https://builds.apache.org/job/unomi-master/ws/api/pom.xml> to org.apache.unomi/unomi-api/1.0.1-incubating-SNAPSHOT/unomi-api-1.0.1-incubating-SNAPSHOT.pom
[JENKINS] Archiving <https://builds.apache.org/job/unomi-master/ws/extensions/lists-extension/services/pom.xml>
to org.apache.unomi/cxs-lists-extension-services/1.0.1-incubating-SNAPSHOT/cxs-lists-extension-services-1.0.1-incubating-SNAPSHOT.pom
[JENKINS] Archiving <https://builds.apache.org/job/unomi-master/ws/plugins/request/pom.xml>
to org.apache.unomi/unomi-plugins-request/1.0.1-incubating-SNAPSHOT/unomi-plugins-request-1.0.1-incubating-SNAPSHOT.pom
[JENKINS] Archiving <https://builds.apache.org/job/unomi-master/ws/extensions/geonames/rest/pom.xml>
to org.apache.unomi/cxs-geonames-rest/1.0.1-incubating-SNAPSHOT/cxs-geonames-rest-1.0.1-incubating-SNAPSHOT.pom
[JENKINS] Archiving <https://builds.apache.org/job/unomi-master/ws/performance-tests/pom.xml>
to org.apache.unomi/unomi-performance-tests/1.0.1-incubating-SNAPSHOT/unomi-performance-tests-1.0.1-incubating-SNAPSHOT.pom
[JENKINS] Archiving <https://builds.apache.org/job/unomi-master/ws/persistence-elasticsearch/core/pom.xml>
to org.apache.unomi/unomi-persistence-elasticsearch-core/1.0.1-incubating-SNAPSHOT/unomi-persistence-elasticsearch-core-1.0.1-incubating-SNAPSHOT.pom
[JENKINS] Archiving <https://builds.apache.org/job/unomi-master/ws/plugins/tracked-event/pom.xml>
to org.apache.unomi/unomi-plugins-tracked-event/1.0.1-incubating-SNAPSHOT/unomi-plugins-tracked-event-1.0.1-incubating-SNAPSHOT.pom
[JENKINS] Archiving <https://builds.apache.org/job/unomi-master/ws/extensions/privacy-extension/services/pom.xml>
to org.apache.unomi/cxs-privacy-extension-services/1.0.1-incubating-SNAPSHOT/cxs-privacy-extension-services-1.0.1-incubating-SNAPSHOT.pom
[JENKINS] Archiving <https://builds.apache.org/job/unomi-master/ws/package/pom.xml>
to org.apache.unomi/unomi/1.0.1-incubating-SNAPSHOT/unomi-1.0.1-incubating-SNAPSHOT.pom
[JENKINS] Archiving <https://builds.apache.org/job/unomi-master/ws/samples/tweet-button-plugin/pom.xml>
to org.apache.unomi/tweet-button-plugin/1.0.1-incubating-SNAPSHOT/tweet-button-plugin-1.0.1-incubating-SNAPSHOT.pom
[JENKINS] Archiving <https://builds.apache.org/job/unomi-master/ws/persistence-elasticsearch/plugins/security/pom.xml>
to org.apache.unomi/unomi-persistence-elasticsearch-plugins-security/1.0.1-incubating-SNAPSHOT/unomi-persistence-elasticsearch-plugins-security-1.0.1-incubating-SNAPSHOT.pom
[JENKINS] Archiving <https://builds.apache.org/job/unomi-master/ws/extensions/pom.xml>
to org.apache.unomi/unomi-extensions/1.0.1-incubating-SNAPSHOT/unomi-extensions-1.0.1-incubating-SNAPSHOT.pom
[JENKINS] Archiving <https://builds.apache.org/job/unomi-master/ws/extensions/lists-extension/rest/pom.xml>
to org.apache.unomi/cxs-lists-extension-rest/1.0.1-incubating-SNAPSHOT/cxs-lists-extension-rest-1.0.1-incubating-SNAPSHOT.pom
[JENKINS] Archiving <https://builds.apache.org/job/unomi-master/ws/extensions/geonames/pom.xml>
to org.apache.unomi/cxs-geonames/1.0.1-incubating-SNAPSHOT/cxs-geonames-1.0.1-incubating-SNAPSHOT.pom
[JENKINS] Archiving <https://builds.apache.org/job/unomi-master/ws/plugins/pom.xml>
to org.apache.unomi/unomi-plugins/1.0.1-incubating-SNAPSHOT/unomi-plugins-1.0.1-incubating-SNAPSHOT.pom
[JENKINS] Archiving <https://builds.apache.org/job/unomi-master/ws/plugins/mail/pom.xml>
to org.apache.unomi/unomi-plugins-mail/1.0.1-incubating-SNAPSHOT/unomi-plugins-mail-1.0.1-incubating-SNAPSHOT.pom
[JENKINS] Archiving <https://builds.apache.org/job/unomi-master/ws/extensions/privacy-extension/rest/pom.xml>
to org.apache.unomi/cxs-privacy-extension-rest/1.0.1-incubating-SNAPSHOT/cxs-privacy-extension-rest-1.0.1-incubating-SNAPSHOT.pom
[JENKINS] Archiving <https://builds.apache.org/job/unomi-master/ws/extensions/lists-extension/pom.xml>
to org.apache.unomi/cxs-lists-extension/1.0.1-incubating-SNAPSHOT/cxs-lists-extension-1.0.1-incubating-SNAPSHOT.pom
[JENKINS] Archiving <https://builds.apache.org/job/unomi-master/ws/kar/pom.xml> to org.apache.unomi/unomi-kar/1.0.1-incubating-SNAPSHOT/unomi-kar-1.0.1-incubating-SNAPSHOT.pom
[JENKINS] Archiving <https://builds.apache.org/job/unomi-master/ws/plugins/optimization-test/pom.xml>
to org.apache.unomi/unomi-plugins-optimization-test/1.0.1-incubating-SNAPSHOT/unomi-plugins-optimization-test-1.0.1-incubating-SNAPSHOT.pom
[JENKINS] Archiving <https://builds.apache.org/job/unomi-master/ws/plugins/past-event/pom.xml>
to org.apache.unomi/unomi-plugins-past-event/1.0.1-incubating-SNAPSHOT/unomi-plugins-past-event-1.0.1-incubating-SNAPSHOT.pom
[JENKINS] Archiving <https://builds.apache.org/job/unomi-master/ws/persistence-elasticsearch/plugins/pom.xml>
to org.apache.unomi/unomi-persistence-elasticsearch-plugins/1.0.1-incubating-SNAPSHOT/unomi-persistence-elasticsearch-plugins-1.0.1-incubating-SNAPSHOT.pom
[JENKINS] Archiving <https://builds.apache.org/job/unomi-master/ws/extensions/privacy-extension/pom.xml>
to org.apache.unomi/cxs-privacy-extension/1.0.1-incubating-SNAPSHOT/cxs-privacy-extension-1.0.1-incubating-SNAPSHOT.pom
[JENKINS] Archiving <https://builds.apache.org/job/unomi-master/ws/persistence-spi/pom.xml>
to org.apache.unomi/unomi-persistence-spi/1.0.1-incubating-SNAPSHOT/unomi-persistence-spi-1.0.1-incubating-SNAPSHOT.pom
[JENKINS] Archiving <https://builds.apache.org/job/unomi-master/ws/wab/pom.xml> to org.apache.unomi/unomi-wab/1.0.1-incubating-SNAPSHOT/unomi-wab-1.0.1-incubating-SNAPSHOT.pom
[JENKINS] Archiving <https://builds.apache.org/job/unomi-master/ws/extensions/geonames/services/pom.xml>
to org.apache.unomi/cxs-geonames-services/1.0.1-incubating-SNAPSHOT/cxs-geonames-services-1.0.1-incubating-SNAPSHOT.pom
[JENKINS] Archiving <https://builds.apache.org/job/unomi-master/ws/plugins/baseplugin/pom.xml>
to org.apache.unomi/unomi-plugins-base/1.0.1-incubating-SNAPSHOT/unomi-plugins-base-1.0.1-incubating-SNAPSHOT.pom
[JENKINS] Archiving <https://builds.apache.org/job/unomi-master/ws/persistence-elasticsearch/pom.xml>
to org.apache.unomi/unomi-persistence-elasticsearch/1.0.1-incubating-SNAPSHOT/unomi-persistence-elasticsearch-1.0.1-incubating-SNAPSHOT.pom
[JENKINS] Archiving <https://builds.apache.org/job/unomi-master/ws/itests/pom.xml> to
org.apache.unomi/unomi-itests/1.0.1-incubating-SNAPSHOT/unomi-itests-1.0.1-incubating-SNAPSHOT.pom
Sending e-mails to: commits@unomi.incubator.apache.org
channel stopped

Mime
View raw message