unomi-commits mailing list archives

Site index · List index
Message view « Date » · « Thread »
Top « Date » · « Thread »
From Apache Jenkins Server <jenk...@builds.apache.org>
Subject Build failed in Jenkins: unomi-master #17
Date Wed, 27 Apr 2016 13:40:33 GMT
See <https://builds.apache.org/job/unomi-master/17/changes>

Changes:

[draier] UNOMI-29 : always use current profile

------------------------------------------
[...truncated 1764 lines...]
jdk1.7.0_51/jre/lib/amd64/libnet.so
jdk1.7.0_51/jre/lib/amd64/libattach.so
jdk1.7.0_51/jre/lib/amd64/libsaproc.so
jdk1.7.0_51/jre/lib/amd64/jli/
jdk1.7.0_51/jre/lib/amd64/jli/libjli.so
jdk1.7.0_51/jre/lib/amd64/libjfxwebkit.so
jdk1.7.0_51/jre/lib/amd64/libnpt.so
jdk1.7.0_51/jre/lib/amd64/libjavafx-font.so
jdk1.7.0_51/jre/lib/amd64/libawt.so
jdk1.7.0_51/jre/lib/amd64/libprism-es2.so
jdk1.7.0_51/jre/lib/amd64/libsplashscreen.so
jdk1.7.0_51/jre/lib/amd64/libj2pcsc.so
jdk1.7.0_51/jre/lib/amd64/libmlib_image.so
jdk1.7.0_51/jre/lib/amd64/libj2pkcs11.so
jdk1.7.0_51/jre/lib/amd64/libsctp.so
jdk1.7.0_51/jre/lib/amd64/libdt_socket.so
jdk1.7.0_51/jre/lib/amd64/libjavafx-iio.so
jdk1.7.0_51/jre/lib/amd64/libjavaplugin_jni.so
jdk1.7.0_51/jre/lib/amd64/libgstplugins-lite.so
jdk1.7.0_51/jre/lib/amd64/libsunec.so
jdk1.7.0_51/jre/lib/amd64/libnpjp2.so
jdk1.7.0_51/jre/lib/amd64/libdeploy.so
jdk1.7.0_51/jre/lib/amd64/libjava_crw_demo.so
jdk1.7.0_51/jre/lib/amd64/libunpack.so
jdk1.7.0_51/jre/lib/amd64/libjfr.so
jdk1.7.0_51/jre/lib/amd64/libj2gss.so
jdk1.7.0_51/jre/lib/amd64/libt2k.so
jdk1.7.0_51/jre/lib/amd64/libverify.so
jdk1.7.0_51/jre/lib/amd64/libdcpr.so
jdk1.7.0_51/jre/lib/amd64/libjava.so
jdk1.7.0_51/jre/lib/amd64/libJdbcOdbc.so
jdk1.7.0_51/jre/lib/amd64/fxavcodecplugin-52.so
jdk1.7.0_51/jre/lib/amd64/server/
jdk1.7.0_51/jre/lib/amd64/server/libjsig.so
jdk1.7.0_51/jre/lib/amd64/server/Xusage.txt
jdk1.7.0_51/jre/lib/amd64/server/libjvm.so
jdk1.7.0_51/jre/lib/amd64/fxplugins.so
jdk1.7.0_51/jre/lib/amd64/xawt/
jdk1.7.0_51/jre/lib/amd64/xawt/libmawt.so
jdk1.7.0_51/jre/lib/amd64/fxavcodecplugin-53.so
jdk1.7.0_51/jre/lib/amd64/libjaas_unix.so
jdk1.7.0_51/jre/lib/amd64/libgstreamer-lite.so
jdk1.7.0_51/jre/lib/amd64/libmanagement.so
jdk1.7.0_51/jre/lib/amd64/jvm.cfg
jdk1.7.0_51/jre/lib/amd64/libjsdt.so
jdk1.7.0_51/jre/lib/amd64/libzip.so
jdk1.7.0_51/jre/lib/amd64/libglass.so
jdk1.7.0_51/jre/lib/amd64/headless/
jdk1.7.0_51/jre/lib/amd64/headless/libmawt.so
jdk1.7.0_51/jre/lib/amd64/libjsound.so
jdk1.7.0_51/jre/lib/amd64/libjdwp.so
jdk1.7.0_51/jre/lib/amd64/libjawt.so
jdk1.7.0_51/jre/lib/fontconfig.SuSE.10.bfc
jdk1.7.0_51/jre/lib/classlist
jdk1.7.0_51/jre/lib/management-agent.jar
jdk1.7.0_51/jre/lib/javaws.jar
jdk1.7.0_51/jre/lib/psfontj2d.properties
jdk1.7.0_51/jre/lib/rt.jar
jdk1.7.0_51/jre/lib/calendars.properties
jdk1.7.0_51/jre/lib/security/
jdk1.7.0_51/jre/lib/security/local_policy.jar
jdk1.7.0_51/jre/lib/security/trusted.libraries
jdk1.7.0_51/jre/lib/security/javafx.policy
jdk1.7.0_51/jre/lib/security/cacerts
jdk1.7.0_51/jre/lib/security/java.policy
jdk1.7.0_51/jre/lib/security/US_export_policy.jar
jdk1.7.0_51/jre/lib/security/java.security
jdk1.7.0_51/jre/lib/security/blacklist
jdk1.7.0_51/jre/lib/security/javaws.policy
jdk1.7.0_51/jre/lib/jfxrt.jar
jdk1.7.0_51/jre/lib/fontconfig.Turbo.properties.src
jdk1.7.0_51/jre/lib/jfr/
jdk1.7.0_51/jre/lib/jfr/profile.jfc
jdk1.7.0_51/jre/lib/jfr/default.jfc
jdk1.7.0_51/jre/lib/fontconfig.RedHat.5.properties.src
jdk1.7.0_51/jre/lib/net.properties
jdk1.7.0_51/jre/lib/content-types.properties
jdk1.7.0_51/jre/lib/fontconfig.RedHat.5.bfc
jdk1.7.0_51/jre/lib/alt-rt.jar
jdk1.7.0_51/jre/lib/logging.properties
jdk1.7.0_51/jre/lib/applet/
jdk1.7.0_51/jre/lib/cmm/
jdk1.7.0_51/jre/lib/cmm/LINEAR_RGB.pf
jdk1.7.0_51/jre/lib/cmm/GRAY.pf
jdk1.7.0_51/jre/lib/cmm/sRGB.pf
jdk1.7.0_51/jre/lib/cmm/PYCC.pf
jdk1.7.0_51/jre/lib/cmm/CIEXYZ.pf
jdk1.7.0_51/jre/lib/locale/
jdk1.7.0_51/jre/lib/locale/zh_TW.BIG5/
jdk1.7.0_51/jre/lib/locale/zh_TW.BIG5/LC_MESSAGES/
jdk1.7.0_51/jre/lib/locale/zh_TW.BIG5/LC_MESSAGES/sunw_java_plugin.mo
jdk1.7.0_51/jre/lib/locale/pt_BR/
jdk1.7.0_51/jre/lib/locale/pt_BR/LC_MESSAGES/
jdk1.7.0_51/jre/lib/locale/pt_BR/LC_MESSAGES/sunw_java_plugin.mo
jdk1.7.0_51/jre/lib/locale/de/
jdk1.7.0_51/jre/lib/locale/de/LC_MESSAGES/
jdk1.7.0_51/jre/lib/locale/de/LC_MESSAGES/sunw_java_plugin.mo
jdk1.7.0_51/jre/lib/locale/it/
jdk1.7.0_51/jre/lib/locale/it/LC_MESSAGES/
jdk1.7.0_51/jre/lib/locale/it/LC_MESSAGES/sunw_java_plugin.mo
jdk1.7.0_51/jre/lib/locale/zh_TW/
jdk1.7.0_51/jre/lib/locale/zh_TW/LC_MESSAGES/
jdk1.7.0_51/jre/lib/locale/zh_TW/LC_MESSAGES/sunw_java_plugin.mo
jdk1.7.0_51/jre/lib/locale/zh/
jdk1.7.0_51/jre/lib/locale/zh/LC_MESSAGES/
jdk1.7.0_51/jre/lib/locale/zh/LC_MESSAGES/sunw_java_plugin.mo
jdk1.7.0_51/jre/lib/locale/ja/
jdk1.7.0_51/jre/lib/locale/ja/LC_MESSAGES/
jdk1.7.0_51/jre/lib/locale/ja/LC_MESSAGES/sunw_java_plugin.mo
jdk1.7.0_51/jre/lib/locale/fr/
jdk1.7.0_51/jre/lib/locale/fr/LC_MESSAGES/
jdk1.7.0_51/jre/lib/locale/fr/LC_MESSAGES/sunw_java_plugin.mo
jdk1.7.0_51/jre/lib/locale/ko/
jdk1.7.0_51/jre/lib/locale/ko/LC_MESSAGES/
jdk1.7.0_51/jre/lib/locale/ko/LC_MESSAGES/sunw_java_plugin.mo
jdk1.7.0_51/jre/lib/locale/ko.UTF-8/
jdk1.7.0_51/jre/lib/locale/ko.UTF-8/LC_MESSAGES/
jdk1.7.0_51/jre/lib/locale/ko.UTF-8/LC_MESSAGES/sunw_java_plugin.mo
jdk1.7.0_51/jre/lib/locale/zh.GBK/
jdk1.7.0_51/jre/lib/locale/zh.GBK/LC_MESSAGES/
jdk1.7.0_51/jre/lib/locale/zh.GBK/LC_MESSAGES/sunw_java_plugin.mo
jdk1.7.0_51/jre/lib/locale/sv/
jdk1.7.0_51/jre/lib/locale/sv/LC_MESSAGES/
jdk1.7.0_51/jre/lib/locale/sv/LC_MESSAGES/sunw_java_plugin.mo
jdk1.7.0_51/jre/lib/locale/zh_HK.BIG5HK/
jdk1.7.0_51/jre/lib/locale/zh_HK.BIG5HK/LC_MESSAGES/
jdk1.7.0_51/jre/lib/locale/zh_HK.BIG5HK/LC_MESSAGES/sunw_java_plugin.mo
jdk1.7.0_51/jre/lib/locale/es/
jdk1.7.0_51/jre/lib/locale/es/LC_MESSAGES/
jdk1.7.0_51/jre/lib/locale/es/LC_MESSAGES/sunw_java_plugin.mo
jdk1.7.0_51/jre/lib/fonts/
jdk1.7.0_51/jre/lib/fonts/LucidaBrightDemiBold.ttf
jdk1.7.0_51/jre/lib/fonts/LucidaBrightItalic.ttf
jdk1.7.0_51/jre/lib/fonts/LucidaSansDemiBold.ttf
jdk1.7.0_51/jre/lib/fonts/LucidaTypewriterRegular.ttf
jdk1.7.0_51/jre/lib/fonts/LucidaBrightDemiItalic.ttf
jdk1.7.0_51/jre/lib/fonts/LucidaTypewriterBold.ttf
jdk1.7.0_51/jre/lib/fonts/LucidaSansRegular.ttf
jdk1.7.0_51/jre/lib/fonts/fonts.dir
jdk1.7.0_51/jre/lib/fonts/LucidaBrightRegular.ttf
jdk1.7.0_51/jre/lib/ext/
jdk1.7.0_51/jre/lib/ext/sunjce_provider.jar
jdk1.7.0_51/jre/lib/ext/meta-index
jdk1.7.0_51/jre/lib/ext/zipfs.jar
jdk1.7.0_51/jre/lib/ext/sunpkcs11.jar
jdk1.7.0_51/jre/lib/ext/dnsns.jar
jdk1.7.0_51/jre/lib/ext/localedata.jar
jdk1.7.0_51/jre/lib/ext/sunec.jar
jdk1.7.0_51/jre/lib/fontconfig.Turbo.bfc
jdk1.7.0_51/jre/lib/fontconfig.properties.src
jdk1.7.0_51/jre/lib/jce.jar
jdk1.7.0_51/jre/lib/fontconfig.RedHat.6.bfc
jdk1.7.0_51/jre/lib/currency.data
jdk1.7.0_51/jre/lib/javafx.properties
jdk1.7.0_51/jre/THIRDPARTYLICENSEREADME.txt
jdk1.7.0_51/jre/Welcome.html
jdk1.7.0_51/jre/LICENSE
jdk1.7.0_51/jre/plugin/
jdk1.7.0_51/jre/plugin/desktop/
jdk1.7.0_51/jre/plugin/desktop/sun_java.png
jdk1.7.0_51/jre/plugin/desktop/sun_java.desktop
jdk1.7.0_51/jre/COPYRIGHT
jdk1.7.0_51/jre/THIRDPARTYLICENSEREADME-JAVAFX.txt
jdk1.7.0_51/LICENSE
jdk1.7.0_51/COPYRIGHT
jdk1.7.0_51/THIRDPARTYLICENSEREADME-JAVAFX.txt
Building remotely on jenkins-test-170 (jenkins-cloud-4GB cloud-slave Ubuntu ubuntu jenkins-cloud-8GB)
in workspace <https://builds.apache.org/job/unomi-master/ws/>
Cloning the remote Git repository
Cloning repository https://git-wip-us.apache.org/repos/asf/incubator-unomi.git
 > git init <https://builds.apache.org/job/unomi-master/ws/> # timeout=10
Fetching upstream changes from https://git-wip-us.apache.org/repos/asf/incubator-unomi.git
 > git --version # timeout=10
 > git -c core.askpass=true fetch --tags --progress https://git-wip-us.apache.org/repos/asf/incubator-unomi.git
+refs/heads/*:refs/remotes/origin/*
 > git config remote.origin.url https://git-wip-us.apache.org/repos/asf/incubator-unomi.git
# timeout=10
 > git config --add remote.origin.fetch +refs/heads/*:refs/remotes/origin/* # timeout=10
 > git config remote.origin.url https://git-wip-us.apache.org/repos/asf/incubator-unomi.git
# timeout=10
Fetching upstream changes from https://git-wip-us.apache.org/repos/asf/incubator-unomi.git
 > git -c core.askpass=true fetch --tags --progress https://git-wip-us.apache.org/repos/asf/incubator-unomi.git
+refs/heads/*:refs/remotes/origin/*
 > git rev-parse refs/remotes/origin/master^{commit} # timeout=10
 > git rev-parse refs/remotes/origin/origin/master^{commit} # timeout=10
Checking out Revision 6eb486ea867a5a185da65657ad8ab95420cf9a6c (refs/remotes/origin/master)
 > git config core.sparsecheckout # timeout=10
 > git checkout -f 6eb486ea867a5a185da65657ad8ab95420cf9a6c
 > git rev-list 510ae898bfe57e948c7d4c0b0b80f7f561217b5f # timeout=10
Parsing POMs
ERROR: Failed to parse POMs
java.io.IOException: remote file operation failed: <https://builds.apache.org/job/unomi-master/ws/>
at hudson.remoting.Channel@170b2893:jenkins-test-170: hudson.remoting.ProxyException: hudson.maven.MavenModuleSetBuild$MavenExecutionException:
hudson.maven.MavenEmbedderException: 1 problem was encountered while building the effective
settings
[FATAL] Non-parseable settings /home/jenkins/.m2/settings.xml: unexpected character in markup
% (position: START_TAG seen ...</username>\n     <password><%... @14:18)  @
/home/jenkins/.m2/settings.xml, line 14, column 18

	at hudson.FilePath.act(FilePath.java:986)
	at hudson.FilePath.act(FilePath.java:968)
	at hudson.maven.MavenModuleSetBuild$MavenModuleSetBuildExecution.parsePoms(MavenModuleSetBuild.java:960)
	at hudson.maven.MavenModuleSetBuild$MavenModuleSetBuildExecution.doRun(MavenModuleSetBuild.java:679)
	at hudson.model.AbstractBuild$AbstractBuildExecution.run(AbstractBuild.java:534)
	at hudson.model.Run.execute(Run.java:1738)
	at hudson.maven.MavenModuleSetBuild.run(MavenModuleSetBuild.java:531)
	at hudson.model.ResourceController.execute(ResourceController.java:98)
	at hudson.model.Executor.run(Executor.java:410)
Caused by: hudson.remoting.ProxyException: hudson.maven.MavenModuleSetBuild$MavenExecutionException:
hudson.maven.MavenEmbedderException: 1 problem was encountered while building the effective
settings
[FATAL] Non-parseable settings /home/jenkins/.m2/settings.xml: unexpected character in markup
% (position: START_TAG seen ...</username>\n     <password><%... @14:18)  @
/home/jenkins/.m2/settings.xml, line 14, column 18

	at hudson.maven.MavenModuleSetBuild$PomParser.invoke(MavenModuleSetBuild.java:1362)
	at hudson.maven.MavenModuleSetBuild$PomParser.invoke(MavenModuleSetBuild.java:1098)
	at hudson.FilePath$FileCallableWrapper.call(FilePath.java:2719)
	at hudson.remoting.UserRequest.perform(UserRequest.java:120)
	at hudson.remoting.UserRequest.perform(UserRequest.java:48)
	at hudson.remoting.Request$2.run(Request.java:326)
	at hudson.remoting.InterceptingExecutorService$1.call(InterceptingExecutorService.java:68)
	at java.util.concurrent.FutureTask.run(FutureTask.java:262)
	at java.util.concurrent.ThreadPoolExecutor.runWorker(ThreadPoolExecutor.java:1145)
	at java.util.concurrent.ThreadPoolExecutor$Worker.run(ThreadPoolExecutor.java:615)
	at java.lang.Thread.run(Thread.java:745)
	at ......remote call to jenkins-test-170(Native Method)
	at hudson.remoting.Channel.attachCallSiteStackTrace(Channel.java:1416)
	at hudson.remoting.UserResponse.retrieve(UserRequest.java:220)
	at hudson.remoting.Channel.call(Channel.java:781)
	at hudson.FilePath.act(FilePath.java:979)
	... 8 more
Caused by: hudson.remoting.ProxyException: hudson.maven.MavenEmbedderException: 1 problem
was encountered while building the effective settings
[FATAL] Non-parseable settings /home/jenkins/.m2/settings.xml: unexpected character in markup
% (position: START_TAG seen ...</username>\n     <password><%... @14:18)  @
/home/jenkins/.m2/settings.xml, line 14, column 18

	at hudson.maven.MavenEmbedder.<init>(MavenEmbedder.java:128)
	at hudson.maven.MavenEmbedder.<init>(MavenEmbedder.java:109)
	at hudson.maven.MavenEmbedder.<init>(MavenEmbedder.java:136)
	at hudson.maven.MavenUtil.createEmbedder(MavenUtil.java:212)
	at hudson.maven.MavenModuleSetBuild$PomParser.invoke(MavenModuleSetBuild.java:1295)
	at hudson.maven.MavenModuleSetBuild$PomParser.invoke(MavenModuleSetBuild.java:1098)
	at hudson.FilePath$FileCallableWrapper.call(FilePath.java:2719)
	at hudson.remoting.UserRequest.perform(UserRequest.java:120)
	at hudson.remoting.UserRequest.perform(UserRequest.java:48)
	at hudson.remoting.Request$2.run(Request.java:326)
	at hudson.remoting.InterceptingExecutorService$1.call(InterceptingExecutorService.java:68)
	at java.util.concurrent.FutureTask.run(FutureTask.java:262)
	at java.util.concurrent.ThreadPoolExecutor.runWorker(ThreadPoolExecutor.java:1145)
	at java.util.concurrent.ThreadPoolExecutor$Worker.run(ThreadPoolExecutor.java:615)
	at java.lang.Thread.run(Thread.java:745)
Caused by: hudson.remoting.ProxyException: hudson.maven.MavenEmbedderException: 1 problem
was encountered while building the effective settings
[FATAL] Non-parseable settings /home/jenkins/.m2/settings.xml: unexpected character in markup
% (position: START_TAG seen ...</username>\n     <password><%... @14:18)  @
/home/jenkins/.m2/settings.xml, line 14, column 18

	at hudson.maven.MavenEmbedder.getSettings(MavenEmbedder.java:261)
	at hudson.maven.MavenEmbedder.buildMavenExecutionRequest(MavenEmbedder.java:157)
	at hudson.maven.MavenEmbedder.<init>(MavenEmbedder.java:120)
	... 14 more
Caused by: hudson.remoting.ProxyException: org.apache.maven.settings.building.SettingsBuildingException:
1 problem was encountered while building the effective settings
[FATAL] Non-parseable settings /home/jenkins/.m2/settings.xml: unexpected character in markup
% (position: START_TAG seen ...</username>\n     <password><%... @14:18)  @
/home/jenkins/.m2/settings.xml, line 14, column 18

	at org.apache.maven.settings.building.DefaultSettingsBuilder.build(DefaultSettingsBuilder.java:116)
	at hudson.maven.MavenEmbedder.getSettings(MavenEmbedder.java:259)
	... 16 more

Mime
View raw message