unomi-commits mailing list archives

Site index · List index
Message view « Date » · « Thread »
Top « Date » · « Thread »
From Apache Jenkins Server <jenk...@builds.apache.org>
Subject Build failed in Jenkins: unomi-master #40
Date Mon, 25 Jul 2016 13:35:05 GMT
See <https://builds.apache.org/job/unomi-master/40/changes>

Changes:

[shuber] UNOMI-19 Rationalize dependencies management

[shuber] UNOMI-18 Upgrade to commons-collections 3.2.2

------------------------------------------
[...truncated 1166 lines...]
[INFO] --- maven-compiler-plugin:3.2:testCompile (default-testCompile) @ unomi-wab ---
[INFO] No sources to compile
[INFO] 
[INFO] --- maven-surefire-plugin:2.18.1:test (default-test) @ unomi-wab ---
[JENKINS] Recording test results[INFO] 
[INFO] --- maven-bundle-plugin:3.2.0:bundle (default-bundle) @ unomi-wab ---

[INFO] 
[INFO] --- maven-site-plugin:3.3:attach-descriptor (attach-descriptor) @ unomi-wab ---
[INFO] 
[INFO] --- build-helper-maven-plugin:1.10:attach-artifact (attach-artifacts) @ unomi-wab ---
[INFO] 
[INFO] --- apache-rat-plugin:0.11:check (default) @ unomi-wab ---
[INFO] 51 implicit excludes (use -debug for more details).
[INFO] Exclude: **/NOTICE.template
[INFO] Exclude: **/NOTICE-generated
[INFO] Exclude: **/target/**/*
[INFO] Exclude: **/.git/**/*
[INFO] Exclude: **/.idea/**/*
[INFO] Exclude: **/*.iml
[INFO] Exclude: **/*.ipr
[INFO] Exclude: **/*.iws
[INFO] Exclude: **/.*
[INFO] Exclude: **/eclipse-classes/**/*
[INFO] Exclude: **/dependency-reduced-pom.xml
[INFO] Exclude: **/.settings/**
[INFO] Exclude: **/bin/**
[INFO] Exclude: **/goal.txt
[INFO] Exclude: **/grep.txt
[INFO] Exclude: **/edit.txt
[INFO] Exclude: **/wc.txt
[INFO] Exclude: **/foo
[INFO] Exclude: **/org.ops4j.pax.exam.TestContainerFactory
[INFO] Exclude: **/maven-metadata-local.xml
[INFO] Exclude: **/src/test/resources/data/*.txt
[INFO] Exclude: **/keystore
[INFO] Exclude: **/*.css
[INFO] Exclude: **/*.ssp
[INFO] Exclude: **/*.conf
[INFO] Exclude: **/*.mf
[INFO] Exclude: **/*.json
[INFO] Exclude: **/*.key
[INFO] Exclude: .repository/**
[INFO] Exclude: **/*.jar
[INFO] Exclude: **/src/main/webapp/WEB-INF/beans.xml
[INFO] Exclude: **/src/main/webapp/robots.txt
[INFO] Exclude: **/src/main/resources/elasticsearch.yml
[INFO] Exclude: **/*.log
[INFO] 11 resources included (use -debug for more details)
Warning:  org.apache.xerces.jaxp.SAXParserImpl$JAXPSAXParser: Property 'http://www.oracle.com/xml/jaxp/properties/entityExpansionLimit'
is not recognized.
Compiler warnings:
  WARNING:  'org.apache.xerces.jaxp.SAXParserImpl: Property 'http://javax.xml.XMLConstants/property/accessExternalDTD'
is not recognized.'
Warning:  org.apache.xerces.parsers.SAXParser: Feature 'http://javax.xml.XMLConstants/feature/secure-processing'
is not recognized.
Warning:  org.apache.xerces.parsers.SAXParser: Property 'http://javax.xml.XMLConstants/property/accessExternalDTD'
is not recognized.
Warning:  org.apache.xerces.parsers.SAXParser: Property 'http://www.oracle.com/xml/jaxp/properties/entityExpansionLimit'
is not recognized.
[INFO] Rat check: Summary of files. Unapproved: 0 unknown: 0 generated: 0 approved: 11 licence.
[INFO] 
[INFO] --- maven-install-plugin:2.5.2:install (default-install) @ unomi-wab ---
[INFO] Installing <https://builds.apache.org/job/unomi-master/ws/wab/target/unomi-wab-1.1.0-incubating-SNAPSHOT.jar>
to /home/jenkins/jenkins-slave/maven-repositories/1/org/apache/unomi/unomi-wab/1.1.0-incubating-SNAPSHOT/unomi-wab-1.1.0-incubating-SNAPSHOT.jar
[INFO] Installing <https://builds.apache.org/job/unomi-master/ws/wab/pom.xml> to /home/jenkins/jenkins-slave/maven-repositories/1/org/apache/unomi/unomi-wab/1.1.0-incubating-SNAPSHOT/unomi-wab-1.1.0-incubating-SNAPSHOT.pom
[INFO] Installing <https://builds.apache.org/job/unomi-master/ws/wab/src/main/resources/org.apache.unomi.web.cfg>
to /home/jenkins/jenkins-slave/maven-repositories/1/org/apache/unomi/unomi-wab/1.1.0-incubating-SNAPSHOT/unomi-wab-1.1.0-incubating-SNAPSHOT-unomicfg.cfg
[INFO] 
[INFO] --- maven-bundle-plugin:3.2.0:install (default-install) @ unomi-wab ---
[INFO] Installing org/apache/unomi/unomi-wab/1.1.0-incubating-SNAPSHOT/unomi-wab-1.1.0-incubating-SNAPSHOT.jar
[INFO] Writing OBR metadata
[INFO] 
[INFO] --- maven-deploy-plugin:2.8.2:deploy (default-deploy) @ unomi-wab ---
[INFO] Downloading: https://repository.apache.org/content/repositories/snapshots/org/apache/unomi/unomi-wab/1.1.0-incubating-SNAPSHOT/maven-metadata.xml
[INFO] Downloaded: https://repository.apache.org/content/repositories/snapshots/org/apache/unomi/unomi-wab/1.1.0-incubating-SNAPSHOT/maven-metadata.xml
(2 KB at 1.6 KB/sec)
[INFO] Uploading: https://repository.apache.org/content/repositories/snapshots/org/apache/unomi/unomi-wab/1.1.0-incubating-SNAPSHOT/unomi-wab-1.1.0-incubating-20160725.133000-8.jar
[INFO] Uploaded: https://repository.apache.org/content/repositories/snapshots/org/apache/unomi/unomi-wab/1.1.0-incubating-SNAPSHOT/unomi-wab-1.1.0-incubating-20160725.133000-8.jar
(274 KB at 2.0 KB/sec)
[INFO] Uploading: https://repository.apache.org/content/repositories/snapshots/org/apache/unomi/unomi-wab/1.1.0-incubating-SNAPSHOT/unomi-wab-1.1.0-incubating-20160725.133000-8.pom
[INFO] ------------------------------------------------------------------------
[INFO] Reactor Summary:
[INFO] 
[INFO] Apache Unomi :: Root Project ....................... SUCCESS [04:45 min]
[INFO] Apache Unomi :: Specification API .................. SUCCESS [09:04 min]
[INFO] Apache Unomi :: Persistence :: SPI (Service Provider Interface) SUCCESS [ 11.473 s]
[INFO] Apache Unomi :: Persistence :: ElasticSearch ....... SUCCESS [  4.390 s]
[INFO] Apache Unomi :: Persistence :: ElasticSearch :: Core SUCCESS [15:56 min]
[INFO] Apache Unomi :: Persistence :: ElasticSearch :: Plugins SUCCESS [04:17 min]
[INFO] Apache Unomi :: Persistence :: ElasticSearch :: Plugins :: Security SUCCESS [10:45
min]
[INFO] Apache Unomi :: Core Services ...................... SUCCESS [03:44 min]
[INFO] Apache Unomi :: REST API ........................... SUCCESS [01:31 min]
[INFO] Apache Unomi :: Core Web Application ............... FAILURE [03:47 min]
[INFO] Apache Unomi :: Plugins ............................ SKIPPED
[INFO] Apache Unomi :: Plugins :: Base Actions and Conditions SKIPPED
[INFO] Apache Unomi :: Plugins :: Request reading actions . SKIPPED
[INFO] Apache Unomi :: Plugins :: Mail notifications actions SKIPPED
[INFO] Apache Unomi :: Plugins :: Rules and Actions for optimization tests (A/B testing) SKIPPED
[INFO] Apache Unomi :: Plugins :: Hover event support ..... SKIPPED
[INFO] Apache Unomi :: Plugins :: Conditions based on past events SKIPPED
[INFO] Apache Unomi :: Plugins :: Conditions for events that need to be tracked SKIPPED
[INFO] Apache Unomi :: Extensions ......................... SKIPPED
[INFO] Apache Unomi :: Extensions :: Lists ................ SKIPPED
[INFO] Apache Unomi :: Extensions :: Lists :: Service ..... SKIPPED
[INFO] Apache Unomi :: Extensions :: Lists :: REST API .... SKIPPED
[INFO] Apache Unomi :: Extensions :: Privacy .............. SKIPPED
[INFO] Apache Unomi :: Extensions :: Privacy :: Services .. SKIPPED
[INFO] Apache Unomi :: Extensions :: Privacy :: REST API .. SKIPPED
[INFO] Apache Unomi :: Extensions :: Geonames Database .... SKIPPED
[INFO] Apache Unomi :: Extensions :: Geonames Database :: Service SKIPPED
[INFO] Apache Unomi :: Extensions :: Geonames Database :: REST API SKIPPED
[INFO] Apache Unomi :: Karaf KAR package .................. SKIPPED
[INFO] Apache Unomi :: Samples ............................ SKIPPED
[INFO] Apache Unomi :: Samples :: Tweet Button plugin ..... SKIPPED
[INFO] Apache Unomi :: Distribution Package ............... SKIPPED
[INFO] Apache Unomi :: Integration Tests .................. SKIPPED
[INFO] Apache Unomi :: Performance Tests .................. SKIPPED
[INFO] ------------------------------------------------------------------------
[INFO] BUILD FAILURE
[INFO] ------------------------------------------------------------------------
[INFO] Total time: 54:29 min
[INFO] Finished at: 2016-07-25T13:33:51+00:00
[INFO] Final Memory: 67M/1015M
[INFO] ------------------------------------------------------------------------
Waiting for Jenkins to finish collecting data
[ERROR] Failed to execute goal org.apache.maven.plugins:maven-deploy-plugin:2.8.2:deploy (default-deploy)
on project unomi-wab: Failed to deploy artifacts: Could not transfer artifact org.apache.unomi:unomi-wab:pom:1.1.0-incubating-20160725.133000-8
from/to apache.snapshots.https (https://repository.apache.org/content/repositories/snapshots):
Failed to transfer file: https://repository.apache.org/content/repositories/snapshots/org/apache/unomi/unomi-wab/1.1.0-incubating-SNAPSHOT/unomi-wab-1.1.0-incubating-20160725.133000-8.pom.
Return code is: 502, ReasonPhrase: Proxy Error. -> [Help 1]
org.apache.maven.lifecycle.LifecycleExecutionException: Failed to execute goal org.apache.maven.plugins:maven-deploy-plugin:2.8.2:deploy
(default-deploy) on project unomi-wab: Failed to deploy artifacts: Could not transfer artifact
org.apache.unomi:unomi-wab:pom:1.1.0-incubating-20160725.133000-8 from/to apache.snapshots.https
(https://repository.apache.org/content/repositories/snapshots): Failed to transfer file: https://repository.apache.org/content/repositories/snapshots/org/apache/unomi/unomi-wab/1.1.0-incubating-SNAPSHOT/unomi-wab-1.1.0-incubating-20160725.133000-8.pom.
Return code is: 502, ReasonPhrase: Proxy Error.
	at org.apache.maven.lifecycle.internal.MojoExecutor.execute(MojoExecutor.java:216)
	at org.apache.maven.lifecycle.internal.MojoExecutor.execute(MojoExecutor.java:153)
	at org.apache.maven.lifecycle.internal.MojoExecutor.execute(MojoExecutor.java:145)
	at org.apache.maven.lifecycle.internal.LifecycleModuleBuilder.buildProject(LifecycleModuleBuilder.java:116)
	at org.apache.maven.lifecycle.internal.LifecycleModuleBuilder.buildProject(LifecycleModuleBuilder.java:80)
	at org.apache.maven.lifecycle.internal.builder.singlethreaded.SingleThreadedBuilder.build(SingleThreadedBuilder.java:51)
	at org.apache.maven.lifecycle.internal.LifecycleStarter.execute(LifecycleStarter.java:128)
	at org.apache.maven.DefaultMaven.doExecute(DefaultMaven.java:307)
	at org.apache.maven.DefaultMaven.doExecute(DefaultMaven.java:193)
	at org.apache.maven.DefaultMaven.execute(DefaultMaven.java:106)
	at org.jvnet.hudson.maven3.launcher.Maven32Launcher.main(Maven32Launcher.java:132)
	at sun.reflect.NativeMethodAccessorImpl.invoke0(Native Method)
	at sun.reflect.NativeMethodAccessorImpl.invoke(NativeMethodAccessorImpl.java:57)
	at sun.reflect.DelegatingMethodAccessorImpl.invoke(DelegatingMethodAccessorImpl.java:43)
	at java.lang.reflect.Method.invoke(Method.java:606)
	at org.codehaus.plexus.classworlds.launcher.Launcher.launchStandard(Launcher.java:330)
	at org.codehaus.plexus.classworlds.launcher.Launcher.launch(Launcher.java:238)
	at jenkins.maven3.agent.Maven32Main.launch(Maven32Main.java:186)
	at sun.reflect.NativeMethodAccessorImpl.invoke0(Native Method)
	at sun.reflect.NativeMethodAccessorImpl.invoke(NativeMethodAccessorImpl.java:57)
	at sun.reflect.DelegatingMethodAccessorImpl.invoke(DelegatingMethodAccessorImpl.java:43)
	at java.lang.reflect.Method.invoke(Method.java:606)
	at hudson.maven.Maven3Builder.call(Maven3Builder.java:136)
	at hudson.maven.Maven3Builder.call(Maven3Builder.java:71)
	at hudson.remoting.UserRequest.perform(UserRequest.java:120)
	at hudson.remoting.UserRequest.perform(UserRequest.java:48)
	at hudson.remoting.Request$2.run(Request.java:326)
	at hudson.remoting.InterceptingExecutorService$1.call(InterceptingExecutorService.java:68)
	at java.util.concurrent.FutureTask.run(FutureTask.java:262)
	at java.util.concurrent.ThreadPoolExecutor.runWorker(ThreadPoolExecutor.java:1145)
	at java.util.concurrent.ThreadPoolExecutor$Worker.run(ThreadPoolExecutor.java:615)
	at java.lang.Thread.run(Thread.java:744)
Caused by: org.apache.maven.plugin.MojoExecutionException: Failed to deploy artifacts: Could
not transfer artifact org.apache.unomi:unomi-wab:pom:1.1.0-incubating-20160725.133000-8 from/to
apache.snapshots.https (https://repository.apache.org/content/repositories/snapshots): Failed
to transfer file: https://repository.apache.org/content/repositories/snapshots/org/apache/unomi/unomi-wab/1.1.0-incubating-SNAPSHOT/unomi-wab-1.1.0-incubating-20160725.133000-8.pom.
Return code is: 502, ReasonPhrase: Proxy Error.
	at org.apache.maven.plugin.deploy.DeployMojo.deployProject(DeployMojo.java:284)
	at org.apache.maven.plugin.deploy.DeployMojo.execute(DeployMojo.java:169)
	at org.apache.maven.plugin.DefaultBuildPluginManager.executeMojo(DefaultBuildPluginManager.java:134)
	at org.apache.maven.lifecycle.internal.MojoExecutor.execute(MojoExecutor.java:208)
	... 31 more
Caused by: org.apache.maven.artifact.deployer.ArtifactDeploymentException: Failed to deploy
artifacts: Could not transfer artifact org.apache.unomi:unomi-wab:pom:1.1.0-incubating-20160725.133000-8
from/to apache.snapshots.https (https://repository.apache.org/content/repositories/snapshots):
Failed to transfer file: https://repository.apache.org/content/repositories/snapshots/org/apache/unomi/unomi-wab/1.1.0-incubating-SNAPSHOT/unomi-wab-1.1.0-incubating-20160725.133000-8.pom.
Return code is: 502, ReasonPhrase: Proxy Error.
	at org.apache.maven.artifact.deployer.DefaultArtifactDeployer.deploy(DefaultArtifactDeployer.java:143)
	at org.apache.maven.plugin.deploy.AbstractDeployMojo.deploy(AbstractDeployMojo.java:171)
	at org.apache.maven.plugin.deploy.DeployMojo.deployProject(DeployMojo.java:250)
	... 34 more
Caused by: org.eclipse.aether.deployment.DeploymentException: Failed to deploy artifacts:
Could not transfer artifact org.apache.unomi:unomi-wab:pom:1.1.0-incubating-20160725.133000-8
from/to apache.snapshots.https (https://repository.apache.org/content/repositories/snapshots):
Failed to transfer file: https://repository.apache.org/content/repositories/snapshots/org/apache/unomi/unomi-wab/1.1.0-incubating-SNAPSHOT/unomi-wab-1.1.0-incubating-20160725.133000-8.pom.
Return code is: 502, ReasonPhrase: Proxy Error.
	at org.eclipse.aether.internal.impl.DefaultDeployer.deploy(DefaultDeployer.java:317)
	at org.eclipse.aether.internal.impl.DefaultDeployer.deploy(DefaultDeployer.java:245)
	at org.eclipse.aether.internal.impl.DefaultRepositorySystem.deploy(DefaultRepositorySystem.java:413)
	at org.apache.maven.artifact.deployer.DefaultArtifactDeployer.deploy(DefaultArtifactDeployer.java:139)
	... 36 more
Caused by: org.eclipse.aether.transfer.ArtifactTransferException: Could not transfer artifact
org.apache.unomi:unomi-wab:pom:1.1.0-incubating-20160725.133000-8 from/to apache.snapshots.https
(https://repository.apache.org/content/repositories/snapshots): Failed to transfer file: https://repository.apache.org/content/repositories/snapshots/org/apache/unomi/unomi-wab/1.1.0-incubating-SNAPSHOT/unomi-wab-1.1.0-incubating-20160725.133000-8.pom.
Return code is: 502, ReasonPhrase: Proxy Error.
	at org.eclipse.aether.connector.basic.ArtifactTransportListener.transferFailed(ArtifactTransportListener.java:43)
	at org.eclipse.aether.connector.basic.BasicRepositoryConnector$TaskRunner.run(BasicRepositoryConnector.java:355)
	at org.eclipse.aether.connector.basic.BasicRepositoryConnector.put(BasicRepositoryConnector.java:274)
	at org.eclipse.aether.internal.impl.DefaultDeployer.deploy(DefaultDeployer.java:311)
	... 39 more
Caused by: org.apache.maven.wagon.TransferFailedException: Failed to transfer file: https://repository.apache.org/content/repositories/snapshots/org/apache/unomi/unomi-wab/1.1.0-incubating-SNAPSHOT/unomi-wab-1.1.0-incubating-20160725.133000-8.pom.
Return code is: 502, ReasonPhrase: Proxy Error.
	at org.apache.maven.wagon.providers.http.AbstractHttpClientWagon.put(AbstractHttpClientWagon.java:627)
	at org.apache.maven.wagon.providers.http.AbstractHttpClientWagon.put(AbstractHttpClientWagon.java:541)
	at org.apache.maven.wagon.providers.http.AbstractHttpClientWagon.put(AbstractHttpClientWagon.java:523)
	at org.apache.maven.wagon.providers.http.AbstractHttpClientWagon.put(AbstractHttpClientWagon.java:517)
	at org.apache.maven.wagon.providers.http.AbstractHttpClientWagon.put(AbstractHttpClientWagon.java:497)
	at org.eclipse.aether.transport.wagon.WagonTransporter$PutTaskRunner.run(WagonTransporter.java:644)
	at org.eclipse.aether.transport.wagon.WagonTransporter.execute(WagonTransporter.java:427)
	at org.eclipse.aether.transport.wagon.WagonTransporter.put(WagonTransporter.java:410)
	at org.eclipse.aether.connector.basic.BasicRepositoryConnector$PutTaskRunner.runTask(BasicRepositoryConnector.java:510)
	at org.eclipse.aether.connector.basic.BasicRepositoryConnector$TaskRunner.run(BasicRepositoryConnector.java:350)
	... 41 more
[ERROR] 
[ERROR] Re-run Maven using the -X switch to enable full debug logging.
[ERROR] 
[ERROR] For more information about the errors and possible solutions, please read the following
articles:
[ERROR] [Help 1] http://cwiki.apache.org/confluence/display/MAVEN/MojoExecutionException
[ERROR] 
[ERROR] After correcting the problems, you can resume the build with the command
[ERROR]   mvn <goals> -rf :unomi-wab
[JENKINS] Archiving <https://builds.apache.org/job/unomi-master/ws/pom.xml> to org.apache.unomi/unomi-root/1.1.0-incubating-SNAPSHOT/unomi-root-1.1.0-incubating-SNAPSHOT.pom
[JENKINS] Archiving <https://builds.apache.org/job/unomi-master/ws/target/unomi-root-1.1.0-incubating-SNAPSHOT-site.xml>
to org.apache.unomi/unomi-root/1.1.0-incubating-20160725.124122-9/unomi-root-1.1.0-incubating-20160725.124122-9-site.xml
[JENKINS] Archiving <https://builds.apache.org/job/unomi-master/ws/samples/pom.xml>
to org.apache.unomi/samples/1.1.0-incubating-SNAPSHOT/samples-1.1.0-incubating-SNAPSHOT.pom
[JENKINS] Archiving <https://builds.apache.org/job/unomi-master/ws/services/pom.xml>
to org.apache.unomi/unomi-services/1.1.0-incubating-SNAPSHOT/unomi-services-1.1.0-incubating-SNAPSHOT.pom
[JENKINS] Archiving <https://builds.apache.org/job/unomi-master/ws/services/target/unomi-services-1.1.0-incubating-SNAPSHOT.jar>
to org.apache.unomi/unomi-services/1.1.0-incubating-20160725.132446-9/unomi-services-1.1.0-incubating-20160725.132446-9.jar
[JENKINS] Archiving <https://builds.apache.org/job/unomi-master/ws/services/src/main/resources/org.apache.unomi.services.cfg>
to org.apache.unomi/unomi-services/1.1.0-incubating-20160725.132446-9/unomi-services-1.1.0-incubating-20160725.132446-9-servicescfg.cfg
[JENKINS] Archiving <https://builds.apache.org/job/unomi-master/ws/services/src/main/resources/org.apache.unomi.thirdparty.cfg>
to org.apache.unomi/unomi-services/1.1.0-incubating-20160725.132446-9/unomi-services-1.1.0-incubating-20160725.132446-9-thirdpartycfg.cfg
Compressed 1.92 MB of artifacts by 60.2% relative to #39
[JENKINS] Archiving <https://builds.apache.org/job/unomi-master/ws/rest/pom.xml> to
org.apache.unomi/unomi-rest/1.1.0-incubating-SNAPSHOT/unomi-rest-1.1.0-incubating-SNAPSHOT.pom
[JENKINS] Archiving <https://builds.apache.org/job/unomi-master/ws/rest/target/unomi-rest-1.1.0-incubating-SNAPSHOT.jar>
to org.apache.unomi/unomi-rest/1.1.0-incubating-20160725.132836-9/unomi-rest-1.1.0-incubating-20160725.132836-9.jar
[JENKINS] Archiving <https://builds.apache.org/job/unomi-master/ws/plugins/hover-event/pom.xml>
to org.apache.unomi/unomi-plugins-hover-event/1.1.0-incubating-SNAPSHOT/unomi-plugins-hover-event-1.1.0-incubating-SNAPSHOT.pom
[JENKINS] Archiving <https://builds.apache.org/job/unomi-master/ws/api/pom.xml> to org.apache.unomi/unomi-api/1.1.0-incubating-SNAPSHOT/unomi-api-1.1.0-incubating-SNAPSHOT.pom
[JENKINS] Archiving <https://builds.apache.org/job/unomi-master/ws/api/target/unomi-api-1.1.0-incubating-SNAPSHOT.jar>
to org.apache.unomi/unomi-api/1.1.0-incubating-20160725.124423-9/unomi-api-1.1.0-incubating-20160725.124423-9.jar
[JENKINS] Archiving <https://builds.apache.org/job/unomi-master/ws/extensions/lists-extension/services/pom.xml>
to org.apache.unomi/cxs-lists-extension-services/1.1.0-incubating-SNAPSHOT/cxs-lists-extension-services-1.1.0-incubating-SNAPSHOT.pom
[JENKINS] Archiving <https://builds.apache.org/job/unomi-master/ws/plugins/request/pom.xml>
to org.apache.unomi/unomi-plugins-request/1.1.0-incubating-SNAPSHOT/unomi-plugins-request-1.1.0-incubating-SNAPSHOT.pom
[JENKINS] Archiving <https://builds.apache.org/job/unomi-master/ws/extensions/geonames/rest/pom.xml>
to org.apache.unomi/cxs-geonames-rest/1.1.0-incubating-SNAPSHOT/cxs-geonames-rest-1.1.0-incubating-SNAPSHOT.pom
[JENKINS] Archiving <https://builds.apache.org/job/unomi-master/ws/performance-tests/pom.xml>
to org.apache.unomi/unomi-performance-tests/1.1.0-incubating-SNAPSHOT/unomi-performance-tests-1.1.0-incubating-SNAPSHOT.pom
[JENKINS] Archiving <https://builds.apache.org/job/unomi-master/ws/persistence-elasticsearch/core/pom.xml>
to org.apache.unomi/unomi-persistence-elasticsearch-core/1.1.0-incubating-SNAPSHOT/unomi-persistence-elasticsearch-core-1.1.0-incubating-SNAPSHOT.pom
[JENKINS] Archiving <https://builds.apache.org/job/unomi-master/ws/persistence-elasticsearch/core/target/unomi-persistence-elasticsearch-core-1.1.0-incubating-SNAPSHOT.jar>
to org.apache.unomi/unomi-persistence-elasticsearch-core/1.1.0-incubating-20160725.125617-9/unomi-persistence-elasticsearch-core-1.1.0-incubating-20160725.125617-9.jar
[JENKINS] Archiving <https://builds.apache.org/job/unomi-master/ws/persistence-elasticsearch/core/src/main/resources/org.apache.unomi.persistence.elasticsearch.cfg>
to org.apache.unomi/unomi-persistence-elasticsearch-core/1.1.0-incubating-20160725.125617-9/unomi-persistence-elasticsearch-core-1.1.0-incubating-20160725.125617-9-elasticsearchcfg.cfg
[JENKINS] Archiving <https://builds.apache.org/job/unomi-master/ws/persistence-elasticsearch/core/src/main/resources/elasticsearch.yml>
to org.apache.unomi/unomi-persistence-elasticsearch-core/1.1.0-incubating-20160725.125617-9/unomi-persistence-elasticsearch-core-1.1.0-incubating-20160725.125617-9-elasticsearchconfig.yml
Compressed 40.08 MB of artifacts by 74.1% relative to #39
[JENKINS] Archiving <https://builds.apache.org/job/unomi-master/ws/plugins/tracked-event/pom.xml>
to org.apache.unomi/unomi-plugins-tracked-event/1.1.0-incubating-SNAPSHOT/unomi-plugins-tracked-event-1.1.0-incubating-SNAPSHOT.pom
[JENKINS] Archiving <https://builds.apache.org/job/unomi-master/ws/extensions/privacy-extension/services/pom.xml>
to org.apache.unomi/cxs-privacy-extension-services/1.1.0-incubating-SNAPSHOT/cxs-privacy-extension-services-1.1.0-incubating-SNAPSHOT.pom
[JENKINS] Archiving <https://builds.apache.org/job/unomi-master/ws/package/pom.xml>
to org.apache.unomi/unomi/1.1.0-incubating-SNAPSHOT/unomi-1.1.0-incubating-SNAPSHOT.pom
[JENKINS] Archiving <https://builds.apache.org/job/unomi-master/ws/samples/tweet-button-plugin/pom.xml>
to org.apache.unomi/tweet-button-plugin/1.1.0-incubating-SNAPSHOT/tweet-button-plugin-1.1.0-incubating-SNAPSHOT.pom
[JENKINS] Archiving <https://builds.apache.org/job/unomi-master/ws/persistence-elasticsearch/plugins/security/pom.xml>
to org.apache.unomi/unomi-persistence-elasticsearch-plugins-security/1.1.0-incubating-SNAPSHOT/unomi-persistence-elasticsearch-plugins-security-1.1.0-incubating-SNAPSHOT.pom
[JENKINS] Archiving <https://builds.apache.org/job/unomi-master/ws/persistence-elasticsearch/plugins/security/target/unomi-persistence-elasticsearch-plugins-security-1.1.0-incubating-SNAPSHOT.jar>
to org.apache.unomi/unomi-persistence-elasticsearch-plugins-security/1.1.0-incubating-20160725.131359-9/unomi-persistence-elasticsearch-plugins-security-1.1.0-incubating-20160725.131359-9.jar
[JENKINS] Archiving <https://builds.apache.org/job/unomi-master/ws/persistence-elasticsearch/plugins/security/target/unomi-persistence-elasticsearch-plugins-security-1.1.0-incubating-SNAPSHOT-sources.jar>
to org.apache.unomi/unomi-persistence-elasticsearch-plugins-security/1.1.0-incubating-20160725.131359-9/unomi-persistence-elasticsearch-plugins-security-1.1.0-incubating-20160725.131359-9-sources.jar
[JENKINS] Archiving <https://builds.apache.org/job/unomi-master/ws/persistence-elasticsearch/plugins/security/target/releases/unomi-persistence-elasticsearch-plugins-security-1.1.0-incubating-SNAPSHOT.zip>
to org.apache.unomi/unomi-persistence-elasticsearch-plugins-security/1.1.0-incubating-20160725.131359-9/unomi-persistence-elasticsearch-plugins-security-1.1.0-incubating-20160725.131359-9.zip
[JENKINS] Archiving <https://builds.apache.org/job/unomi-master/ws/extensions/pom.xml>
to org.apache.unomi/unomi-extensions/1.1.0-incubating-SNAPSHOT/unomi-extensions-1.1.0-incubating-SNAPSHOT.pom
[JENKINS] Archiving <https://builds.apache.org/job/unomi-master/ws/extensions/lists-extension/rest/pom.xml>
to org.apache.unomi/cxs-lists-extension-rest/1.1.0-incubating-SNAPSHOT/cxs-lists-extension-rest-1.1.0-incubating-SNAPSHOT.pom
[JENKINS] Archiving <https://builds.apache.org/job/unomi-master/ws/extensions/geonames/pom.xml>
to org.apache.unomi/cxs-geonames/1.1.0-incubating-SNAPSHOT/cxs-geonames-1.1.0-incubating-SNAPSHOT.pom
[JENKINS] Archiving <https://builds.apache.org/job/unomi-master/ws/plugins/pom.xml>
to org.apache.unomi/unomi-plugins/1.1.0-incubating-SNAPSHOT/unomi-plugins-1.1.0-incubating-SNAPSHOT.pom
[JENKINS] Archiving <https://builds.apache.org/job/unomi-master/ws/plugins/mail/pom.xml>
to org.apache.unomi/unomi-plugins-mail/1.1.0-incubating-SNAPSHOT/unomi-plugins-mail-1.1.0-incubating-SNAPSHOT.pom
[JENKINS] Archiving <https://builds.apache.org/job/unomi-master/ws/extensions/privacy-extension/rest/pom.xml>
to org.apache.unomi/cxs-privacy-extension-rest/1.1.0-incubating-SNAPSHOT/cxs-privacy-extension-rest-1.1.0-incubating-SNAPSHOT.pom
[JENKINS] Archiving <https://builds.apache.org/job/unomi-master/ws/extensions/lists-extension/pom.xml>
to org.apache.unomi/cxs-lists-extension/1.1.0-incubating-SNAPSHOT/cxs-lists-extension-1.1.0-incubating-SNAPSHOT.pom
[JENKINS] Archiving <https://builds.apache.org/job/unomi-master/ws/kar/pom.xml> to org.apache.unomi/unomi-kar/1.1.0-incubating-SNAPSHOT/unomi-kar-1.1.0-incubating-SNAPSHOT.pom
[JENKINS] Archiving <https://builds.apache.org/job/unomi-master/ws/plugins/optimization-test/pom.xml>
to org.apache.unomi/unomi-plugins-optimization-test/1.1.0-incubating-SNAPSHOT/unomi-plugins-optimization-test-1.1.0-incubating-SNAPSHOT.pom
[JENKINS] Archiving <https://builds.apache.org/job/unomi-master/ws/plugins/past-event/pom.xml>
to org.apache.unomi/unomi-plugins-past-event/1.1.0-incubating-SNAPSHOT/unomi-plugins-past-event-1.1.0-incubating-SNAPSHOT.pom
[JENKINS] Archiving <https://builds.apache.org/job/unomi-master/ws/persistence-elasticsearch/plugins/pom.xml>
to org.apache.unomi/unomi-persistence-elasticsearch-plugins/1.1.0-incubating-SNAPSHOT/unomi-persistence-elasticsearch-plugins-1.1.0-incubating-SNAPSHOT.pom
[JENKINS] Archiving <https://builds.apache.org/job/unomi-master/ws/extensions/privacy-extension/pom.xml>
to org.apache.unomi/cxs-privacy-extension/1.1.0-incubating-SNAPSHOT/cxs-privacy-extension-1.1.0-incubating-SNAPSHOT.pom
[JENKINS] Archiving <https://builds.apache.org/job/unomi-master/ws/persistence-spi/pom.xml>
to org.apache.unomi/unomi-persistence-spi/1.1.0-incubating-SNAPSHOT/unomi-persistence-spi-1.1.0-incubating-SNAPSHOT.pom
[JENKINS] Archiving <https://builds.apache.org/job/unomi-master/ws/persistence-spi/target/unomi-persistence-spi-1.1.0-incubating-SNAPSHOT.jar>
to org.apache.unomi/unomi-persistence-spi/1.1.0-incubating-20160725.125326-9/unomi-persistence-spi-1.1.0-incubating-20160725.125326-9.jar
Compressed 732.33 KB of artifacts by 21.8% relative to #39
[JENKINS] Archiving <https://builds.apache.org/job/unomi-master/ws/wab/pom.xml> to org.apache.unomi/unomi-wab/1.1.0-incubating-SNAPSHOT/unomi-wab-1.1.0-incubating-SNAPSHOT.pom
[JENKINS] Archiving <https://builds.apache.org/job/unomi-master/ws/wab/target/unomi-wab-1.1.0-incubating-SNAPSHOT.jar>
to org.apache.unomi/unomi-wab/1.1.0-incubating-SNAPSHOT/unomi-wab-1.1.0-incubating-SNAPSHOT.jar
[JENKINS] Archiving <https://builds.apache.org/job/unomi-master/ws/wab/src/main/resources/org.apache.unomi.web.cfg>
to org.apache.unomi/unomi-wab/1.1.0-incubating-SNAPSHOT/unomi-wab-1.1.0-incubating-SNAPSHOT-unomicfg.cfg
Compressed 280.42 KB of artifacts by 68.5% relative to #39
[JENKINS] Archiving <https://builds.apache.org/job/unomi-master/ws/extensions/geonames/services/pom.xml>
to org.apache.unomi/cxs-geonames-services/1.1.0-incubating-SNAPSHOT/cxs-geonames-services-1.1.0-incubating-SNAPSHOT.pom
[JENKINS] Archiving <https://builds.apache.org/job/unomi-master/ws/plugins/baseplugin/pom.xml>
to org.apache.unomi/unomi-plugins-base/1.1.0-incubating-SNAPSHOT/unomi-plugins-base-1.1.0-incubating-SNAPSHOT.pom
[JENKINS] Archiving <https://builds.apache.org/job/unomi-master/ws/persistence-elasticsearch/pom.xml>
to org.apache.unomi/unomi-persistence-elasticsearch/1.1.0-incubating-SNAPSHOT/unomi-persistence-elasticsearch-1.1.0-incubating-SNAPSHOT.pom
[JENKINS] Archiving <https://builds.apache.org/job/unomi-master/ws/itests/pom.xml> to
org.apache.unomi/unomi-itests/1.1.0-incubating-SNAPSHOT/unomi-itests-1.1.0-incubating-SNAPSHOT.pom
Sending e-mails to: commits@unomi.incubator.apache.org shuber@apache.org
channel stopped

Mime
View raw message