unomi-commits mailing list archives

Site index · List index
Message view « Date » · « Thread »
Top « Date » · « Thread »
From Apache Jenkins Server <jenk...@builds.apache.org>
Subject Build failed in Jenkins: unomi-master #37
Date Thu, 14 Jul 2016 12:46:51 GMT
See <https://builds.apache.org/job/unomi-master/37/changes>

Changes:

[shuber] UNOMI-43 Improve context and event servlet logging

------------------------------------------
[...truncated 1104 lines...]
[INFO] Exclude: **/grep.txt
[INFO] Exclude: **/edit.txt
[INFO] Exclude: **/wc.txt
[INFO] Exclude: **/foo
[INFO] Exclude: **/org.ops4j.pax.exam.TestContainerFactory
[INFO] Exclude: **/maven-metadata-local.xml
[INFO] Exclude: **/src/test/resources/data/*.txt
[INFO] Exclude: **/keystore
[INFO] Exclude: **/*.css
[INFO] Exclude: **/*.ssp
[INFO] Exclude: **/*.conf
[INFO] Exclude: **/*.mf
[INFO] Exclude: **/*.json
[INFO] Exclude: **/*.key
[INFO] Exclude: .repository/**
[INFO] Exclude: **/*.jar
[INFO] Exclude: **/src/main/webapp/WEB-INF/beans.xml
[INFO] Exclude: **/src/main/webapp/robots.txt
[INFO] Exclude: **/src/main/resources/elasticsearch.yml
[INFO] Exclude: **/*.log
[INFO] 19 resources included (use -debug for more details)
Warning:  org.apache.xerces.jaxp.SAXParserImpl$JAXPSAXParser: Property 'http://www.oracle.com/xml/jaxp/properties/entityExpansionLimit'
is not recognized.
Compiler warnings:
  WARNING:  'org.apache.xerces.jaxp.SAXParserImpl: Property 'http://javax.xml.XMLConstants/property/accessExternalDTD'
is not recognized.'
Warning:  org.apache.xerces.parsers.SAXParser: Feature 'http://javax.xml.XMLConstants/feature/secure-processing'
is not recognized.
Warning:  org.apache.xerces.parsers.SAXParser: Property 'http://javax.xml.XMLConstants/property/accessExternalDTD'
is not recognized.
Warning:  org.apache.xerces.parsers.SAXParser: Property 'http://www.oracle.com/xml/jaxp/properties/entityExpansionLimit'
is not recognized.
[INFO] Rat check: Summary of files. Unapproved: 0 unknown: 0 generated: 0 approved: 19 licence.
[INFO] 
[INFO] --- maven-install-plugin:2.5.2:install (default-install) @ unomi-rest ---
[INFO] Installing <https://builds.apache.org/job/unomi-master/ws/rest/target/unomi-rest-1.1.0-incubating-SNAPSHOT.jar>
to /home/jenkins/jenkins-slave/maven-repositories/0/org/apache/unomi/unomi-rest/1.1.0-incubating-SNAPSHOT/unomi-rest-1.1.0-incubating-SNAPSHOT.jar
[INFO] Installing <https://builds.apache.org/job/unomi-master/ws/rest/pom.xml> to /home/jenkins/jenkins-slave/maven-repositories/0/org/apache/unomi/unomi-rest/1.1.0-incubating-SNAPSHOT/unomi-rest-1.1.0-incubating-SNAPSHOT.pom
[INFO] 
[INFO] --- maven-bundle-plugin:2.5.3:install (default-install) @ unomi-rest ---
[INFO] Installing org/apache/unomi/unomi-rest/1.1.0-incubating-SNAPSHOT/unomi-rest-1.1.0-incubating-SNAPSHOT.jar
[INFO] Writing OBR metadata
[INFO] 
[INFO] --- maven-deploy-plugin:2.8.2:deploy (default-deploy) @ unomi-rest ---
[INFO] Downloading: https://repository.apache.org/content/repositories/snapshots/org/apache/unomi/unomi-rest/1.1.0-incubating-SNAPSHOT/maven-metadata.xml
[INFO] Downloaded: https://repository.apache.org/content/repositories/snapshots/org/apache/unomi/unomi-rest/1.1.0-incubating-SNAPSHOT/maven-metadata.xml
(809 B at 5.2 KB/sec)
[INFO] Uploading: https://repository.apache.org/content/repositories/snapshots/org/apache/unomi/unomi-rest/1.1.0-incubating-SNAPSHOT/unomi-rest-1.1.0-incubating-20160714.124437-6.jar
[INFO] Uploaded: https://repository.apache.org/content/repositories/snapshots/org/apache/unomi/unomi-rest/1.1.0-incubating-SNAPSHOT/unomi-rest-1.1.0-incubating-20160714.124437-6.jar
(69 KB at 603.6 KB/sec)
[INFO] Uploading: https://repository.apache.org/content/repositories/snapshots/org/apache/unomi/unomi-rest/1.1.0-incubating-SNAPSHOT/unomi-rest-1.1.0-incubating-20160714.124437-6.pom
[INFO] Uploaded: https://repository.apache.org/content/repositories/snapshots/org/apache/unomi/unomi-rest/1.1.0-incubating-SNAPSHOT/unomi-rest-1.1.0-incubating-20160714.124437-6.pom
(12 KB at 148.9 KB/sec)
[INFO] Downloading: https://repository.apache.org/content/repositories/snapshots/org/apache/unomi/unomi-rest/maven-metadata.xml
[INFO] Downloaded: https://repository.apache.org/content/repositories/snapshots/org/apache/unomi/unomi-rest/maven-metadata.xml
(419 B at 8.9 KB/sec)
[INFO] Uploading: https://repository.apache.org/content/repositories/snapshots/org/apache/unomi/unomi-rest/1.1.0-incubating-SNAPSHOT/maven-metadata.xml
[INFO] Uploaded: https://repository.apache.org/content/repositories/snapshots/org/apache/unomi/unomi-rest/1.1.0-incubating-SNAPSHOT/maven-metadata.xml
(809 B at 9.4 KB/sec)
[INFO] Uploading: https://repository.apache.org/content/repositories/snapshots/org/apache/unomi/unomi-rest/maven-metadata.xml
[INFO] Uploaded: https://repository.apache.org/content/repositories/snapshots/org/apache/unomi/unomi-rest/maven-metadata.xml
(419 B at 5.2 KB/sec)
[INFO] 
[INFO] --- maven-bundle-plugin:2.5.3:deploy (default-deploy) @ unomi-rest ---
[INFO] Remote OBR update disabled (enable with -DremoteOBR)
[INFO]                                                                         
[INFO] ------------------------------------------------------------------------
[INFO] Building Apache Unomi :: Core Web Application 1.1.0-incubating-SNAPSHOT
[INFO] ------------------------------------------------------------------------
[INFO] 
[INFO] --- maven-clean-plugin:2.5:clean (default-clean) @ unomi-wab ---
[INFO] Deleting <https://builds.apache.org/job/unomi-master/ws/wab/target>
[INFO] 
[INFO] --- maven-remote-resources-plugin:1.5:process (default) @ unomi-wab ---
[INFO] 
[INFO] --- maven-resources-plugin:2.6:resources (default-resources) @ unomi-wab ---
[INFO] Using 'UTF-8' encoding to copy filtered resources.
[INFO] Copying 4 resources
[INFO] Copying 3 resources
[INFO] 
[INFO] --- maven-compiler-plugin:3.2:compile (default-compile) @ unomi-wab ---
[INFO] Changes detected - recompiling the module!
[INFO] Compiling 3 source files to <https://builds.apache.org/job/unomi-master/ws/wab/target/classes>
[INFO] -------------------------------------------------------------
[ERROR] COMPILATION ERROR : 
[INFO] -------------------------------------------------------------
[ERROR] <https://builds.apache.org/job/unomi-master/ws/wab/src/main/java/org/apache/unomi/web/ContextServlet.java>:[26,36]
package org.apache.unomi.api.privacy does not exist
[ERROR] <https://builds.apache.org/job/unomi-master/ws/wab/src/main/java/org/apache/unomi/web/ContextServlet.java>:[57,13]
cannot find symbol
  symbol:   class PrivacyService
  location: class org.apache.unomi.web.ContextServlet
[ERROR] <https://builds.apache.org/job/unomi-master/ws/wab/src/main/java/org/apache/unomi/web/ContextServlet.java>:[388,35]
cannot find symbol
  symbol:   class PrivacyService
  location: class org.apache.unomi.web.ContextServlet
[ERROR] <https://builds.apache.org/job/unomi-master/ws/wab/src/main/java/org/apache/unomi/web/EventsCollectorServlet.java>:[24,36]
package org.apache.unomi.api.privacy does not exist
[ERROR] <https://builds.apache.org/job/unomi-master/ws/wab/src/main/java/org/apache/unomi/web/EventsCollectorServlet.java>:[46,13]
cannot find symbol
  symbol:   class PrivacyService
  location: class org.apache.unomi.web.EventsCollectorServlet
[ERROR] <https://builds.apache.org/job/unomi-master/ws/wab/src/main/java/org/apache/unomi/web/EventsCollectorServlet.java>:[184,35]
cannot find symbol
  symbol:   class PrivacyService
  location: class org.apache.unomi.web.EventsCollectorServlet
[INFO] 6 errors 
[INFO] -------------------------------------------------------------
[INFO] ------------------------------------------------------------------------
[INFO] Reactor Summary:
[INFO] 
[INFO] Apache Unomi :: Root Project ....................... SUCCESS [ 17.421 s]
[INFO] Apache Unomi :: Specification API .................. SUCCESS [ 21.148 s]
[INFO] Apache Unomi :: Persistence :: SPI (Service Provider Interface) SUCCESS [ 23.906 s]
[INFO] Apache Unomi :: Persistence :: ElasticSearch ....... SUCCESS [  3.260 s]
[INFO] Apache Unomi :: Persistence :: ElasticSearch :: Core SUCCESS [ 52.456 s]
[INFO] Apache Unomi :: Persistence :: ElasticSearch :: Plugins SUCCESS [ 12.890 s]
[INFO] Apache Unomi :: Persistence :: ElasticSearch :: Plugins :: Security SUCCESS [ 17.571
s]
[INFO] Apache Unomi :: Core Services ...................... SUCCESS [ 12.166 s]
[INFO] Apache Unomi :: REST API ........................... SUCCESS [ 35.992 s]
[INFO] Apache Unomi :: Core Web Application ............... FAILURE [  1.940 s]
[INFO] Apache Unomi :: Plugins ............................ SKIPPED
[INFO] Apache Unomi :: Plugins :: Base Actions and Conditions SKIPPED
[INFO] Apache Unomi :: Plugins :: Request reading actions . SKIPPED
[INFO] Apache Unomi :: Plugins :: Mail notifications actions SKIPPED
[INFO] Apache Unomi :: Plugins :: Rules and Actions for optimization tests (A/B testing) SKIPPED
[INFO] Apache Unomi :: Plugins :: Hover event support ..... SKIPPED
[INFO] Apache Unomi :: Plugins :: Conditions based on past events SKIPPED
[INFO] Apache Unomi :: Plugins :: Conditions for events that need to be tracked SKIPPED
[INFO] Apache Unomi :: Extensions ......................... SKIPPED
[INFO] Apache Unomi :: Extensions :: Lists ................ SKIPPED
[INFO] Apache Unomi :: Extensions :: Lists :: Service ..... SKIPPED
[INFO] Apache Unomi :: Extensions :: Lists :: REST API .... SKIPPED
[INFO] Apache Unomi :: Extensions :: Privacy .............. SKIPPED
[INFO] Apache Unomi :: Extensions :: Privacy :: Services .. SKIPPED
[INFO] Apache Unomi :: Extensions :: Privacy :: REST API .. SKIPPED
[INFO] Apache Unomi :: Extensions :: Geonames Database .... SKIPPED
[INFO] Apache Unomi :: Extensions :: Geonames Database :: Service SKIPPED
[INFO] Apache Unomi :: Extensions :: Geonames Database :: REST API SKIPPED
[INFO] Apache Unomi :: Karaf KAR package .................. SKIPPED
[INFO] Apache Unomi :: Samples ............................ SKIPPED
[INFO] Apache Unomi :: Samples :: Tweet Button plugin ..... SKIPPED
[INFO] Apache Unomi :: Distribution Package ............... SKIPPED
[INFO] Apache Unomi :: Integration Tests .................. SKIPPED
[INFO] Apache Unomi :: Performance Tests .................. SKIPPED
[INFO] ------------------------------------------------------------------------
[INFO] BUILD FAILURE
[INFO] ------------------------------------------------------------------------
[INFO] Total time: 04:53 min
[INFO] Finished at: 2016-07-14T12:45:31+00:00
[INFO] Final Memory: 68M/1110M
[INFO] ------------------------------------------------------------------------
[ERROR] Failed to execute goal org.apache.maven.plugins:maven-compiler-plugin:3.2:compile
(default-compile) on project unomi-wab: Compilation failure: Compilation failure:
[ERROR] <https://builds.apache.org/job/unomi-master/ws/wab/src/main/java/org/apache/unomi/web/ContextServlet.java>:[26,36]
package org.apache.unomi.api.privacy does not exist
[ERROR] <https://builds.apache.org/job/unomi-master/ws/wab/src/main/java/org/apache/unomi/web/ContextServlet.java>:[57,13]
cannot find symbol
[ERROR] symbol:   class PrivacyService
[ERROR] location: class org.apache.unomi.web.ContextServlet
[ERROR] <https://builds.apache.org/job/unomi-master/ws/wab/src/main/java/org/apache/unomi/web/ContextServlet.java>:[388,35]
cannot find symbol
[ERROR] symbol:   class PrivacyService
[ERROR] location: class org.apache.unomi.web.ContextServlet
[ERROR] <https://builds.apache.org/job/unomi-master/ws/wab/src/main/java/org/apache/unomi/web/EventsCollectorServlet.java>:[24,36]
package org.apache.unomi.api.privacy does not exist
[ERROR] <https://builds.apache.org/job/unomi-master/ws/wab/src/main/java/org/apache/unomi/web/EventsCollectorServlet.java>:[46,13]
cannot find symbol
[ERROR] symbol:   class PrivacyService
[ERROR] location: class org.apache.unomi.web.EventsCollectorServlet
[ERROR] <https://builds.apache.org/job/unomi-master/ws/wab/src/main/java/org/apache/unomi/web/EventsCollectorServlet.java>:[184,35]
cannot find symbol
[ERROR] symbol:   class PrivacyService
[ERROR] location: class org.apache.unomi.web.EventsCollectorServlet
[ERROR] -> [Help 1]
org.apache.maven.lifecycle.LifecycleExecutionException: Failed to execute goal org.apache.maven.plugins:maven-compiler-plugin:3.2:compile
(default-compile) on project unomi-wab: Compilation failure
	at org.apache.maven.lifecycle.internal.MojoExecutor.execute(MojoExecutor.java:212)
	at org.apache.maven.lifecycle.internal.MojoExecutor.execute(MojoExecutor.java:153)
	at org.apache.maven.lifecycle.internal.MojoExecutor.execute(MojoExecutor.java:145)
	at org.apache.maven.lifecycle.internal.LifecycleModuleBuilder.buildProject(LifecycleModuleBuilder.java:116)
	at org.apache.maven.lifecycle.internal.LifecycleModuleBuilder.buildProject(LifecycleModuleBuilder.java:80)
	at org.apache.maven.lifecycle.internal.builder.singlethreaded.SingleThreadedBuilder.build(SingleThreadedBuilder.java:51)
	at org.apache.maven.lifecycle.internal.LifecycleStarter.execute(LifecycleStarter.java:128)
	at org.apache.maven.DefaultMaven.doExecute(DefaultMaven.java:307)
	at org.apache.maven.DefaultMaven.doExecute(DefaultMaven.java:193)
	at org.apache.maven.DefaultMaven.execute(DefaultMaven.java:106)
	at org.jvnet.hudson.maven3.launcher.Maven32Launcher.main(Maven32Launcher.java:132)
	at sun.reflect.NativeMethodAccessorImpl.invoke0(Native Method)
	at sun.reflect.NativeMethodAccessorImpl.invoke(NativeMethodAccessorImpl.java:57)
	at sun.reflect.DelegatingMethodAccessorImpl.invoke(DelegatingMethodAccessorImpl.java:43)
	at java.lang.reflect.Method.invoke(Method.java:606)
	at org.codehaus.plexus.classworlds.launcher.Launcher.launchStandard(Launcher.java:330)
	at org.codehaus.plexus.classworlds.launcher.Launcher.launch(Launcher.java:238)
	at jenkins.maven3.agent.Maven32Main.launch(Maven32Main.java:186)
	at sun.reflect.NativeMethodAccessorImpl.invoke0(Native Method)
	at sun.reflect.NativeMethodAccessorImpl.invoke(NativeMethodAccessorImpl.java:57)
	at sun.reflect.DelegatingMethodAccessorImpl.invoke(DelegatingMethodAccessorImpl.java:43)
	at java.lang.reflect.Method.invoke(Method.java:606)
	at hudson.maven.Maven3Builder.call(Maven3Builder.java:136)
	at hudson.maven.Maven3Builder.call(Maven3Builder.java:71)
	at hudson.remoting.UserRequest.perform(UserRequest.java:120)
	at hudson.remoting.UserRequest.perform(UserRequest.java:48)
	at hudson.remoting.Request$2.run(Request.java:326)
	at hudson.remoting.InterceptingExecutorService$1.call(InterceptingExecutorService.java:68)
	at java.util.concurrent.FutureTask.run(FutureTask.java:262)
	at java.util.concurrent.ThreadPoolExecutor.runWorker(ThreadPoolExecutor.java:1145)
	at java.util.concurrent.ThreadPoolExecutor$Worker.run(ThreadPoolExecutor.java:615)
	at java.lang.Thread.run(Thread.java:744)
Caused by: org.apache.maven.plugin.compiler.CompilationFailureException: Compilation failure
	at org.apache.maven.plugin.compiler.AbstractCompilerMojo.execute(AbstractCompilerMojo.java:909)
	at org.apache.maven.plugin.compiler.CompilerMojo.execute(CompilerMojo.java:129)
	at org.apache.maven.plugin.DefaultBuildPluginManager.executeMojo(DefaultBuildPluginManager.java:134)
	at org.apache.maven.lifecycle.internal.MojoExecutor.execute(MojoExecutor.java:208)
	... 31 more
[ERROR] 
[ERROR] Re-run Maven using the -X switch to enable full debug logging.
[ERROR] 
[ERROR] For more information about the errors and possible solutions, please read the following
articles:
[ERROR] [Help 1] http://cwiki.apache.org/confluence/display/MAVEN/MojoFailureException
[ERROR] 
[ERROR] After correcting the problems, you can resume the build with the command
[ERROR]   mvn <goals> -rf :unomi-wab
[JENKINS] Archiving <https://builds.apache.org/job/unomi-master/ws/pom.xml> to org.apache.unomi/unomi-root/1.1.0-incubating-SNAPSHOT/unomi-root-1.1.0-incubating-SNAPSHOT.pom
[JENKINS] Archiving <https://builds.apache.org/job/unomi-master/ws/target/unomi-root-1.1.0-incubating-SNAPSHOT-site.xml>
to org.apache.unomi/unomi-root/1.1.0-incubating-20160714.124103-6/unomi-root-1.1.0-incubating-20160714.124103-6-site.xml
[JENKINS] Archiving <https://builds.apache.org/job/unomi-master/ws/samples/pom.xml>
to org.apache.unomi/samples/1.1.0-incubating-SNAPSHOT/samples-1.1.0-incubating-SNAPSHOT.pom
[JENKINS] Archiving <https://builds.apache.org/job/unomi-master/ws/services/pom.xml>
to org.apache.unomi/unomi-services/1.1.0-incubating-SNAPSHOT/unomi-services-1.1.0-incubating-SNAPSHOT.pom
[JENKINS] Archiving <https://builds.apache.org/job/unomi-master/ws/services/target/unomi-services-1.1.0-incubating-SNAPSHOT.jar>
to org.apache.unomi/unomi-services/1.1.0-incubating-20160714.124359-6/unomi-services-1.1.0-incubating-20160714.124359-6.jar
[JENKINS] Archiving <https://builds.apache.org/job/unomi-master/ws/services/src/main/resources/org.apache.unomi.services.cfg>
to org.apache.unomi/unomi-services/1.1.0-incubating-20160714.124359-6/unomi-services-1.1.0-incubating-20160714.124359-6-servicescfg.cfg
[JENKINS] Archiving <https://builds.apache.org/job/unomi-master/ws/services/src/main/resources/org.apache.unomi.thirdparty.cfg>
to org.apache.unomi/unomi-services/1.1.0-incubating-20160714.124359-6/unomi-services-1.1.0-incubating-20160714.124359-6-thirdpartycfg.cfg
Compressed 1.91 MB of artifacts by 83.3% relative to #36
[JENKINS] Archiving <https://builds.apache.org/job/unomi-master/ws/rest/pom.xml> to
org.apache.unomi/unomi-rest/1.1.0-incubating-SNAPSHOT/unomi-rest-1.1.0-incubating-SNAPSHOT.pom
[JENKINS] Archiving <https://builds.apache.org/job/unomi-master/ws/rest/target/unomi-rest-1.1.0-incubating-SNAPSHOT.jar>
to org.apache.unomi/unomi-rest/1.1.0-incubating-20160714.124437-6/unomi-rest-1.1.0-incubating-20160714.124437-6.jar
[JENKINS] Archiving <https://builds.apache.org/job/unomi-master/ws/plugins/hover-event/pom.xml>
to org.apache.unomi/unomi-plugins-hover-event/1.1.0-incubating-SNAPSHOT/unomi-plugins-hover-event-1.1.0-incubating-SNAPSHOT.pom
[JENKINS] Archiving <https://builds.apache.org/job/unomi-master/ws/api/pom.xml> to org.apache.unomi/unomi-api/1.1.0-incubating-SNAPSHOT/unomi-api-1.1.0-incubating-SNAPSHOT.pom
[JENKINS] Archiving <https://builds.apache.org/job/unomi-master/ws/api/target/unomi-api-1.1.0-incubating-SNAPSHOT.jar>
to org.apache.unomi/unomi-api/1.1.0-incubating-20160714.124136-6/unomi-api-1.1.0-incubating-20160714.124136-6.jar
[JENKINS] Archiving <https://builds.apache.org/job/unomi-master/ws/extensions/lists-extension/services/pom.xml>
to org.apache.unomi/cxs-lists-extension-services/1.1.0-incubating-SNAPSHOT/cxs-lists-extension-services-1.1.0-incubating-SNAPSHOT.pom
[JENKINS] Archiving <https://builds.apache.org/job/unomi-master/ws/plugins/request/pom.xml>
to org.apache.unomi/unomi-plugins-request/1.1.0-incubating-SNAPSHOT/unomi-plugins-request-1.1.0-incubating-SNAPSHOT.pom
[JENKINS] Archiving <https://builds.apache.org/job/unomi-master/ws/extensions/geonames/rest/pom.xml>
to org.apache.unomi/cxs-geonames-rest/1.1.0-incubating-SNAPSHOT/cxs-geonames-rest-1.1.0-incubating-SNAPSHOT.pom
[JENKINS] Archiving <https://builds.apache.org/job/unomi-master/ws/performance-tests/pom.xml>
to org.apache.unomi/unomi-performance-tests/1.1.0-incubating-SNAPSHOT/unomi-performance-tests-1.1.0-incubating-SNAPSHOT.pom
[JENKINS] Archiving <https://builds.apache.org/job/unomi-master/ws/persistence-elasticsearch/core/pom.xml>
to org.apache.unomi/unomi-persistence-elasticsearch-core/1.1.0-incubating-SNAPSHOT/unomi-persistence-elasticsearch-core-1.1.0-incubating-SNAPSHOT.pom
[JENKINS] Archiving <https://builds.apache.org/job/unomi-master/ws/persistence-elasticsearch/core/target/unomi-persistence-elasticsearch-core-1.1.0-incubating-SNAPSHOT.jar>
to org.apache.unomi/unomi-persistence-elasticsearch-core/1.1.0-incubating-20160714.124249-6/unomi-persistence-elasticsearch-core-1.1.0-incubating-20160714.124249-6.jar
[JENKINS] Archiving <https://builds.apache.org/job/unomi-master/ws/persistence-elasticsearch/core/src/main/resources/org.apache.unomi.persistence.elasticsearch.cfg>
to org.apache.unomi/unomi-persistence-elasticsearch-core/1.1.0-incubating-20160714.124249-6/unomi-persistence-elasticsearch-core-1.1.0-incubating-20160714.124249-6-elasticsearchcfg.cfg
[JENKINS] Archiving <https://builds.apache.org/job/unomi-master/ws/persistence-elasticsearch/core/src/main/resources/elasticsearch.yml>
to org.apache.unomi/unomi-persistence-elasticsearch-core/1.1.0-incubating-20160714.124249-6/unomi-persistence-elasticsearch-core-1.1.0-incubating-20160714.124249-6-elasticsearchconfig.yml
Compressed 40.07 MB of artifacts by 75.3% relative to #36
[JENKINS] Archiving <https://builds.apache.org/job/unomi-master/ws/plugins/tracked-event/pom.xml>
to org.apache.unomi/unomi-plugins-tracked-event/1.1.0-incubating-SNAPSHOT/unomi-plugins-tracked-event-1.1.0-incubating-SNAPSHOT.pom
[JENKINS] Archiving <https://builds.apache.org/job/unomi-master/ws/extensions/privacy-extension/services/pom.xml>
to org.apache.unomi/cxs-privacy-extension-services/1.1.0-incubating-SNAPSHOT/cxs-privacy-extension-services-1.1.0-incubating-SNAPSHOT.pom
[JENKINS] Archiving <https://builds.apache.org/job/unomi-master/ws/package/pom.xml>
to org.apache.unomi/unomi/1.1.0-incubating-SNAPSHOT/unomi-1.1.0-incubating-SNAPSHOT.pom
[JENKINS] Archiving <https://builds.apache.org/job/unomi-master/ws/samples/tweet-button-plugin/pom.xml>
to org.apache.unomi/tweet-button-plugin/1.1.0-incubating-SNAPSHOT/tweet-button-plugin-1.1.0-incubating-SNAPSHOT.pom
[JENKINS] Archiving <https://builds.apache.org/job/unomi-master/ws/persistence-elasticsearch/plugins/security/pom.xml>
to org.apache.unomi/unomi-persistence-elasticsearch-plugins-security/1.1.0-incubating-SNAPSHOT/unomi-persistence-elasticsearch-plugins-security-1.1.0-incubating-SNAPSHOT.pom
[JENKINS] Archiving <https://builds.apache.org/job/unomi-master/ws/persistence-elasticsearch/plugins/security/target/unomi-persistence-elasticsearch-plugins-security-1.1.0-incubating-SNAPSHOT.jar>
to org.apache.unomi/unomi-persistence-elasticsearch-plugins-security/1.1.0-incubating-20160714.124342-6/unomi-persistence-elasticsearch-plugins-security-1.1.0-incubating-20160714.124342-6.jar
[JENKINS] Archiving <https://builds.apache.org/job/unomi-master/ws/persistence-elasticsearch/plugins/security/target/unomi-persistence-elasticsearch-plugins-security-1.1.0-incubating-SNAPSHOT-sources.jar>
to org.apache.unomi/unomi-persistence-elasticsearch-plugins-security/1.1.0-incubating-20160714.124342-6/unomi-persistence-elasticsearch-plugins-security-1.1.0-incubating-20160714.124342-6-sources.jar
[JENKINS] Archiving <https://builds.apache.org/job/unomi-master/ws/persistence-elasticsearch/plugins/security/target/releases/unomi-persistence-elasticsearch-plugins-security-1.1.0-incubating-SNAPSHOT.zip>
to org.apache.unomi/unomi-persistence-elasticsearch-plugins-security/1.1.0-incubating-20160714.124342-6/unomi-persistence-elasticsearch-plugins-security-1.1.0-incubating-20160714.124342-6.zip
[JENKINS] Archiving <https://builds.apache.org/job/unomi-master/ws/extensions/pom.xml>
to org.apache.unomi/unomi-extensions/1.1.0-incubating-SNAPSHOT/unomi-extensions-1.1.0-incubating-SNAPSHOT.pom
[JENKINS] Archiving <https://builds.apache.org/job/unomi-master/ws/extensions/lists-extension/rest/pom.xml>
to org.apache.unomi/cxs-lists-extension-rest/1.1.0-incubating-SNAPSHOT/cxs-lists-extension-rest-1.1.0-incubating-SNAPSHOT.pom
[JENKINS] Archiving <https://builds.apache.org/job/unomi-master/ws/extensions/geonames/pom.xml>
to org.apache.unomi/cxs-geonames/1.1.0-incubating-SNAPSHOT/cxs-geonames-1.1.0-incubating-SNAPSHOT.pom
[JENKINS] Archiving <https://builds.apache.org/job/unomi-master/ws/plugins/pom.xml>
to org.apache.unomi/unomi-plugins/1.1.0-incubating-SNAPSHOT/unomi-plugins-1.1.0-incubating-SNAPSHOT.pom
[JENKINS] Archiving <https://builds.apache.org/job/unomi-master/ws/plugins/mail/pom.xml>
to org.apache.unomi/unomi-plugins-mail/1.1.0-incubating-SNAPSHOT/unomi-plugins-mail-1.1.0-incubating-SNAPSHOT.pom
[JENKINS] Archiving <https://builds.apache.org/job/unomi-master/ws/extensions/privacy-extension/rest/pom.xml>
to org.apache.unomi/cxs-privacy-extension-rest/1.1.0-incubating-SNAPSHOT/cxs-privacy-extension-rest-1.1.0-incubating-SNAPSHOT.pom
[JENKINS] Archiving <https://builds.apache.org/job/unomi-master/ws/extensions/lists-extension/pom.xml>
to org.apache.unomi/cxs-lists-extension/1.1.0-incubating-SNAPSHOT/cxs-lists-extension-1.1.0-incubating-SNAPSHOT.pom
[JENKINS] Archiving <https://builds.apache.org/job/unomi-master/ws/kar/pom.xml> to org.apache.unomi/unomi-kar/1.1.0-incubating-SNAPSHOT/unomi-kar-1.1.0-incubating-SNAPSHOT.pom
[JENKINS] Archiving <https://builds.apache.org/job/unomi-master/ws/plugins/optimization-test/pom.xml>
to org.apache.unomi/unomi-plugins-optimization-test/1.1.0-incubating-SNAPSHOT/unomi-plugins-optimization-test-1.1.0-incubating-SNAPSHOT.pom
[JENKINS] Archiving <https://builds.apache.org/job/unomi-master/ws/plugins/past-event/pom.xml>
to org.apache.unomi/unomi-plugins-past-event/1.1.0-incubating-SNAPSHOT/unomi-plugins-past-event-1.1.0-incubating-SNAPSHOT.pom
[JENKINS] Archiving <https://builds.apache.org/job/unomi-master/ws/persistence-elasticsearch/plugins/pom.xml>
to org.apache.unomi/unomi-persistence-elasticsearch-plugins/1.1.0-incubating-SNAPSHOT/unomi-persistence-elasticsearch-plugins-1.1.0-incubating-SNAPSHOT.pom
[JENKINS] Archiving <https://builds.apache.org/job/unomi-master/ws/extensions/privacy-extension/pom.xml>
to org.apache.unomi/cxs-privacy-extension/1.1.0-incubating-SNAPSHOT/cxs-privacy-extension-1.1.0-incubating-SNAPSHOT.pom
[JENKINS] Archiving <https://builds.apache.org/job/unomi-master/ws/persistence-spi/pom.xml>
to org.apache.unomi/unomi-persistence-spi/1.1.0-incubating-SNAPSHOT/unomi-persistence-spi-1.1.0-incubating-SNAPSHOT.pom
[JENKINS] Archiving <https://builds.apache.org/job/unomi-master/ws/persistence-spi/target/unomi-persistence-spi-1.1.0-incubating-SNAPSHOT.jar>
to org.apache.unomi/unomi-persistence-spi/1.1.0-incubating-20160714.124157-6/unomi-persistence-spi-1.1.0-incubating-20160714.124157-6.jar
Compressed 725.47 KB of artifacts by 88.2% relative to #36
[JENKINS] Archiving <https://builds.apache.org/job/unomi-master/ws/wab/pom.xml> to org.apache.unomi/unomi-wab/1.1.0-incubating-SNAPSHOT/unomi-wab-1.1.0-incubating-SNAPSHOT.pom
[JENKINS] Archiving <https://builds.apache.org/job/unomi-master/ws/extensions/geonames/services/pom.xml>
to org.apache.unomi/cxs-geonames-services/1.1.0-incubating-SNAPSHOT/cxs-geonames-services-1.1.0-incubating-SNAPSHOT.pom
[JENKINS] Archiving <https://builds.apache.org/job/unomi-master/ws/plugins/baseplugin/pom.xml>
to org.apache.unomi/unomi-plugins-base/1.1.0-incubating-SNAPSHOT/unomi-plugins-base-1.1.0-incubating-SNAPSHOT.pom
[JENKINS] Archiving <https://builds.apache.org/job/unomi-master/ws/persistence-elasticsearch/pom.xml>
to org.apache.unomi/unomi-persistence-elasticsearch/1.1.0-incubating-SNAPSHOT/unomi-persistence-elasticsearch-1.1.0-incubating-SNAPSHOT.pom
[JENKINS] Archiving <https://builds.apache.org/job/unomi-master/ws/itests/pom.xml> to
org.apache.unomi/unomi-itests/1.1.0-incubating-SNAPSHOT/unomi-itests-1.1.0-incubating-SNAPSHOT.pom
Sending e-mails to: commits@unomi.incubator.apache.org shuber@apache.org
channel stopped

Mime
View raw message