unomi-commits mailing list archives

Site index · List index
Message view « Date » · « Thread »
Top « Date » · « Thread »
From Apache Jenkins Server <jenk...@builds.apache.org>
Subject Build failed in Jenkins: unomi-master #42
Date Tue, 26 Jul 2016 16:40:14 GMT
See <https://builds.apache.org/job/unomi-master/42/changes>

Changes:

[qlamerand] UNOMI-46 : Avoid NPE when asking for the definition of a missing tag +

------------------------------------------
[...truncated 132 lines...]
[INFO]                                                                         
[INFO] ------------------------------------------------------------------------
[INFO] Building Apache Unomi :: Root Project 1.1.0-incubating-SNAPSHOT
[INFO] ------------------------------------------------------------------------
[INFO] 
[INFO] --- maven-clean-plugin:2.5:clean (default-clean) @ unomi-root ---
[INFO] Deleting <https://builds.apache.org/job/unomi-master/ws/target>
[INFO] 
[INFO] --- maven-remote-resources-plugin:1.5:process (default) @ unomi-root ---
[INFO] Downloading: http://svn.apache.org/repos/asf/servicemix/m2-repo/org/slf4j/slf4j-api/1.7.1/slf4j-api-1.7.1.pom
[INFO] Downloading: https://repo.maven.apache.org/maven2/org/slf4j/slf4j-api/1.7.1/slf4j-api-1.7.1.pom
[INFO] Downloaded: https://repo.maven.apache.org/maven2/org/slf4j/slf4j-api/1.7.1/slf4j-api-1.7.1.pom
(3 KB at 29.5 KB/sec)
[INFO] Downloading: http://svn.apache.org/repos/asf/servicemix/m2-repo/org/slf4j/slf4j-parent/1.7.1/slf4j-parent-1.7.1.pom
[INFO] Downloading: https://repo.maven.apache.org/maven2/org/slf4j/slf4j-parent/1.7.1/slf4j-parent-1.7.1.pom
[INFO] Downloaded: https://repo.maven.apache.org/maven2/org/slf4j/slf4j-parent/1.7.1/slf4j-parent-1.7.1.pom
(13 KB at 140.7 KB/sec)
[INFO] 
[INFO] --- maven-site-plugin:3.3:attach-descriptor (attach-descriptor) @ unomi-root ---
[INFO] 
[INFO] --- apache-rat-plugin:0.11:check (default) @ unomi-root ---
[INFO] 51 implicit excludes (use -debug for more details).
[INFO] Exclude: **/NOTICE.template
[INFO] Exclude: **/NOTICE-generated
[INFO] Exclude: **/target/**/*
[INFO] Exclude: **/.git/**/*
[INFO] Exclude: **/.idea/**/*
[INFO] Exclude: **/*.iml
[INFO] Exclude: **/*.ipr
[INFO] Exclude: **/*.iws
[INFO] Exclude: **/.*
[INFO] Exclude: **/eclipse-classes/**/*
[INFO] Exclude: **/dependency-reduced-pom.xml
[INFO] Exclude: **/.settings/**
[INFO] Exclude: **/bin/**
[INFO] Exclude: **/goal.txt
[INFO] Exclude: **/grep.txt
[INFO] Exclude: **/edit.txt
[INFO] Exclude: **/wc.txt
[INFO] Exclude: **/foo
[INFO] Exclude: **/org.ops4j.pax.exam.TestContainerFactory
[INFO] Exclude: **/maven-metadata-local.xml
[INFO] Exclude: **/src/test/resources/data/*.txt
[INFO] Exclude: **/keystore
[INFO] Exclude: **/*.css
[INFO] Exclude: **/*.ssp
[INFO] Exclude: **/*.conf
[INFO] Exclude: **/*.mf
[INFO] Exclude: **/*.json
[INFO] Exclude: **/*.key
[INFO] Exclude: .repository/**
[INFO] Exclude: **/*.jar
[INFO] Exclude: **/src/main/webapp/WEB-INF/beans.xml
[INFO] Exclude: **/src/main/webapp/robots.txt
[INFO] Exclude: **/src/main/resources/elasticsearch.yml
[INFO] Exclude: **/*.log
[INFO] 305 resources included (use -debug for more details)
Warning:  org.apache.xerces.jaxp.SAXParserImpl$JAXPSAXParser: Property 'http://www.oracle.com/xml/jaxp/properties/entityExpansionLimit'
is not recognized.
Compiler warnings:
  WARNING:  'org.apache.xerces.jaxp.SAXParserImpl: Property 'http://javax.xml.XMLConstants/property/accessExternalDTD'
is not recognized.'
Warning:  org.apache.xerces.parsers.SAXParser: Feature 'http://javax.xml.XMLConstants/feature/secure-processing'
is not recognized.
Warning:  org.apache.xerces.parsers.SAXParser: Property 'http://javax.xml.XMLConstants/property/accessExternalDTD'
is not recognized.
Warning:  org.apache.xerces.parsers.SAXParser: Property 'http://www.oracle.com/xml/jaxp/properties/entityExpansionLimit'
is not recognized.
[INFO] Rat check: Summary of files. Unapproved: 0 unknown: 0 generated: 0 approved: 285 licence.
[INFO] 
[INFO] --- maven-install-plugin:2.5.2:install (default-install) @ unomi-root ---
[INFO] Installing <https://builds.apache.org/job/unomi-master/ws/pom.xml> to /home/jenkins/jenkins-slave/maven-repositories/0/org/apache/unomi/unomi-root/1.1.0-incubating-SNAPSHOT/unomi-root-1.1.0-incubating-SNAPSHOT.pom
[INFO] Installing <https://builds.apache.org/job/unomi-master/ws/target/unomi-root-1.1.0-incubating-SNAPSHOT-site.xml>
to /home/jenkins/jenkins-slave/maven-repositories/0/org/apache/unomi/unomi-root/1.1.0-incubating-SNAPSHOT/unomi-root-1.1.0-incubating-SNAPSHOT-site.xml
[INFO] 
[INFO] --- maven-deploy-plugin:2.8.2:deploy (default-deploy) @ unomi-root ---
[INFO] Downloading: https://repository.apache.org/content/repositories/snapshots/org/apache/unomi/unomi-root/1.1.0-incubating-SNAPSHOT/maven-metadata.xml
[WARNING] Could not transfer metadata org.apache.unomi:unomi-root:1.1.0-incubating-SNAPSHOT/maven-metadata.xml
from/to apache.snapshots.https (https://repository.apache.org/content/repositories/snapshots):
handshake alert:  unrecognized_name
[INFO] ------------------------------------------------------------------------
[INFO] Reactor Summary:
[INFO] 
[INFO] Apache Unomi :: Root Project ....................... FAILURE [  6.670 s]
[INFO] Apache Unomi :: Specification API .................. SKIPPED
[INFO] Apache Unomi :: Persistence :: SPI (Service Provider Interface) SKIPPED
[INFO] Apache Unomi :: Persistence :: ElasticSearch ....... SKIPPED
[INFO] Apache Unomi :: Persistence :: ElasticSearch :: Core SKIPPED
[INFO] Apache Unomi :: Persistence :: ElasticSearch :: Plugins SKIPPED
[INFO] Apache Unomi :: Persistence :: ElasticSearch :: Plugins :: Security SKIPPED
[INFO] Apache Unomi :: Core Services ...................... SKIPPED
[INFO] Apache Unomi :: REST API ........................... SKIPPED
[INFO] Apache Unomi :: Core Web Application ............... SKIPPED
[INFO] Apache Unomi :: Plugins ............................ SKIPPED
[INFO] Apache Unomi :: Plugins :: Base Actions and Conditions SKIPPED
[INFO] Apache Unomi :: Plugins :: Request reading actions . SKIPPED
[INFO] Apache Unomi :: Plugins :: Mail notifications actions SKIPPED
[INFO] Apache Unomi :: Plugins :: Rules and Actions for optimization tests (A/B testing) SKIPPED
[INFO] Apache Unomi :: Plugins :: Hover event support ..... SKIPPED
[INFO] Apache Unomi :: Plugins :: Conditions based on past events SKIPPED
[INFO] Apache Unomi :: Plugins :: Conditions for events that need to be tracked SKIPPED
[INFO] Apache Unomi :: Extensions ......................... SKIPPED
[INFO] Apache Unomi :: Extensions :: Lists ................ SKIPPED
[INFO] Apache Unomi :: Extensions :: Lists :: Service ..... SKIPPED
[INFO] Apache Unomi :: Extensions :: Lists :: REST API .... SKIPPED
[INFO] Apache Unomi :: Extensions :: Privacy .............. SKIPPED
[INFO] Apache Unomi :: Extensions :: Privacy :: Services .. SKIPPED
[INFO] Apache Unomi :: Extensions :: Privacy :: REST API .. SKIPPED
[INFO] Apache Unomi :: Extensions :: Geonames Database .... SKIPPED
[INFO] Apache Unomi :: Extensions :: Geonames Database :: Service SKIPPED
[INFO] Apache Unomi :: Extensions :: Geonames Database :: REST API SKIPPED
[INFO] Apache Unomi :: Karaf KAR package .................. SKIPPED
[INFO] Apache Unomi :: Samples ............................ SKIPPED
[INFO] Apache Unomi :: Samples :: Tweet Button plugin ..... SKIPPED
[INFO] Apache Unomi :: Distribution Package ............... SKIPPED
[INFO] Apache Unomi :: Integration Tests .................. SKIPPED
[INFO] Apache Unomi :: Performance Tests .................. SKIPPED
[INFO] ------------------------------------------------------------------------
[INFO] BUILD FAILURE
[INFO] ------------------------------------------------------------------------
[INFO] Total time: 21.824 s
[INFO] Finished at: 2016-07-26T16:33:05+00:00
[INFO] Final Memory: 41M/444M
[INFO] ------------------------------------------------------------------------
[ERROR] Failed to execute goal org.apache.maven.plugins:maven-deploy-plugin:2.8.2:deploy (default-deploy)
on project unomi-root: Failed to retrieve remote metadata org.apache.unomi:unomi-root:1.1.0-incubating-SNAPSHOT/maven-metadata.xml:
Could not transfer metadata org.apache.unomi:unomi-root:1.1.0-incubating-SNAPSHOT/maven-metadata.xml
from/to apache.snapshots.https (https://repository.apache.org/content/repositories/snapshots):
handshake alert:  unrecognized_name -> [Help 1]
org.apache.maven.lifecycle.LifecycleExecutionException: Failed to execute goal org.apache.maven.plugins:maven-deploy-plugin:2.8.2:deploy
(default-deploy) on project unomi-root: Failed to retrieve remote metadata org.apache.unomi:unomi-root:1.1.0-incubating-SNAPSHOT/maven-metadata.xml:
Could not transfer metadata org.apache.unomi:unomi-root:1.1.0-incubating-SNAPSHOT/maven-metadata.xml
from/to apache.snapshots.https (https://repository.apache.org/content/repositories/snapshots):
handshake alert:  unrecognized_name
	at org.apache.maven.lifecycle.internal.MojoExecutor.execute(MojoExecutor.java:216)
	at org.apache.maven.lifecycle.internal.MojoExecutor.execute(MojoExecutor.java:153)
	at org.apache.maven.lifecycle.internal.MojoExecutor.execute(MojoExecutor.java:145)
	at org.apache.maven.lifecycle.internal.LifecycleModuleBuilder.buildProject(LifecycleModuleBuilder.java:116)
	at org.apache.maven.lifecycle.internal.LifecycleModuleBuilder.buildProject(LifecycleModuleBuilder.java:80)
	at org.apache.maven.lifecycle.internal.builder.singlethreaded.SingleThreadedBuilder.build(SingleThreadedBuilder.java:51)
	at org.apache.maven.lifecycle.internal.LifecycleStarter.execute(LifecycleStarter.java:128)
	at org.apache.maven.DefaultMaven.doExecute(DefaultMaven.java:307)
	at org.apache.maven.DefaultMaven.doExecute(DefaultMaven.java:193)
	at org.apache.maven.DefaultMaven.execute(DefaultMaven.java:106)
	at org.jvnet.hudson.maven3.launcher.Maven32Launcher.main(Maven32Launcher.java:132)
	at sun.reflect.NativeMethodAccessorImpl.invoke0(Native Method)
	at sun.reflect.NativeMethodAccessorImpl.invoke(NativeMethodAccessorImpl.java:57)
	at sun.reflect.DelegatingMethodAccessorImpl.invoke(DelegatingMethodAccessorImpl.java:43)
	at java.lang.reflect.Method.invoke(Method.java:606)
	at org.codehaus.plexus.classworlds.launcher.Launcher.launchStandard(Launcher.java:330)
	at org.codehaus.plexus.classworlds.launcher.Launcher.launch(Launcher.java:238)
	at jenkins.maven3.agent.Maven32Main.launch(Maven32Main.java:186)
	at sun.reflect.NativeMethodAccessorImpl.invoke0(Native Method)
	at sun.reflect.NativeMethodAccessorImpl.invoke(NativeMethodAccessorImpl.java:57)
	at sun.reflect.DelegatingMethodAccessorImpl.invoke(DelegatingMethodAccessorImpl.java:43)
	at java.lang.reflect.Method.invoke(Method.java:606)
	at hudson.maven.Maven3Builder.call(Maven3Builder.java:136)
	at hudson.maven.Maven3Builder.call(Maven3Builder.java:71)
	at hudson.remoting.UserRequest.perform(UserRequest.java:120)
	at hudson.remoting.UserRequest.perform(UserRequest.java:48)
	at hudson.remoting.Request$2.run(Request.java:326)
	at hudson.remoting.InterceptingExecutorService$1.call(InterceptingExecutorService.java:68)
	at java.util.concurrent.FutureTask.run(FutureTask.java:262)
	at java.util.concurrent.ThreadPoolExecutor.runWorker(ThreadPoolExecutor.java:1145)
	at java.util.concurrent.ThreadPoolExecutor$Worker.run(ThreadPoolExecutor.java:615)
	at java.lang.Thread.run(Thread.java:744)
Caused by: org.apache.maven.plugin.MojoExecutionException: Failed to retrieve remote metadata
org.apache.unomi:unomi-root:1.1.0-incubating-SNAPSHOT/maven-metadata.xml: Could not transfer
metadata org.apache.unomi:unomi-root:1.1.0-incubating-SNAPSHOT/maven-metadata.xml from/to
apache.snapshots.https (https://repository.apache.org/content/repositories/snapshots): handshake
alert:  unrecognized_name
	at org.apache.maven.plugin.deploy.DeployMojo.deployProject(DeployMojo.java:284)
	at org.apache.maven.plugin.deploy.DeployMojo.execute(DeployMojo.java:169)
	at org.apache.maven.plugin.DefaultBuildPluginManager.executeMojo(DefaultBuildPluginManager.java:134)
	at org.apache.maven.lifecycle.internal.MojoExecutor.execute(MojoExecutor.java:208)
	... 31 more
Caused by: org.apache.maven.artifact.deployer.ArtifactDeploymentException: Failed to retrieve
remote metadata org.apache.unomi:unomi-root:1.1.0-incubating-SNAPSHOT/maven-metadata.xml:
Could not transfer metadata org.apache.unomi:unomi-root:1.1.0-incubating-SNAPSHOT/maven-metadata.xml
from/to apache.snapshots.https (https://repository.apache.org/content/repositories/snapshots):
handshake alert:  unrecognized_name
	at org.apache.maven.artifact.deployer.DefaultArtifactDeployer.deploy(DefaultArtifactDeployer.java:143)
	at org.apache.maven.plugin.deploy.AbstractDeployMojo.deploy(AbstractDeployMojo.java:171)
	at org.apache.maven.plugin.deploy.DeployMojo.deployProject(DeployMojo.java:242)
	... 34 more
Caused by: org.eclipse.aether.deployment.DeploymentException: Failed to retrieve remote metadata
org.apache.unomi:unomi-root:1.1.0-incubating-SNAPSHOT/maven-metadata.xml: Could not transfer
metadata org.apache.unomi:unomi-root:1.1.0-incubating-SNAPSHOT/maven-metadata.xml from/to
apache.snapshots.https (https://repository.apache.org/content/repositories/snapshots): handshake
alert:  unrecognized_name
	at org.eclipse.aether.internal.impl.DefaultDeployer.upload(DefaultDeployer.java:447)
	at org.eclipse.aether.internal.impl.DefaultDeployer.deploy(DefaultDeployer.java:290)
	at org.eclipse.aether.internal.impl.DefaultDeployer.deploy(DefaultDeployer.java:245)
	at org.eclipse.aether.internal.impl.DefaultRepositorySystem.deploy(DefaultRepositorySystem.java:413)
	at org.apache.maven.artifact.deployer.DefaultArtifactDeployer.deploy(DefaultArtifactDeployer.java:139)
	... 36 more
Caused by: org.eclipse.aether.transfer.MetadataTransferException: Could not transfer metadata
org.apache.unomi:unomi-root:1.1.0-incubating-SNAPSHOT/maven-metadata.xml from/to apache.snapshots.https
(https://repository.apache.org/content/repositories/snapshots): handshake alert:  unrecognized_name
	at org.eclipse.aether.connector.basic.MetadataTransportListener.transferFailed(MetadataTransportListener.java:43)
	at org.eclipse.aether.connector.basic.BasicRepositoryConnector$TaskRunner.run(BasicRepositoryConnector.java:355)
	at org.eclipse.aether.util.concurrency.RunnableErrorForwarder$1.run(RunnableErrorForwarder.java:67)
	at org.eclipse.aether.connector.basic.BasicRepositoryConnector$DirectExecutor.execute(BasicRepositoryConnector.java:581)
	at org.eclipse.aether.connector.basic.BasicRepositoryConnector.get(BasicRepositoryConnector.java:222)
	at org.eclipse.aether.internal.impl.DefaultDeployer.upload(DefaultDeployer.java:417)
	... 40 more
Caused by: org.apache.maven.wagon.TransferFailedException: handshake alert:  unrecognized_name
	at org.apache.maven.wagon.providers.http.AbstractHttpClientWagon.fillInputData(AbstractHttpClientWagon.java:1066)
	at org.apache.maven.wagon.providers.http.AbstractHttpClientWagon.fillInputData(AbstractHttpClientWagon.java:960)
	at org.apache.maven.wagon.StreamWagon.getInputStream(StreamWagon.java:116)
	at org.apache.maven.wagon.StreamWagon.getIfNewer(StreamWagon.java:88)
	at org.apache.maven.wagon.StreamWagon.get(StreamWagon.java:61)
	at org.eclipse.aether.transport.wagon.WagonTransporter$GetTaskRunner.run(WagonTransporter.java:560)
	at org.eclipse.aether.transport.wagon.WagonTransporter.execute(WagonTransporter.java:427)
	at org.eclipse.aether.transport.wagon.WagonTransporter.get(WagonTransporter.java:404)
	at org.eclipse.aether.connector.basic.BasicRepositoryConnector$GetTaskRunner.runTask(BasicRepositoryConnector.java:447)
	at org.eclipse.aether.connector.basic.BasicRepositoryConnector$TaskRunner.run(BasicRepositoryConnector.java:350)
	... 44 more
Caused by: javax.net.ssl.SSLProtocolException: handshake alert:  unrecognized_name
	at sun.security.ssl.ClientHandshaker.handshakeAlert(ClientHandshaker.java:1292)
	at sun.security.ssl.SSLSocketImpl.recvAlert(SSLSocketImpl.java:1952)
	at sun.security.ssl.SSLSocketImpl.readRecord(SSLSocketImpl.java:1077)
	at sun.security.ssl.SSLSocketImpl.performInitialHandshake(SSLSocketImpl.java:1312)
	at sun.security.ssl.SSLSocketImpl.startHandshake(SSLSocketImpl.java:1339)
	at sun.security.ssl.SSLSocketImpl.startHandshake(SSLSocketImpl.java:1323)
	at org.apache.maven.wagon.providers.http.httpclient.conn.ssl.SSLConnectionSocketFactory.createLayeredSocket(SSLConnectionSocketFactory.java:275)
	at org.apache.maven.wagon.providers.http.httpclient.conn.ssl.SSLConnectionSocketFactory.connectSocket(SSLConnectionSocketFactory.java:254)
	at org.apache.maven.wagon.providers.http.httpclient.impl.conn.HttpClientConnectionOperator.connect(HttpClientConnectionOperator.java:123)
	at org.apache.maven.wagon.providers.http.httpclient.impl.conn.PoolingHttpClientConnectionManager.connect(PoolingHttpClientConnectionManager.java:318)
	at org.apache.maven.wagon.providers.http.httpclient.impl.execchain.MainClientExec.establishRoute(MainClientExec.java:363)
	at org.apache.maven.wagon.providers.http.httpclient.impl.execchain.MainClientExec.execute(MainClientExec.java:219)
	at org.apache.maven.wagon.providers.http.httpclient.impl.execchain.ProtocolExec.execute(ProtocolExec.java:195)
	at org.apache.maven.wagon.providers.http.httpclient.impl.execchain.RetryExec.execute(RetryExec.java:86)
	at org.apache.maven.wagon.providers.http.httpclient.impl.execchain.RedirectExec.execute(RedirectExec.java:108)
	at org.apache.maven.wagon.providers.http.httpclient.impl.client.InternalHttpClient.doExecute(InternalHttpClient.java:184)
	at org.apache.maven.wagon.providers.http.httpclient.impl.client.CloseableHttpClient.execute(CloseableHttpClient.java:82)
	at org.apache.maven.wagon.providers.http.AbstractHttpClientWagon.execute(AbstractHttpClientWagon.java:832)
	at org.apache.maven.wagon.providers.http.AbstractHttpClientWagon.fillInputData(AbstractHttpClientWagon.java:983)
	... 53 more
[ERROR] 
[ERROR] Re-run Maven using the -X switch to enable full debug logging.
[ERROR] 
[ERROR] For more information about the errors and possible solutions, please read the following
articles:
[ERROR] [Help 1] http://cwiki.apache.org/confluence/display/MAVEN/MojoExecutionException
[JENKINS] Archiving <https://builds.apache.org/job/unomi-master/ws/pom.xml> to org.apache.unomi/unomi-root/1.1.0-incubating-SNAPSHOT/unomi-root-1.1.0-incubating-SNAPSHOT.pom
[JENKINS] Archiving <https://builds.apache.org/job/unomi-master/ws/target/unomi-root-1.1.0-incubating-SNAPSHOT-site.xml>
to org.apache.unomi/unomi-root/1.1.0-incubating-SNAPSHOT/unomi-root-1.1.0-incubating-SNAPSHOT-site.xml
[JENKINS] Archiving <https://builds.apache.org/job/unomi-master/ws/samples/pom.xml>
to org.apache.unomi/samples/1.1.0-incubating-SNAPSHOT/samples-1.1.0-incubating-SNAPSHOT.pom
[JENKINS] Archiving <https://builds.apache.org/job/unomi-master/ws/services/pom.xml>
to org.apache.unomi/unomi-services/1.1.0-incubating-SNAPSHOT/unomi-services-1.1.0-incubating-SNAPSHOT.pom
[JENKINS] Archiving <https://builds.apache.org/job/unomi-master/ws/rest/pom.xml> to
org.apache.unomi/unomi-rest/1.1.0-incubating-SNAPSHOT/unomi-rest-1.1.0-incubating-SNAPSHOT.pom
[JENKINS] Archiving <https://builds.apache.org/job/unomi-master/ws/plugins/hover-event/pom.xml>
to org.apache.unomi/unomi-plugins-hover-event/1.1.0-incubating-SNAPSHOT/unomi-plugins-hover-event-1.1.0-incubating-SNAPSHOT.pom
[JENKINS] Archiving <https://builds.apache.org/job/unomi-master/ws/api/pom.xml> to org.apache.unomi/unomi-api/1.1.0-incubating-SNAPSHOT/unomi-api-1.1.0-incubating-SNAPSHOT.pom
[JENKINS] Archiving <https://builds.apache.org/job/unomi-master/ws/extensions/lists-extension/services/pom.xml>
to org.apache.unomi/cxs-lists-extension-services/1.1.0-incubating-SNAPSHOT/cxs-lists-extension-services-1.1.0-incubating-SNAPSHOT.pom
[JENKINS] Archiving <https://builds.apache.org/job/unomi-master/ws/plugins/request/pom.xml>
to org.apache.unomi/unomi-plugins-request/1.1.0-incubating-SNAPSHOT/unomi-plugins-request-1.1.0-incubating-SNAPSHOT.pom
[JENKINS] Archiving <https://builds.apache.org/job/unomi-master/ws/extensions/geonames/rest/pom.xml>
to org.apache.unomi/cxs-geonames-rest/1.1.0-incubating-SNAPSHOT/cxs-geonames-rest-1.1.0-incubating-SNAPSHOT.pom
[JENKINS] Archiving <https://builds.apache.org/job/unomi-master/ws/performance-tests/pom.xml>
to org.apache.unomi/unomi-performance-tests/1.1.0-incubating-SNAPSHOT/unomi-performance-tests-1.1.0-incubating-SNAPSHOT.pom
[JENKINS] Archiving <https://builds.apache.org/job/unomi-master/ws/persistence-elasticsearch/core/pom.xml>
to org.apache.unomi/unomi-persistence-elasticsearch-core/1.1.0-incubating-SNAPSHOT/unomi-persistence-elasticsearch-core-1.1.0-incubating-SNAPSHOT.pom
[JENKINS] Archiving <https://builds.apache.org/job/unomi-master/ws/plugins/tracked-event/pom.xml>
to org.apache.unomi/unomi-plugins-tracked-event/1.1.0-incubating-SNAPSHOT/unomi-plugins-tracked-event-1.1.0-incubating-SNAPSHOT.pom
[JENKINS] Archiving <https://builds.apache.org/job/unomi-master/ws/extensions/privacy-extension/services/pom.xml>
to org.apache.unomi/cxs-privacy-extension-services/1.1.0-incubating-SNAPSHOT/cxs-privacy-extension-services-1.1.0-incubating-SNAPSHOT.pom
[JENKINS] Archiving <https://builds.apache.org/job/unomi-master/ws/package/pom.xml>
to org.apache.unomi/unomi/1.1.0-incubating-SNAPSHOT/unomi-1.1.0-incubating-SNAPSHOT.pom
[JENKINS] Archiving <https://builds.apache.org/job/unomi-master/ws/samples/tweet-button-plugin/pom.xml>
to org.apache.unomi/tweet-button-plugin/1.1.0-incubating-SNAPSHOT/tweet-button-plugin-1.1.0-incubating-SNAPSHOT.pom
[JENKINS] Archiving <https://builds.apache.org/job/unomi-master/ws/persistence-elasticsearch/plugins/security/pom.xml>
to org.apache.unomi/unomi-persistence-elasticsearch-plugins-security/1.1.0-incubating-SNAPSHOT/unomi-persistence-elasticsearch-plugins-security-1.1.0-incubating-SNAPSHOT.pom
[JENKINS] Archiving <https://builds.apache.org/job/unomi-master/ws/extensions/pom.xml>
to org.apache.unomi/unomi-extensions/1.1.0-incubating-SNAPSHOT/unomi-extensions-1.1.0-incubating-SNAPSHOT.pom
[JENKINS] Archiving <https://builds.apache.org/job/unomi-master/ws/extensions/lists-extension/rest/pom.xml>
to org.apache.unomi/cxs-lists-extension-rest/1.1.0-incubating-SNAPSHOT/cxs-lists-extension-rest-1.1.0-incubating-SNAPSHOT.pom
[JENKINS] Archiving <https://builds.apache.org/job/unomi-master/ws/extensions/geonames/pom.xml>
to org.apache.unomi/cxs-geonames/1.1.0-incubating-SNAPSHOT/cxs-geonames-1.1.0-incubating-SNAPSHOT.pom
[JENKINS] Archiving <https://builds.apache.org/job/unomi-master/ws/plugins/pom.xml>
to org.apache.unomi/unomi-plugins/1.1.0-incubating-SNAPSHOT/unomi-plugins-1.1.0-incubating-SNAPSHOT.pom
[JENKINS] Archiving <https://builds.apache.org/job/unomi-master/ws/plugins/mail/pom.xml>
to org.apache.unomi/unomi-plugins-mail/1.1.0-incubating-SNAPSHOT/unomi-plugins-mail-1.1.0-incubating-SNAPSHOT.pom
[JENKINS] Archiving <https://builds.apache.org/job/unomi-master/ws/extensions/privacy-extension/rest/pom.xml>
to org.apache.unomi/cxs-privacy-extension-rest/1.1.0-incubating-SNAPSHOT/cxs-privacy-extension-rest-1.1.0-incubating-SNAPSHOT.pom
[JENKINS] Archiving <https://builds.apache.org/job/unomi-master/ws/extensions/lists-extension/pom.xml>
to org.apache.unomi/cxs-lists-extension/1.1.0-incubating-SNAPSHOT/cxs-lists-extension-1.1.0-incubating-SNAPSHOT.pom
[JENKINS] Archiving <https://builds.apache.org/job/unomi-master/ws/kar/pom.xml> to org.apache.unomi/unomi-kar/1.1.0-incubating-SNAPSHOT/unomi-kar-1.1.0-incubating-SNAPSHOT.pom
[JENKINS] Archiving <https://builds.apache.org/job/unomi-master/ws/plugins/optimization-test/pom.xml>
to org.apache.unomi/unomi-plugins-optimization-test/1.1.0-incubating-SNAPSHOT/unomi-plugins-optimization-test-1.1.0-incubating-SNAPSHOT.pom
[JENKINS] Archiving <https://builds.apache.org/job/unomi-master/ws/plugins/past-event/pom.xml>
to org.apache.unomi/unomi-plugins-past-event/1.1.0-incubating-SNAPSHOT/unomi-plugins-past-event-1.1.0-incubating-SNAPSHOT.pom
[JENKINS] Archiving <https://builds.apache.org/job/unomi-master/ws/persistence-elasticsearch/plugins/pom.xml>
to org.apache.unomi/unomi-persistence-elasticsearch-plugins/1.1.0-incubating-SNAPSHOT/unomi-persistence-elasticsearch-plugins-1.1.0-incubating-SNAPSHOT.pom
[JENKINS] Archiving <https://builds.apache.org/job/unomi-master/ws/extensions/privacy-extension/pom.xml>
to org.apache.unomi/cxs-privacy-extension/1.1.0-incubating-SNAPSHOT/cxs-privacy-extension-1.1.0-incubating-SNAPSHOT.pom
[JENKINS] Archiving <https://builds.apache.org/job/unomi-master/ws/persistence-spi/pom.xml>
to org.apache.unomi/unomi-persistence-spi/1.1.0-incubating-SNAPSHOT/unomi-persistence-spi-1.1.0-incubating-SNAPSHOT.pom
[JENKINS] Archiving <https://builds.apache.org/job/unomi-master/ws/wab/pom.xml> to org.apache.unomi/unomi-wab/1.1.0-incubating-SNAPSHOT/unomi-wab-1.1.0-incubating-SNAPSHOT.pom
[JENKINS] Archiving <https://builds.apache.org/job/unomi-master/ws/extensions/geonames/services/pom.xml>
to org.apache.unomi/cxs-geonames-services/1.1.0-incubating-SNAPSHOT/cxs-geonames-services-1.1.0-incubating-SNAPSHOT.pom
[JENKINS] Archiving <https://builds.apache.org/job/unomi-master/ws/plugins/baseplugin/pom.xml>
to org.apache.unomi/unomi-plugins-base/1.1.0-incubating-SNAPSHOT/unomi-plugins-base-1.1.0-incubating-SNAPSHOT.pom
[JENKINS] Archiving <https://builds.apache.org/job/unomi-master/ws/persistence-elasticsearch/pom.xml>
to org.apache.unomi/unomi-persistence-elasticsearch/1.1.0-incubating-SNAPSHOT/unomi-persistence-elasticsearch-1.1.0-incubating-SNAPSHOT.pom
[JENKINS] Archiving <https://builds.apache.org/job/unomi-master/ws/itests/pom.xml> to
org.apache.unomi/unomi-itests/1.1.0-incubating-SNAPSHOT/unomi-itests-1.1.0-incubating-SNAPSHOT.pom
Sending e-mails to: commits@unomi.incubator.apache.org
channel stopped

Mime
View raw message