usergrid-commits mailing list archives

Site index · List index
Message view « Date » · « Thread »
Top « Date » · « Thread »
From Apache Jenkins Server <jenk...@builds.apache.org>
Subject Build failed in Jenkins: usergrid-stack #32
Date Wed, 03 Sep 2014 11:59:30 GMT
See <https://builds.apache.org/job/usergrid-stack/32/changes>

Changes:

[Dave Johnson] Preparing for RC5 which will exclude the Portal's bower_components, node_modules
and other giti-gnored files.

------------------------------------------
[...truncated 11752 lines...]
Downloaded: http://repo.maven.apache.org/maven2/org/apache/tomcat/el-api/6.0.33/el-api-6.0.33.pom
(2 KB at 8.0 KB/sec)
Downloading: file://<https://builds.apache.org/job/usergrid-stack/ws/stack/launcher/../m2/repository/org/eclipse/jdt/core/compiler/ecj/3.3.1/ecj-3.3.1.pom>
Downloading: http://repo.maven.apache.org/maven2/org/eclipse/jdt/core/compiler/ecj/3.3.1/ecj-3.3.1.pom
Downloaded: http://repo.maven.apache.org/maven2/org/eclipse/jdt/core/compiler/ecj/3.3.1/ecj-3.3.1.pom
(2 KB at 28.7 KB/sec)
Downloading: file://<https://builds.apache.org/job/usergrid-stack/ws/stack/launcher/../m2/repository/org/apache/tomcat/jasper-el/6.0.33/jasper-el-6.0.33.pom>
Downloading: http://repo.maven.apache.org/maven2/org/apache/tomcat/jasper-el/6.0.33/jasper-el-6.0.33.pom
Downloaded: http://repo.maven.apache.org/maven2/org/apache/tomcat/jasper-el/6.0.33/jasper-el-6.0.33.pom
(2 KB at 23.3 KB/sec)
Downloading: file://<https://builds.apache.org/job/usergrid-stack/ws/stack/launcher/../m2/repository/com/sun/jersey/jersey-grizzly2/1.18/jersey-grizzly2-1.18.pom>
Downloading: http://repo.maven.apache.org/maven2/com/sun/jersey/jersey-grizzly2/1.18/jersey-grizzly2-1.18.pom
Downloaded: http://repo.maven.apache.org/maven2/com/sun/jersey/jersey-grizzly2/1.18/jersey-grizzly2-1.18.pom
(8 KB at 135.1 KB/sec)
Downloading: file://<https://builds.apache.org/job/usergrid-stack/ws/stack/launcher/../m2/repository/org/glassfish/grizzly/grizzly-http-servlet-server/2.1.2/grizzly-http-servlet-server-2.1.2.pom>
Downloading: http://repo.maven.apache.org/maven2/org/glassfish/grizzly/grizzly-http-servlet-server/2.1.2/grizzly-http-servlet-server-2.1.2.pom
Downloaded: http://repo.maven.apache.org/maven2/org/glassfish/grizzly/grizzly-http-servlet-server/2.1.2/grizzly-http-servlet-server-2.1.2.pom
(7 KB at 120.6 KB/sec)
Downloading: file://<https://builds.apache.org/job/usergrid-stack/ws/stack/launcher/../m2/repository/org/glassfish/grizzly/grizzly-http-server-core/2.1.2/grizzly-http-server-core-2.1.2.pom>
Downloading: http://repo.maven.apache.org/maven2/org/glassfish/grizzly/grizzly-http-server-core/2.1.2/grizzly-http-server-core-2.1.2.pom
Downloaded: http://repo.maven.apache.org/maven2/org/glassfish/grizzly/grizzly-http-server-core/2.1.2/grizzly-http-server-core-2.1.2.pom
(7 KB at 127.5 KB/sec)
Downloading: file://<https://builds.apache.org/job/usergrid-stack/ws/stack/launcher/../m2/repository/org/glassfish/grizzly/grizzly-core/2.1.2/grizzly-core-2.1.2.pom>
Downloading: http://repo.maven.apache.org/maven2/org/glassfish/grizzly/grizzly-core/2.1.2/grizzly-core-2.1.2.pom
Downloaded: http://repo.maven.apache.org/maven2/org/glassfish/grizzly/grizzly-core/2.1.2/grizzly-core-2.1.2.pom
(7 KB at 125.4 KB/sec)
Downloading: file://<https://builds.apache.org/job/usergrid-stack/ws/stack/launcher/../m2/repository/org/glassfish/grizzly/grizzly-portunif/2.1.2/grizzly-portunif-2.1.2.pom>
Downloading: http://repo.maven.apache.org/maven2/org/glassfish/grizzly/grizzly-portunif/2.1.2/grizzly-portunif-2.1.2.pom
Downloaded: http://repo.maven.apache.org/maven2/org/glassfish/grizzly/grizzly-portunif/2.1.2/grizzly-portunif-2.1.2.pom
(4 KB at 73.3 KB/sec)
Downloading: file://<https://builds.apache.org/job/usergrid-stack/ws/stack/launcher/../m2/repository/org/glassfish/grizzly/grizzly-http-ajp/2.1.2/grizzly-http-ajp-2.1.2.pom>
Downloading: http://repo.maven.apache.org/maven2/org/glassfish/grizzly/grizzly-http-ajp/2.1.2/grizzly-http-ajp-2.1.2.pom
Downloaded: http://repo.maven.apache.org/maven2/org/glassfish/grizzly/grizzly-http-ajp/2.1.2/grizzly-http-ajp-2.1.2.pom
(5 KB at 31.7 KB/sec)
Downloading: file://<https://builds.apache.org/job/usergrid-stack/ws/stack/launcher/../m2/repository/org/glassfish/grizzly/grizzly-http-server-multipart/2.1.2/grizzly-http-server-multipart-2.1.2.pom>
Downloading: http://repo.maven.apache.org/maven2/org/glassfish/grizzly/grizzly-http-server-multipart/2.1.2/grizzly-http-server-multipart-2.1.2.pom
Downloaded: http://repo.maven.apache.org/maven2/org/glassfish/grizzly/grizzly-http-server-multipart/2.1.2/grizzly-http-server-multipart-2.1.2.pom
(6 KB at 109.0 KB/sec)
Downloading: file://<https://builds.apache.org/job/usergrid-stack/ws/stack/launcher/../m2/repository/com/apple/AppleJavaExtensions/1.4/AppleJavaExtensions-1.4.pom>
Downloading: http://repo.maven.apache.org/maven2/com/apple/AppleJavaExtensions/1.4/AppleJavaExtensions-1.4.pom
Downloaded: http://repo.maven.apache.org/maven2/com/apple/AppleJavaExtensions/1.4/AppleJavaExtensions-1.4.pom
(6 KB at 111.7 KB/sec)
Downloading: file://<https://builds.apache.org/job/usergrid-stack/ws/stack/launcher/../m2/repository/org/apache/tomcat/jasper/6.0.33/jasper-6.0.33.jar>
Downloading: file://<https://builds.apache.org/job/usergrid-stack/ws/stack/launcher/../m2/repository/org/apache/tomcat/jsp-api/6.0.33/jsp-api-6.0.33.jar>
Downloading: file://<https://builds.apache.org/job/usergrid-stack/ws/stack/launcher/../m2/repository/org/apache/tomcat/el-api/6.0.33/el-api-6.0.33.jar>
Downloading: file://<https://builds.apache.org/job/usergrid-stack/ws/stack/launcher/../m2/repository/org/eclipse/jdt/core/compiler/ecj/3.3.1/ecj-3.3.1.jar>
Downloading: file://<https://builds.apache.org/job/usergrid-stack/ws/stack/launcher/../m2/repository/org/apache/tomcat/jasper-el/6.0.33/jasper-el-6.0.33.jar>
Downloading: file://<https://builds.apache.org/job/usergrid-stack/ws/stack/launcher/../m2/repository/com/sun/jersey/jersey-grizzly2/1.18/jersey-grizzly2-1.18.jar>
Downloading: file://<https://builds.apache.org/job/usergrid-stack/ws/stack/launcher/../m2/repository/org/glassfish/grizzly/grizzly-http-servlet-server/2.1.2/grizzly-http-servlet-server-2.1.2.jar>
Downloading: file://<https://builds.apache.org/job/usergrid-stack/ws/stack/launcher/../m2/repository/org/glassfish/grizzly/grizzly-http-server-core/2.1.2/grizzly-http-server-core-2.1.2.jar>
Downloading: file://<https://builds.apache.org/job/usergrid-stack/ws/stack/launcher/../m2/repository/org/glassfish/grizzly/grizzly-core/2.1.2/grizzly-core-2.1.2.jar>
Downloading: file://<https://builds.apache.org/job/usergrid-stack/ws/stack/launcher/../m2/repository/org/glassfish/grizzly/grizzly-http-ajp/2.1.2/grizzly-http-ajp-2.1.2.jar>
Downloading: file://<https://builds.apache.org/job/usergrid-stack/ws/stack/launcher/../m2/repository/org/glassfish/grizzly/grizzly-http-server-multipart/2.1.2/grizzly-http-server-multipart-2.1.2.jar>
Downloading: file://<https://builds.apache.org/job/usergrid-stack/ws/stack/launcher/../m2/repository/org/glassfish/grizzly/grizzly-portunif/2.1.2/grizzly-portunif-2.1.2.jar>
Downloading: file://<https://builds.apache.org/job/usergrid-stack/ws/stack/launcher/../m2/repository/com/apple/AppleJavaExtensions/1.4/AppleJavaExtensions-1.4.jar>
Downloading: http://repo.maven.apache.org/maven2/org/apache/tomcat/jasper/6.0.33/jasper-6.0.33.jar
Downloading: http://repo.maven.apache.org/maven2/org/apache/tomcat/jsp-api/6.0.33/jsp-api-6.0.33.jar
Downloading: http://repo.maven.apache.org/maven2/org/apache/tomcat/el-api/6.0.33/el-api-6.0.33.jar
Downloading: http://repo.maven.apache.org/maven2/org/apache/tomcat/jasper-el/6.0.33/jasper-el-6.0.33.jar
Downloading: http://repo.maven.apache.org/maven2/org/eclipse/jdt/core/compiler/ecj/3.3.1/ecj-3.3.1.jar
Downloaded: http://repo.maven.apache.org/maven2/org/apache/tomcat/el-api/6.0.33/el-api-6.0.33.jar
(33 KB at 561.2 KB/sec)
Downloading: http://repo.maven.apache.org/maven2/com/sun/jersey/jersey-grizzly2/1.18/jersey-grizzly2-1.18.jar
Downloaded: http://repo.maven.apache.org/maven2/org/apache/tomcat/jasper/6.0.33/jasper-6.0.33.jar
(516 KB at 6440.0 KB/sec)
Downloading: http://repo.maven.apache.org/maven2/org/glassfish/grizzly/grizzly-http-servlet-server/2.1.2/grizzly-http-servlet-server-2.1.2.jar
Downloaded: http://repo.maven.apache.org/maven2/org/apache/tomcat/jsp-api/6.0.33/jsp-api-6.0.33.jar
(75 KB at 936.2 KB/sec)
Downloading: http://repo.maven.apache.org/maven2/org/glassfish/grizzly/grizzly-http-server-core/2.1.2/grizzly-http-server-core-2.1.2.jar
Downloaded: http://repo.maven.apache.org/maven2/org/apache/tomcat/jasper-el/6.0.33/jasper-el-6.0.33.jar
(110 KB at 1017.7 KB/sec)
Downloading: http://repo.maven.apache.org/maven2/org/glassfish/grizzly/grizzly-core/2.1.2/grizzly-core-2.1.2.jar
Downloaded: http://repo.maven.apache.org/maven2/com/sun/jersey/jersey-grizzly2/1.18/jersey-grizzly2-1.18.jar
(16 KB at 278.7 KB/sec)
Downloading: http://repo.maven.apache.org/maven2/org/glassfish/grizzly/grizzly-portunif/2.1.2/grizzly-portunif-2.1.2.jar
Downloaded: http://repo.maven.apache.org/maven2/org/glassfish/grizzly/grizzly-portunif/2.1.2/grizzly-portunif-2.1.2.jar
(17 KB at 73.4 KB/sec)
Downloading: http://repo.maven.apache.org/maven2/org/glassfish/grizzly/grizzly-http-ajp/2.1.2/grizzly-http-ajp-2.1.2.jar
Downloaded: http://repo.maven.apache.org/maven2/org/glassfish/grizzly/grizzly-core/2.1.2/grizzly-core-2.1.2.jar
(690 KB at 2934.9 KB/sec)
Downloading: http://repo.maven.apache.org/maven2/org/glassfish/grizzly/grizzly-http-server-multipart/2.1.2/grizzly-http-server-multipart-2.1.2.jar
Downloaded: http://repo.maven.apache.org/maven2/org/eclipse/jdt/core/compiler/ecj/3.3.1/ecj-3.3.1.jar
(1528 KB at 4441.6 KB/sec)
Downloading: http://repo.maven.apache.org/maven2/com/apple/AppleJavaExtensions/1.4/AppleJavaExtensions-1.4.jar
Downloaded: http://repo.maven.apache.org/maven2/org/glassfish/grizzly/grizzly-http-server-core/2.1.2/grizzly-http-server-core-2.1.2.jar
(1167 KB at 3926.6 KB/sec)
Downloaded: http://repo.maven.apache.org/maven2/org/glassfish/grizzly/grizzly-http-ajp/2.1.2/grizzly-http-ajp-2.1.2.jar
(25 KB at 448.1 KB/sec)
Downloaded: http://repo.maven.apache.org/maven2/com/apple/AppleJavaExtensions/1.4/AppleJavaExtensions-1.4.jar
(12 KB at 220.1 KB/sec)
Downloaded: http://repo.maven.apache.org/maven2/org/glassfish/grizzly/grizzly-http-server-multipart/2.1.2/grizzly-http-server-multipart-2.1.2.jar
(27 KB at 478.2 KB/sec)
Downloaded: http://repo.maven.apache.org/maven2/org/glassfish/grizzly/grizzly-http-servlet-server/2.1.2/grizzly-http-servlet-server-2.1.2.jar
(1431 KB at 1461.4 KB/sec)
[INFO] 
[INFO] --- maven-clean-plugin:2.4.1:clean (default-clean) @ usergrid-launcher ---
[INFO] Deleting <https://builds.apache.org/job/usergrid-stack/ws/stack/launcher/target>
[INFO] 
[INFO] --- maven-enforcer-plugin:1.3.1:enforce (enforce-java) @ usergrid-launcher ---
[INFO] 
[INFO] --- maven-remote-resources-plugin:1.2.1:process (default) @ usergrid-launcher ---
[INFO] 
[INFO] --- maven-resources-plugin:2.6:resources (default-resources) @ usergrid-launcher ---
[INFO] Using 'UTF-8' encoding to copy filtered resources.
[INFO] Copying 38 resources
[INFO] Copying 3 resources
[INFO] 
[INFO] --- maven-compiler-plugin:3.1:compile (default-compile) @ usergrid-launcher ---
[INFO] Changes detected - recompiling the module!
[INFO] Compiling 10 source files to <https://builds.apache.org/job/usergrid-stack/ws/stack/launcher/target/classes>
[INFO] -------------------------------------------------------------
[WARNING] COMPILATION WARNING : 
[INFO] -------------------------------------------------------------
[WARNING] bootstrap class path not set in conjunction with -source 1.6
[WARNING] <https://builds.apache.org/job/usergrid-stack/ws/stack/launcher/src/main/java/org/apache/usergrid/launcher/LauncherFrame.java>:
<https://builds.apache.org/job/usergrid-stack/ws/stack/launcher/src/main/java/org/apache/usergrid/launcher/LauncherFrame.java>
uses unchecked or unsafe operations.
[WARNING] <https://builds.apache.org/job/usergrid-stack/ws/stack/launcher/src/main/java/org/apache/usergrid/launcher/LauncherFrame.java>:
Recompile with -Xlint:unchecked for details.
[INFO] 3 warnings 
[INFO] -------------------------------------------------------------
[INFO] -------------------------------------------------------------
[ERROR] COMPILATION ERROR : 
[INFO] -------------------------------------------------------------
[ERROR] <https://builds.apache.org/job/usergrid-stack/ws/stack/launcher/src/main/java/org/apache/usergrid/launcher/AppleUtils.java>:[30,51]
cannot find symbol
  symbol:   class AboutHandler
  location: package com.apple.eawt
[INFO] 1 error
[INFO] -------------------------------------------------------------
[INFO] ------------------------------------------------------------------------
[INFO] Reactor Summary:
[INFO] 
[INFO] Usergrid Parent ................................... SUCCESS [33.145s]
[INFO] Usergrid Java SDK 0.0.3 ........................... SUCCESS [8.720s]
[INFO] Usergrid Build Tools .............................. SUCCESS [2.816s]
[INFO] Usergrid Config ................................... SUCCESS [3.085s]
[INFO] Usergrid Test Utils ............................... SUCCESS [21.010s]
[INFO] Usergrid Core ..................................... SUCCESS [4:57.476s]
[INFO] Usergrid Services ................................. SUCCESS [1:12.241s]
[INFO] Usergrid MongoDB Emulator ......................... SUCCESS [6.668s]
[INFO] Usergrid REST ..................................... SUCCESS [6:08.766s]
[INFO] Usergrid Tools .................................... SUCCESS [41.083s]
[INFO] Usergrid Websocket ................................ SUCCESS [9.021s]
[INFO] Usergrid Launcher ................................. FAILURE [5.769s]
[INFO] ------------------------------------------------------------------------
[INFO] BUILD FAILURE
[INFO] ------------------------------------------------------------------------
[INFO] Total time: 14:52.935s
[INFO] Finished at: Wed Sep 03 11:57:45 UTC 2014
[INFO] Final Memory: 76M/368M
[INFO] ------------------------------------------------------------------------
Waiting for Jenkins to finish collecting data
[ERROR] Failed to execute goal org.apache.maven.plugins:maven-compiler-plugin:3.1:compile
(default-compile) on project usergrid-launcher: Compilation failure
[ERROR] <https://builds.apache.org/job/usergrid-stack/ws/stack/launcher/src/main/java/org/apache/usergrid/launcher/AppleUtils.java>:[30,51]
cannot find symbol
[ERROR] symbol:   class AboutHandler
[ERROR] location: package com.apple.eawt
[ERROR] -> [Help 1]
[ERROR] 
[ERROR] To see the full stack trace of the errors, re-run Maven with the -e switch.
[ERROR] Re-run Maven using the -X switch to enable full debug logging.
[ERROR] 
[ERROR] For more information about the errors and possible solutions, please read the following
articles:
[ERROR] [Help 1] http://cwiki.apache.org/confluence/display/MAVEN/MojoFailureException
[ERROR] 
[ERROR] After correcting the problems, you can resume the build with the command
[ERROR]   mvn <goals> -rf :usergrid-launcher
[JENKINS] Archiving <https://builds.apache.org/job/usergrid-stack/ws/stack/build-tools/pom.xml>
to org.apache.usergrid/build-tools/1.0.0/build-tools-1.0.0.pom
[JENKINS] Archiving <https://builds.apache.org/job/usergrid-stack/ws/stack/build-tools/target/build-tools-1.0.0.jar>
to org.apache.usergrid/build-tools/1.0.0/build-tools-1.0.0.jar
[JENKINS] Archiving <https://builds.apache.org/job/usergrid-stack/ws/stack/build-tools/target/build-tools-1.0.0-tests.jar>
to org.apache.usergrid/build-tools/1.0.0/build-tools-1.0.0-tests.jar
Sending artifact delta relative to usergrid-stack ? Usergrid Build Tools #31
Archived 3 artifacts
Archive block size is 32768
Received 0 blocks and 18905 bytes
Compression is 0.0%
Took 0.13 sec
[JENKINS] Archiving <https://builds.apache.org/job/usergrid-stack/ws/stack/websocket/pom.xml>
to org.apache.usergrid/usergrid-websocket/1.0.0/usergrid-websocket-1.0.0.pom
[JENKINS] Archiving <https://builds.apache.org/job/usergrid-stack/ws/stack/websocket/target/usergrid-websocket-1.0.0.jar>
to org.apache.usergrid/usergrid-websocket/1.0.0/usergrid-websocket-1.0.0.jar
[JENKINS] Archiving <https://builds.apache.org/job/usergrid-stack/ws/stack/websocket/target/usergrid-websocket-1.0.0-tests.jar>
to org.apache.usergrid/usergrid-websocket/1.0.0/usergrid-websocket-1.0.0-tests.jar
Sending artifact delta relative to usergrid-stack ? Usergrid Websocket #31
Archived 3 artifacts
Archive block size is 32768
Received 0 blocks and 51959 bytes
Compression is 0.0%
Took 0.1 sec
[JENKINS] Archiving <https://builds.apache.org/job/usergrid-stack/ws/stack/services/pom.xml>
to org.apache.usergrid/usergrid-services/1.0.0/usergrid-services-1.0.0.pom
[JENKINS] Archiving <https://builds.apache.org/job/usergrid-stack/ws/stack/services/target/usergrid-services-1.0.0.jar>
to org.apache.usergrid/usergrid-services/1.0.0/usergrid-services-1.0.0.jar
[JENKINS] Archiving <https://builds.apache.org/job/usergrid-stack/ws/stack/services/target/usergrid-services-1.0.0-tests.jar>
to org.apache.usergrid/usergrid-services/1.0.0/usergrid-services-1.0.0-tests.jar
Sending artifact delta relative to usergrid-stack ? Usergrid Services #31
Archived 3 artifacts
Archive block size is 32768
Received 0 blocks and 422008 bytes
Compression is 0.0%
Took 1.8 sec
[JENKINS] Archiving <https://builds.apache.org/job/usergrid-stack/ws/stack/pom.xml>
to org.apache.usergrid/usergrid/1.0.0/usergrid-1.0.0.pom
[JENKINS] Archiving <https://builds.apache.org/job/usergrid-stack/ws/stack/target/usergrid-1.0.0-tests.jar>
to org.apache.usergrid/usergrid/1.0.0/usergrid-1.0.0-tests.jar
Sending artifact delta relative to usergrid-stack ? Usergrid Parent #31
Archived 2 artifacts
Archive block size is 32768
Received 1 blocks and 34487 bytes
Compression is 48.7%
Took 0.11 sec
[JENKINS] Archiving <https://builds.apache.org/job/usergrid-stack/ws/stack/config/pom.xml>
to org.apache.usergrid/usergrid-config/1.0.0/usergrid-config-1.0.0.pom
[JENKINS] Archiving <https://builds.apache.org/job/usergrid-stack/ws/stack/config/target/usergrid-config-1.0.0.jar>
to org.apache.usergrid/usergrid-config/1.0.0/usergrid-config-1.0.0.jar
[JENKINS] Archiving <https://builds.apache.org/job/usergrid-stack/ws/stack/config/target/usergrid-config-1.0.0-tests.jar>
to org.apache.usergrid/usergrid-config/1.0.0/usergrid-config-1.0.0-tests.jar
Sending artifact delta relative to usergrid-stack ? Usergrid Config #31
Archived 3 artifacts
Archive block size is 32768
Received 0 blocks and 39133 bytes
Compression is 0.0%
Took 0.1 sec
[JENKINS] Archiving <https://builds.apache.org/job/usergrid-stack/ws/stack/launcher/pom.xml>
to org.apache.usergrid/usergrid-launcher/1.0.0/usergrid-launcher-1.0.0.pom
Sending artifact delta relative to usergrid-stack ? Usergrid Launcher #29
Archived 1 artifacts
Archive block size is 32768
Received 0 blocks and 7825 bytes
Compression is 0.0%
Took 2.5 sec
[JENKINS] Archiving <https://builds.apache.org/job/usergrid-stack/ws/stack/test-utils/pom.xml>
to org.apache.usergrid/usergrid-test-utils/1.0.0/usergrid-test-utils-1.0.0.pom
[JENKINS] Archiving <https://builds.apache.org/job/usergrid-stack/ws/stack/test-utils/target/usergrid-test-utils-1.0.0.jar>
to org.apache.usergrid/usergrid-test-utils/1.0.0/usergrid-test-utils-1.0.0.jar
[JENKINS] Archiving <https://builds.apache.org/job/usergrid-stack/ws/stack/test-utils/target/usergrid-test-utils-1.0.0-tests.jar>
to org.apache.usergrid/usergrid-test-utils/1.0.0/usergrid-test-utils-1.0.0-tests.jar
Sending artifact delta relative to usergrid-stack ? Usergrid Test Utils #31
Archived 3 artifacts
Archive block size is 32768
Received 0 blocks and 71901 bytes
Compression is 0.0%
Took 0.14 sec
[JENKINS] Archiving <https://builds.apache.org/job/usergrid-stack/ws/stack/core/pom.xml>
to org.apache.usergrid/usergrid-core/1.0.0/usergrid-core-1.0.0.pom
[JENKINS] Archiving <https://builds.apache.org/job/usergrid-stack/ws/stack/core/target/usergrid-core-1.0.0.jar>
to org.apache.usergrid/usergrid-core/1.0.0/usergrid-core-1.0.0.jar
[JENKINS] Archiving <https://builds.apache.org/job/usergrid-stack/ws/stack/core/target/usergrid-core-1.0.0-tests.jar>
to org.apache.usergrid/usergrid-core/1.0.0/usergrid-core-1.0.0-tests.jar
Sending artifact delta relative to usergrid-stack ? Usergrid Core #31
Archived 3 artifacts
Archive block size is 32768
Received 0 blocks and 1003875 bytes
Compression is 0.0%
Took 1.8 sec
[JENKINS] Archiving <https://builds.apache.org/job/usergrid-stack/ws/stack/rest/pom.xml>
to org.apache.usergrid/usergrid-rest/1.0.0/usergrid-rest-1.0.0.pom
[JENKINS] Archiving <https://builds.apache.org/job/usergrid-stack/ws/stack/rest/target/ROOT.war>
to org.apache.usergrid/usergrid-rest/1.0.0/usergrid-rest-1.0.0.war
[JENKINS] Archiving <https://builds.apache.org/job/usergrid-stack/ws/stack/rest/target/usergrid-rest-1.0.0-tests.jar>
to org.apache.usergrid/usergrid-rest/1.0.0/usergrid-rest-1.0.0-tests.jar
[JENKINS] Archiving <https://builds.apache.org/job/usergrid-stack/ws/stack/rest/target/usergrid-rest-1.0.0-classes.jar>
to org.apache.usergrid/usergrid-rest/1.0.0/usergrid-rest-1.0.0-classes.jar
[JENKINS] Archiving <https://builds.apache.org/job/usergrid-stack/ws/stack/rest/target/usergrid-rest-1.0.0-compiled-jsp.jar>
to org.apache.usergrid/usergrid-rest/1.0.0/usergrid-rest-1.0.0-compiled-jsp.jar
Sending artifact delta relative to usergrid-stack ? Usergrid REST #31
Archived 5 artifacts
Archive block size is 32768
Received 1227 blocks and 6078404 bytes
Compression is 86.9%
Took 5.8 sec
[JENKINS] Archiving <https://builds.apache.org/job/usergrid-stack/ws/stack/mongo-emulator/pom.xml>
to org.apache.usergrid/usergrid-mongo-emulator/1.0.0/usergrid-mongo-emulator-1.0.0.pom
[JENKINS] Archiving <https://builds.apache.org/job/usergrid-stack/ws/stack/mongo-emulator/target/usergrid-mongo-emulator-1.0.0.jar>
to org.apache.usergrid/usergrid-mongo-emulator/1.0.0/usergrid-mongo-emulator-1.0.0.jar
[JENKINS] Archiving <https://builds.apache.org/job/usergrid-stack/ws/stack/mongo-emulator/target/usergrid-mongo-emulator-1.0.0-tests.jar>
to org.apache.usergrid/usergrid-mongo-emulator/1.0.0/usergrid-mongo-emulator-1.0.0-tests.jar
Sending artifact delta relative to usergrid-stack ? Usergrid MongoDB Emulator #31
Archived 3 artifacts
Archive block size is 32768
Received 0 blocks and 106241 bytes
Compression is 0.0%
Took 0.13 sec
[JENKINS] Archiving <https://builds.apache.org/job/usergrid-stack/ws/stack/tools/pom.xml>
to org.apache.usergrid/usergrid-tools/1.0.0/usergrid-tools-1.0.0.pom
[JENKINS] Archiving <https://builds.apache.org/job/usergrid-stack/ws/stack/tools/target/usergrid-tools-1.0.0.jar>
to org.apache.usergrid/usergrid-tools/1.0.0/usergrid-tools-1.0.0.jar
[JENKINS] Archiving <https://builds.apache.org/job/usergrid-stack/ws/stack/tools/target/usergrid-tools-1.0.0-tests.jar>
to org.apache.usergrid/usergrid-tools/1.0.0/usergrid-tools-1.0.0-tests.jar
[JENKINS] Archiving <https://builds.apache.org/job/usergrid-stack/ws/stack/tools/target/usergrid-tools-1.0.0-release.tar.gz>
to org.apache.usergrid/usergrid-tools/1.0.0/usergrid-tools-1.0.0-release.tar.gz
Sending artifact delta relative to usergrid-stack ? Usergrid Tools #31
Archived 4 artifacts
Archive block size is 32768
Received 1240 blocks and 45511591 bytes
Compression is 47.2%
Took 29 sec
[JENKINS] Archiving <https://builds.apache.org/job/usergrid-stack/ws/stack/java-sdk-old/pom.xml>
to org.usergrid/usergrid-java-client/0.0.3/usergrid-java-client-0.0.3.pom
[JENKINS] Archiving <https://builds.apache.org/job/usergrid-stack/ws/stack/java-sdk-old/target/usergrid-java-client-0.0.3.jar>
to org.usergrid/usergrid-java-client/0.0.3/usergrid-java-client-0.0.3.jar
[JENKINS] Archiving <https://builds.apache.org/job/usergrid-stack/ws/stack/java-sdk-old/target/usergrid-java-client-0.0.3-tests.jar>
to org.usergrid/usergrid-java-client/0.0.3/usergrid-java-client-0.0.3-tests.jar
Sending artifact delta relative to usergrid-stack ? Usergrid Java SDK 0.0.3 #31
Archived 3 artifacts
Archive block size is 32768
Received 0 blocks and 63271 bytes
Compression is 0.0%
Took 0.14 sec
Sending e-mails to: commits@usergrid.incubator.apache.org
channel stopped

Mime
View raw message