usergrid-commits mailing list archives

Site index · List index
Message view « Date » · « Thread »
Top « Date » · « Thread »
From Apache Jenkins Server <jenk...@builds.apache.org>
Subject Build failed in Jenkins: usergrid-stack #71
Date Thu, 02 Apr 2015 20:10:29 GMT
See <https://builds.apache.org/job/usergrid-stack/71/changes>

Changes:

[rbridges] Fix ping indentity validation be POSTing a form rather than query params

[rbridges] Fix for https://issues.apache.org/jira/browse/USERGRID-530

[Dave Johnson] Moving our version back to 1.0.1-SNAPSHOT as it should be.

------------------------------------------
Started by an SCM change
Building remotely on jenkins-ubuntu-1404-4gb-d16 (jenkins-cloud-4GB cloud-slave Ubuntu ubuntu)
in workspace <https://builds.apache.org/job/usergrid-stack/ws/>
Cloning the remote Git repository
Cloning repository git://git.apache.org/incubator-usergrid.git
 > git init <https://builds.apache.org/job/usergrid-stack/ws/> # timeout=10
Fetching upstream changes from git://git.apache.org/incubator-usergrid.git
 > git --version # timeout=10
 > git fetch --tags --progress git://git.apache.org/incubator-usergrid.git +refs/heads/*:refs/remotes/origin/*
 > git config remote.origin.url git://git.apache.org/incubator-usergrid.git # timeout=10
 > git config remote.origin.fetch +refs/heads/*:refs/remotes/origin/* # timeout=10
 > git config remote.origin.url git://git.apache.org/incubator-usergrid.git # timeout=10
Fetching upstream changes from git://git.apache.org/incubator-usergrid.git
 > git fetch --tags --progress git://git.apache.org/incubator-usergrid.git +refs/heads/*:refs/remotes/origin/*
 > git rev-parse origin/master^{commit} # timeout=10
Checking out Revision 89d9c6f62bbd94d26cf6c3b7b9d66ca6e1ff53f4 (origin/master)
 > git config core.sparsecheckout # timeout=10
 > git checkout -f 89d9c6f62bbd94d26cf6c3b7b9d66ca6e1ff53f4
 > git rev-list 5000c332454b2162044f35ba350835ed5509ef11 # timeout=10
Parsing POMs
ERROR: Failed to parse POMs
java.io.IOException: remote file operation failed: <https://builds.apache.org/job/usergrid-stack/ws/>
at hudson.remoting.Channel@34cee2eb:jenkins-ubuntu-1404-4gb-d16
	at hudson.FilePath.act(FilePath.java:916)
	at hudson.FilePath.act(FilePath.java:893)
	at hudson.maven.MavenModuleSetBuild$MavenModuleSetBuildExecution.parsePoms(MavenModuleSetBuild.java:950)
	at hudson.maven.MavenModuleSetBuild$MavenModuleSetBuildExecution.doRun(MavenModuleSetBuild.java:677)
	at hudson.model.AbstractBuild$AbstractBuildExecution.run(AbstractBuild.java:529)
	at hudson.model.Run.execute(Run.java:1706)
	at hudson.maven.MavenModuleSetBuild.run(MavenModuleSetBuild.java:529)
	at hudson.model.ResourceController.execute(ResourceController.java:88)
	at hudson.model.Executor.run(Executor.java:232)
Caused by: hudson.remoting.ProxyException: hudson.maven.MavenModuleSetBuild$MavenExecutionException:
org.apache.maven.project.ProjectBuildingException: Some problems were encountered while processing
the POMs:
[FATAL] Non-resolvable parent POM: Could not find artifact org.apache.usergrid:usergrid:pom:1.0.1-1-SNAPSHOT
and 'parent.relativePath' points at wrong local POM @ line 21, column 11
[FATAL] Non-resolvable parent POM: Could not find artifact org.apache.usergrid:usergrid:pom:1.0.1-1-SNAPSHOT
and 'parent.relativePath' points at wrong local POM @ line 21, column 11
[FATAL] Non-resolvable parent POM: Could not find artifact org.apache.usergrid:usergrid:pom:1.0.1-1-SNAPSHOT
and 'parent.relativePath' points at wrong local POM @ line 21, column 11
[FATAL] Non-resolvable parent POM: Could not find artifact org.apache.usergrid:usergrid:pom:1.0.1-1-SNAPSHOT
and 'parent.relativePath' points at wrong local POM @ line 21, column 11
[FATAL] Non-resolvable parent POM: Could not find artifact org.apache.usergrid:usergrid:pom:1.0.1-1-SNAPSHOT
and 'parent.relativePath' points at wrong local POM @ line 22, column 11

	at hudson.maven.MavenModuleSetBuild$PomParser.invoke(MavenModuleSetBuild.java:1354)
	at hudson.maven.MavenModuleSetBuild$PomParser.invoke(MavenModuleSetBuild.java:1088)
	at hudson.FilePath$FileCallableWrapper.call(FilePath.java:2474)
	at hudson.remoting.UserRequest.perform(UserRequest.java:118)
	at hudson.remoting.UserRequest.perform(UserRequest.java:48)
	at hudson.remoting.Request$2.run(Request.java:328)
	at hudson.remoting.InterceptingExecutorService$1.call(InterceptingExecutorService.java:72)
	at java.util.concurrent.FutureTask.run(FutureTask.java:262)
	at java.util.concurrent.ThreadPoolExecutor.runWorker(ThreadPoolExecutor.java:1145)
	at java.util.concurrent.ThreadPoolExecutor$Worker.run(ThreadPoolExecutor.java:615)
	at java.lang.Thread.run(Thread.java:745)
Caused by: hudson.remoting.ProxyException: org.apache.maven.project.ProjectBuildingException:
Some problems were encountered while processing the POMs:
[FATAL] Non-resolvable parent POM: Could not find artifact org.apache.usergrid:usergrid:pom:1.0.1-1-SNAPSHOT
and 'parent.relativePath' points at wrong local POM @ line 21, column 11
[FATAL] Non-resolvable parent POM: Could not find artifact org.apache.usergrid:usergrid:pom:1.0.1-1-SNAPSHOT
and 'parent.relativePath' points at wrong local POM @ line 21, column 11
[FATAL] Non-resolvable parent POM: Could not find artifact org.apache.usergrid:usergrid:pom:1.0.1-1-SNAPSHOT
and 'parent.relativePath' points at wrong local POM @ line 21, column 11
[FATAL] Non-resolvable parent POM: Could not find artifact org.apache.usergrid:usergrid:pom:1.0.1-1-SNAPSHOT
and 'parent.relativePath' points at wrong local POM @ line 21, column 11
[FATAL] Non-resolvable parent POM: Could not find artifact org.apache.usergrid:usergrid:pom:1.0.1-1-SNAPSHOT
and 'parent.relativePath' points at wrong local POM @ line 22, column 11

	at org.apache.maven.project.DefaultProjectBuilder.build(DefaultProjectBuilder.java:364)
	at hudson.maven.MavenEmbedder.buildProjects(MavenEmbedder.java:361)
	at hudson.maven.MavenEmbedder.readProjects(MavenEmbedder.java:331)
	at hudson.maven.MavenModuleSetBuild$PomParser.invoke(MavenModuleSetBuild.java:1291)
	... 10 more

Mime
View raw message