usergrid-commits mailing list archives

Site index · List index
Message view « Date » · « Thread »
Top « Date » · « Thread »
From Apache Jenkins Server <jenk...@builds.apache.org>
Subject Build failed in Jenkins: usergrid-stack #76
Date Thu, 16 Apr 2015 17:23:30 GMT
See <https://builds.apache.org/job/usergrid-stack/76/>

------------------------------------------
[...truncated 20 lines...]
Executing Maven:  -B -f <https://builds.apache.org/job/usergrid-stack/ws/stack/pom.xml>
-Dmaven.repo.local=/home/jenkins/jenkins-slave/maven-repositories/0 clean install deploy
[INFO] Scanning for projects...
[INFO] ------------------------------------------------------------------------
[INFO] Reactor Build Order:
[INFO] 
[INFO] Usergrid Parent
[INFO] Usergrid Java SDK 0.0.3
[INFO] Usergrid Build Tools
[INFO] Usergrid Config
[INFO] Usergrid Test Utils
[INFO] Usergrid Core
[INFO] Usergrid Services
[INFO] Usergrid MongoDB Emulator
[INFO] Usergrid REST
[INFO] Usergrid Tools
[INFO] Usergrid Websocket
[INFO] Usergrid Launcher
[INFO]                                                                         
[INFO] ------------------------------------------------------------------------
[INFO] Building Usergrid Parent 1.0.1-SNAPSHOT
[INFO] ------------------------------------------------------------------------
[INFO] 
[INFO] --- maven-clean-plugin:2.4.1:clean (default-clean) @ usergrid ---
[INFO] Deleting <https://builds.apache.org/job/usergrid-stack/ws/stack/target>
[INFO] 
[INFO] --- maven-enforcer-plugin:1.3.1:enforce (enforce-java) @ usergrid ---
[INFO] 
[INFO] --- maven-remote-resources-plugin:1.2.1:process (default) @ usergrid ---
[INFO] 
[INFO] --- maven-site-plugin:3.3:attach-descriptor (attach-descriptor) @ usergrid ---
[INFO] 
[INFO] --- maven-jar-plugin:2.4:test-jar (test-jar-execution) @ usergrid ---
[WARNING] JAR will be empty - no content was marked for inclusion!
[INFO] Building jar: <https://builds.apache.org/job/usergrid-stack/ws/stack/target/usergrid-1.0.1-SNAPSHOT-tests.jar>
[INFO] 
[INFO] --- apache-rat-plugin:0.10:check (default) @ usergrid ---
[INFO] 62 implicit excludes (use -debug for more details).
[INFO] Exclude: **/README.md
[INFO] Exclude: **/CHANGES.txt
[INFO] Exclude: **/*.json
[INFO] Exclude: **/*.log
[INFO] Exclude: **/*.md5
[INFO] Exclude: **/.git/**
[INFO] Exclude: **/.gitignore
[INFO] Exclude: **/.idea/**
[INFO] Exclude: **/*.iml
[INFO] Exclude: **/nbactions.xml
[INFO] Exclude: **/nb-configuration.xml
[INFO] Exclude: **/.classpath/**
[INFO] Exclude: **/.project
[INFO] Exclude: **/.settings/**
[INFO] Exclude: **/logs/**
[INFO] Exclude: **/docs/**
[INFO] Exclude: **/tmp/**
[INFO] Exclude: **/target/**
[INFO] Exclude: **/antlr3/**
[INFO] Exclude: **/META-INF/**
[INFO] Exclude: **/dependency-reduced-pom.xml
[INFO] Exclude: **/**QueryFilter.tokens
[INFO] Exclude: **/**QueryFilterLexer.java
[INFO] Exclude: **/**QueryFilterParser.java
[INFO] Exclude: **/m2/**
[INFO] Exclude: **/*.asc
[INFO] Exclude: **/src/test/resources/**
[INFO] Exclude: **/cloudbees.xml
[INFO] Exclude: **/doc/**
[INFO] Exclude: **/awscluster/**
[INFO] Exclude: **/aws.properties
[INFO] Exclude: **/launcher-vagrant/**
[INFO] Exclude: **/usergrid-custom.properties
[INFO] 17 resources included (use -debug for more details)
[INFO] Rat check: Summary of files. Unapproved: 0 unknown: 0 generated: 0 approved: 17 licence.
[INFO] 
[INFO] --- maven-install-plugin:2.4:install (default-install) @ usergrid ---
[INFO] Installing <https://builds.apache.org/job/usergrid-stack/ws/stack/pom.xml> to
/home/jenkins/jenkins-slave/maven-repositories/0/org/apache/usergrid/usergrid/1.0.1-SNAPSHOT/usergrid-1.0.1-SNAPSHOT.pom
[INFO] Installing <https://builds.apache.org/job/usergrid-stack/ws/stack/target/usergrid-1.0.1-SNAPSHOT-tests.jar>
to /home/jenkins/jenkins-slave/maven-repositories/0/org/apache/usergrid/usergrid/1.0.1-SNAPSHOT/usergrid-1.0.1-SNAPSHOT-tests.jar
[INFO] 
[INFO] --- maven-enforcer-plugin:1.3.1:enforce (enforce-java) @ usergrid ---
[INFO] 
[INFO] --- maven-remote-resources-plugin:1.2.1:process (default) @ usergrid ---
[INFO] 
[INFO] --- maven-site-plugin:3.3:attach-descriptor (attach-descriptor) @ usergrid ---
[INFO] 
[INFO] --- maven-jar-plugin:2.4:test-jar (test-jar-execution) @ usergrid ---
[WARNING] JAR will be empty - no content was marked for inclusion!
[WARNING] Artifact org.apache.usergrid:usergrid:test-jar:tests:1.0.1-SNAPSHOT already attached
to project, ignoring duplicate
[INFO] 
[INFO] --- apache-rat-plugin:0.10:check (default) @ usergrid ---
[INFO] 62 implicit excludes (use -debug for more details).
[INFO] Exclude: **/README.md
[INFO] Exclude: **/CHANGES.txt
[INFO] Exclude: **/*.json
[INFO] Exclude: **/*.log
[INFO] Exclude: **/*.md5
[INFO] Exclude: **/.git/**
[INFO] Exclude: **/.gitignore
[INFO] Exclude: **/.idea/**
[INFO] Exclude: **/*.iml
[INFO] Exclude: **/nbactions.xml
[INFO] Exclude: **/nb-configuration.xml
[INFO] Exclude: **/.classpath/**
[INFO] Exclude: **/.project
[INFO] Exclude: **/.settings/**
[INFO] Exclude: **/logs/**
[INFO] Exclude: **/docs/**
[INFO] Exclude: **/tmp/**
[INFO] Exclude: **/target/**
[INFO] Exclude: **/antlr3/**
[INFO] Exclude: **/META-INF/**
[INFO] Exclude: **/dependency-reduced-pom.xml
[INFO] Exclude: **/**QueryFilter.tokens
[INFO] Exclude: **/**QueryFilterLexer.java
[INFO] Exclude: **/**QueryFilterParser.java
[INFO] Exclude: **/m2/**
[INFO] Exclude: **/*.asc
[INFO] Exclude: **/src/test/resources/**
[INFO] Exclude: **/cloudbees.xml
[INFO] Exclude: **/doc/**
[INFO] Exclude: **/awscluster/**
[INFO] Exclude: **/aws.properties
[INFO] Exclude: **/launcher-vagrant/**
[INFO] Exclude: **/usergrid-custom.properties
[INFO] 17 resources included (use -debug for more details)
[INFO] Rat check: Summary of files. Unapproved: 0 unknown: 0 generated: 0 approved: 17 licence.
[INFO] 
[INFO] --- maven-install-plugin:2.4:install (default-install) @ usergrid ---
[INFO] Installing <https://builds.apache.org/job/usergrid-stack/ws/stack/pom.xml> to
/home/jenkins/jenkins-slave/maven-repositories/0/org/apache/usergrid/usergrid/1.0.1-SNAPSHOT/usergrid-1.0.1-SNAPSHOT.pom
[INFO] Installing <https://builds.apache.org/job/usergrid-stack/ws/stack/target/usergrid-1.0.1-SNAPSHOT-tests.jar>
to /home/jenkins/jenkins-slave/maven-repositories/0/org/apache/usergrid/usergrid/1.0.1-SNAPSHOT/usergrid-1.0.1-SNAPSHOT-tests.jar
[INFO] 
[INFO] --- maven-deploy-plugin:2.7:deploy (default-deploy) @ usergrid ---
Downloading: https://repository.apache.org/content/repositories/snapshots/org/apache/usergrid/usergrid/1.0.1-SNAPSHOT/maven-metadata.xml
Uploading: https://repository.apache.org/content/repositories/snapshots/org/apache/usergrid/usergrid/1.0.1-SNAPSHOT/usergrid-1.0.1-20150416.172258-1.pom
[INFO] ------------------------------------------------------------------------
[INFO] Reactor Summary:
[INFO] 
[INFO] Usergrid Parent ................................... FAILURE [7.573s]
[INFO] Usergrid Java SDK 0.0.3 ........................... SKIPPED
[INFO] Usergrid Build Tools .............................. SKIPPED
[INFO] Usergrid Config ................................... SKIPPED
[INFO] Usergrid Test Utils ............................... SKIPPED
[INFO] Usergrid Core ..................................... SKIPPED
[INFO] Usergrid Services ................................. SKIPPED
[INFO] Usergrid MongoDB Emulator ......................... SKIPPED
[INFO] Usergrid REST ..................................... SKIPPED
[INFO] Usergrid Tools .................................... SKIPPED
[INFO] Usergrid Websocket ................................ SKIPPED
[INFO] Usergrid Launcher ................................. SKIPPED
[INFO] ------------------------------------------------------------------------
[INFO] BUILD FAILURE
[INFO] ------------------------------------------------------------------------
[INFO] Total time: 10.953s
[INFO] Finished at: Thu Apr 16 17:23:00 UTC 2015
[INFO] Final Memory: 24M/316M
[INFO] ------------------------------------------------------------------------
Waiting for Jenkins to finish collecting data
[ERROR] Failed to execute goal org.apache.maven.plugins:maven-deploy-plugin:2.7:deploy (default-deploy)
on project usergrid: Failed to deploy artifacts: Could not transfer artifact org.apache.usergrid:usergrid:pom:1.0.1-20150416.172258-1
from/to usergrid.snapshots (https://repository.apache.org/content/repositories/snapshots):
Failed to transfer file: https://repository.apache.org/content/repositories/snapshots/org/apache/usergrid/usergrid/1.0.1-SNAPSHOT/usergrid-1.0.1-20150416.172258-1.pom.
Return code is: 401, ReasonPhrase:Unauthorized. -> [Help 1]
[ERROR] 
[ERROR] To see the full stack trace of the errors, re-run Maven with the -e switch.
[ERROR] Re-run Maven using the -X switch to enable full debug logging.
[ERROR] 
[ERROR] For more information about the errors and possible solutions, please read the following
articles:
[ERROR] [Help 1] http://cwiki.apache.org/confluence/display/MAVEN/MojoExecutionException
[JENKINS] Archiving <https://builds.apache.org/job/usergrid-stack/ws/stack/build-tools/pom.xml>
to org.apache.usergrid/build-tools/1.0.1-SNAPSHOT/build-tools-1.0.1-SNAPSHOT.pom
Sending artifact delta relative to usergrid-stack » Usergrid Build Tools #54
Archived 1 artifacts
Archive block size is 32768
Received 0 blocks and 1955 bytes
Compression is 0.0%
Took 0.16 sec
[JENKINS] Archiving <https://builds.apache.org/job/usergrid-stack/ws/stack/websocket/pom.xml>
to org.apache.usergrid/usergrid-websocket/1.0.1-SNAPSHOT/usergrid-websocket-1.0.1-SNAPSHOT.pom
Sending artifact delta relative to usergrid-stack » Usergrid Websocket #54
Archived 1 artifacts
Archive block size is 32768
Received 0 blocks and 6141 bytes
Compression is 0.0%
Took 0.24 sec
[JENKINS] Archiving <https://builds.apache.org/job/usergrid-stack/ws/stack/services/pom.xml>
to org.apache.usergrid/usergrid-services/1.0.1-SNAPSHOT/usergrid-services-1.0.1-SNAPSHOT.pom
Sending artifact delta relative to usergrid-stack » Usergrid Services #54
Archived 1 artifacts
Archive block size is 32768
Received 0 blocks and 18403 bytes
Compression is 0.0%
Took 0.18 sec
[JENKINS] Archiving <https://builds.apache.org/job/usergrid-stack/ws/stack/pom.xml>
to org.apache.usergrid/usergrid/1.0.1-SNAPSHOT/usergrid-1.0.1-SNAPSHOT.pom
[JENKINS] Archiving <https://builds.apache.org/job/usergrid-stack/ws/stack/target/usergrid-1.0.1-SNAPSHOT-tests.jar>
to org.apache.usergrid/usergrid/1.0.1-SNAPSHOT/usergrid-1.0.1-SNAPSHOT-tests.jar
Sending artifact delta relative to usergrid-stack » Usergrid Parent #54
Archived 2 artifacts
Archive block size is 32768
Received 0 blocks and 67492 bytes
Compression is 0.0%
Took 0.16 sec
[JENKINS] Archiving <https://builds.apache.org/job/usergrid-stack/ws/stack/config/pom.xml>
to org.apache.usergrid/usergrid-config/1.0.1-SNAPSHOT/usergrid-config-1.0.1-SNAPSHOT.pom
Sending artifact delta relative to usergrid-stack » Usergrid Config #54
Archived 1 artifacts
Archive block size is 32768
Received 0 blocks and 1864 bytes
Compression is 0.0%
Took 0.12 sec
[JENKINS] Archiving <https://builds.apache.org/job/usergrid-stack/ws/stack/launcher/pom.xml>
to org.apache.usergrid/usergrid-launcher/1.0.1-SNAPSHOT/usergrid-launcher-1.0.1-SNAPSHOT.pom
Sending artifact delta relative to usergrid-stack » Usergrid Launcher #54
Archived 1 artifacts
Archive block size is 32768
Received 0 blocks and 7964 bytes
Compression is 0.0%
Took 5.8 sec
[JENKINS] Archiving <https://builds.apache.org/job/usergrid-stack/ws/stack/test-utils/pom.xml>
to org.apache.usergrid/usergrid-test-utils/1.0.1-SNAPSHOT/usergrid-test-utils-1.0.1-SNAPSHOT.pom
Sending artifact delta relative to usergrid-stack » Usergrid Test Utils #54
Archived 1 artifacts
Archive block size is 32768
Received 0 blocks and 7970 bytes
Compression is 0.0%
Took 0.13 sec
[JENKINS] Archiving <https://builds.apache.org/job/usergrid-stack/ws/stack/core/pom.xml>
to org.apache.usergrid/usergrid-core/1.0.1-SNAPSHOT/usergrid-core-1.0.1-SNAPSHOT.pom
Sending artifact delta relative to usergrid-stack » Usergrid Core #54
Archived 1 artifacts
Archive block size is 32768
Received 0 blocks and 19416 bytes
Compression is 0.0%
Took 0.18 sec
[JENKINS] Archiving <https://builds.apache.org/job/usergrid-stack/ws/stack/rest/pom.xml>
to org.apache.usergrid/usergrid-rest/1.0.1-SNAPSHOT/usergrid-rest-1.0.1-SNAPSHOT.pom
Sending artifact delta relative to usergrid-stack » Usergrid REST #54
Archived 1 artifacts
Archive block size is 32768
Received 0 blocks and 19752 bytes
Compression is 0.0%
Took 5 sec
[JENKINS] Archiving <https://builds.apache.org/job/usergrid-stack/ws/stack/mongo-emulator/pom.xml>
to org.apache.usergrid/usergrid-mongo-emulator/1.0.1-SNAPSHOT/usergrid-mongo-emulator-1.0.1-SNAPSHOT.pom
Sending artifact delta relative to usergrid-stack » Usergrid MongoDB Emulator #54
Archived 1 artifacts
Archive block size is 32768
Received 0 blocks and 5566 bytes
Compression is 0.0%
Took 0.12 sec
[JENKINS] Archiving <https://builds.apache.org/job/usergrid-stack/ws/stack/tools/pom.xml>
to org.apache.usergrid/usergrid-tools/1.0.1-SNAPSHOT/usergrid-tools-1.0.1-SNAPSHOT.pom
Sending artifact delta relative to usergrid-stack » Usergrid Tools #54
Archived 1 artifacts
Archive block size is 32768
Received 0 blocks and 7442 bytes
Compression is 0.0%
Took 7.9 sec
[JENKINS] Archiving <https://builds.apache.org/job/usergrid-stack/ws/stack/java-sdk-old/pom.xml>
to org.usergrid/usergrid-java-client/0.0.3/usergrid-java-client-0.0.3.pom
Sending artifact delta relative to usergrid-stack » Usergrid Java SDK 0.0.3 #54
Archived 1 artifacts
Archive block size is 32768
Received 0 blocks and 3879 bytes
Compression is 0.0%
Took 0.14 sec
Sending e-mails to: commits@usergrid.incubator.apache.org
channel stopped

Mime
View raw message