usergrid-commits mailing list archives

Site index · List index
Message view « Date » · « Thread »
Top « Date » · « Thread »
From Apache Jenkins Server <jenk...@builds.apache.org>
Subject Build failed in Jenkins: usergrid-stack #108
Date Wed, 12 Aug 2015 21:47:48 GMT
See <https://builds.apache.org/job/usergrid-stack/108/changes>

Changes:

[michaelarusso] Ensure that case is being preserved when setting entity properties.

[michaelarusso] Don't show disabled admins in the portal.

------------------------------------------
[...truncated 1031 lines...]
Downloaded: http://repo.maven.apache.org/maven2/backport-util-concurrent/backport-util-concurrent/3.1/backport-util-concurrent-3.1.jar
(324 KB at 4763.8 KB/sec)
Downloading: http://repo.maven.apache.org/maven2/org/apache/maven/doxia/doxia-decoration-model/1.2/doxia-decoration-model-1.2.jar
Downloaded: http://repo.maven.apache.org/maven2/org/apache/rat/apache-rat-core/0.10/apache-rat-core-0.10.jar
(115 KB at 1551.8 KB/sec)
Downloading: http://repo.maven.apache.org/maven2/org/apache/maven/doxia/doxia-sink-api/1.2/doxia-sink-api-1.2.jar
Downloaded: http://repo.maven.apache.org/maven2/org/codehaus/plexus/plexus-interpolation/1.11/plexus-interpolation-1.11.jar
(50 KB at 1463.0 KB/sec)
Downloading: http://repo.maven.apache.org/maven2/org/apache/maven/doxia/doxia-site-renderer/1.2/doxia-site-renderer-1.2.jar
Downloaded: http://repo.maven.apache.org/maven2/org/apache/maven/doxia/doxia-core/1.2/doxia-core-1.2.jar
(151 KB at 3762.7 KB/sec)
Downloading: http://repo.maven.apache.org/maven2/org/apache/maven/doxia/doxia-module-xhtml/1.2/doxia-module-xhtml-1.2.jar
Downloaded: http://repo.maven.apache.org/maven2/org/apache/maven/doxia/doxia-logging-api/1.2/doxia-logging-api-1.2.jar
(12 KB at 307.8 KB/sec)
Downloading: http://repo.maven.apache.org/maven2/org/apache/maven/doxia/doxia-module-fml/1.2/doxia-module-fml-1.2.jar
Downloaded: http://repo.maven.apache.org/maven2/org/apache/maven/doxia/doxia-decoration-model/1.2/doxia-decoration-model-1.2.jar
(59 KB at 1620.4 KB/sec)
Downloading: http://repo.maven.apache.org/maven2/org/codehaus/plexus/plexus-velocity/1.1.7/plexus-velocity-1.1.7.jar
Downloaded: http://repo.maven.apache.org/maven2/org/apache/maven/doxia/doxia-sink-api/1.2/doxia-sink-api-1.2.jar
(11 KB at 304.9 KB/sec)
Downloading: http://repo.maven.apache.org/maven2/org/codehaus/plexus/plexus-utils/3.0.8/plexus-utils-3.0.8.jar
Downloaded: http://repo.maven.apache.org/maven2/org/apache/maven/doxia/doxia-site-renderer/1.2/doxia-site-renderer-1.2.jar
(51 KB at 1413.1 KB/sec)
Downloaded: http://repo.maven.apache.org/maven2/org/apache/maven/doxia/doxia-module-xhtml/1.2/doxia-module-xhtml-1.2.jar
(15 KB at 433.6 KB/sec)
Downloaded: http://repo.maven.apache.org/maven2/org/apache/maven/doxia/doxia-module-fml/1.2/doxia-module-fml-1.2.jar
(37 KB at 999.2 KB/sec)
Downloaded: http://repo.maven.apache.org/maven2/org/codehaus/plexus/plexus-velocity/1.1.7/plexus-velocity-1.1.7.jar
(8 KB at 226.9 KB/sec)
Downloaded: http://repo.maven.apache.org/maven2/org/codehaus/plexus/plexus-utils/3.0.8/plexus-utils-3.0.8.jar
(227 KB at 2156.1 KB/sec)
[INFO] 62 implicit excludes (use -debug for more details).
[INFO] Exclude: **/README.md
[INFO] Exclude: **/CHANGES.txt
[INFO] Exclude: **/*.json
[INFO] Exclude: **/*.log
[INFO] Exclude: **/*.md5
[INFO] Exclude: **/.git/**
[INFO] Exclude: **/.gitignore
[INFO] Exclude: **/.idea/**
[INFO] Exclude: **/*.iml
[INFO] Exclude: **/nbactions.xml
[INFO] Exclude: **/nb-configuration.xml
[INFO] Exclude: **/.classpath/**
[INFO] Exclude: **/.project
[INFO] Exclude: **/.settings/**
[INFO] Exclude: **/logs/**
[INFO] Exclude: **/docs/**
[INFO] Exclude: **/tmp/**
[INFO] Exclude: **/target/**
[INFO] Exclude: **/antlr3/**
[INFO] Exclude: **/META-INF/**
[INFO] Exclude: **/dependency-reduced-pom.xml
[INFO] Exclude: **/**QueryFilter.tokens
[INFO] Exclude: **/**QueryFilterLexer.java
[INFO] Exclude: **/**QueryFilterParser.java
[INFO] Exclude: **/m2/**
[INFO] Exclude: **/*.asc
[INFO] Exclude: **/src/test/resources/**
[INFO] Exclude: **/cloudbees.xml
[INFO] Exclude: **/doc/**
[INFO] Exclude: **/awscluster/**
[INFO] Exclude: **/aws.properties
[INFO] Exclude: **/launcher-vagrant/**
[INFO] Exclude: **/usergrid-custom.properties
[INFO] 16 resources included (use -debug for more details)
[INFO] Rat check: Summary of files. Unapproved: 0 unknown: 0 generated: 0 approved: 16 licence.
[INFO] 
[INFO] --- maven-install-plugin:2.4:install (default-install) @ usergrid ---
Downloading: http://repo.maven.apache.org/maven2/org/codehaus/plexus/plexus-utils/3.0.5/plexus-utils-3.0.5.pom
Downloaded: http://repo.maven.apache.org/maven2/org/codehaus/plexus/plexus-utils/3.0.5/plexus-utils-3.0.5.pom
(3 KB at 70.1 KB/sec)
Downloading: http://repo.maven.apache.org/maven2/org/codehaus/plexus/plexus/3.1/plexus-3.1.pom
Downloaded: http://repo.maven.apache.org/maven2/org/codehaus/plexus/plexus/3.1/plexus-3.1.pom
(19 KB at 519.4 KB/sec)
Downloading: http://repo.maven.apache.org/maven2/org/codehaus/plexus/plexus-digest/1.0/plexus-digest-1.0.pom
Downloaded: http://repo.maven.apache.org/maven2/org/codehaus/plexus/plexus-digest/1.0/plexus-digest-1.0.pom
(2 KB at 28.0 KB/sec)
Downloading: http://repo.maven.apache.org/maven2/org/codehaus/plexus/plexus-components/1.1.7/plexus-components-1.1.7.pom
Downloaded: http://repo.maven.apache.org/maven2/org/codehaus/plexus/plexus-components/1.1.7/plexus-components-1.1.7.pom
(5 KB at 131.3 KB/sec)
Downloading: http://repo.maven.apache.org/maven2/org/codehaus/plexus/plexus-utils/3.0.5/plexus-utils-3.0.5.jar
Downloading: http://repo.maven.apache.org/maven2/org/codehaus/plexus/plexus-digest/1.0/plexus-digest-1.0.jar
Downloaded: http://repo.maven.apache.org/maven2/org/codehaus/plexus/plexus-digest/1.0/plexus-digest-1.0.jar
(12 KB at 296.9 KB/sec)
Downloaded: http://repo.maven.apache.org/maven2/org/codehaus/plexus/plexus-utils/3.0.5/plexus-utils-3.0.5.jar
(226 KB at 2228.2 KB/sec)
[INFO] Installing <https://builds.apache.org/job/usergrid-stack/ws/stack/pom.xml> to
/jenkins/maven-repositories/0/org/apache/usergrid/usergrid/1.0.2/usergrid-1.0.2.pom
[INFO] Installing <https://builds.apache.org/job/usergrid-stack/ws/stack/target/usergrid-1.0.2-tests.jar>
to /jenkins/maven-repositories/0/org/apache/usergrid/usergrid/1.0.2/usergrid-1.0.2-tests.jar
[INFO] 
[INFO] --- maven-enforcer-plugin:1.3.1:enforce (enforce-java) @ usergrid ---
[INFO] 
[INFO] --- maven-remote-resources-plugin:1.2.1:process (default) @ usergrid ---
[INFO] 
[INFO] --- maven-site-plugin:3.3:attach-descriptor (attach-descriptor) @ usergrid ---
[INFO] 
[INFO] --- maven-jar-plugin:2.4:test-jar (test-jar-execution) @ usergrid ---
[WARNING] JAR will be empty - no content was marked for inclusion!
[WARNING] Artifact org.apache.usergrid:usergrid:test-jar:tests:1.0.2 already attached to project,
ignoring duplicate
[INFO] 
[INFO] --- apache-rat-plugin:0.10:check (default) @ usergrid ---
[INFO] 62 implicit excludes (use -debug for more details).
[INFO] Exclude: **/README.md
[INFO] Exclude: **/CHANGES.txt
[INFO] Exclude: **/*.json
[INFO] Exclude: **/*.log
[INFO] Exclude: **/*.md5
[INFO] Exclude: **/.git/**
[INFO] Exclude: **/.gitignore
[INFO] Exclude: **/.idea/**
[INFO] Exclude: **/*.iml
[INFO] Exclude: **/nbactions.xml
[INFO] Exclude: **/nb-configuration.xml
[INFO] Exclude: **/.classpath/**
[INFO] Exclude: **/.project
[INFO] Exclude: **/.settings/**
[INFO] Exclude: **/logs/**
[INFO] Exclude: **/docs/**
[INFO] Exclude: **/tmp/**
[INFO] Exclude: **/target/**
[INFO] Exclude: **/antlr3/**
[INFO] Exclude: **/META-INF/**
[INFO] Exclude: **/dependency-reduced-pom.xml
[INFO] Exclude: **/**QueryFilter.tokens
[INFO] Exclude: **/**QueryFilterLexer.java
[INFO] Exclude: **/**QueryFilterParser.java
[INFO] Exclude: **/m2/**
[INFO] Exclude: **/*.asc
[INFO] Exclude: **/src/test/resources/**
[INFO] Exclude: **/cloudbees.xml
[INFO] Exclude: **/doc/**
[INFO] Exclude: **/awscluster/**
[INFO] Exclude: **/aws.properties
[INFO] Exclude: **/launcher-vagrant/**
[INFO] Exclude: **/usergrid-custom.properties
[INFO] 16 resources included (use -debug for more details)
[INFO] Rat check: Summary of files. Unapproved: 0 unknown: 0 generated: 0 approved: 16 licence.
[INFO] 
[INFO] --- maven-install-plugin:2.4:install (default-install) @ usergrid ---
[INFO] Installing <https://builds.apache.org/job/usergrid-stack/ws/stack/pom.xml> to
/jenkins/maven-repositories/0/org/apache/usergrid/usergrid/1.0.2/usergrid-1.0.2.pom
[INFO] Installing <https://builds.apache.org/job/usergrid-stack/ws/stack/target/usergrid-1.0.2-tests.jar>
to /jenkins/maven-repositories/0/org/apache/usergrid/usergrid/1.0.2/usergrid-1.0.2-tests.jar
[INFO] 
[INFO] --- maven-deploy-plugin:2.7:deploy (default-deploy) @ usergrid ---
Downloading: http://repo.maven.apache.org/maven2/org/codehaus/plexus/plexus-utils/1.5.6/plexus-utils-1.5.6.pom
Downloaded: http://repo.maven.apache.org/maven2/org/codehaus/plexus/plexus-utils/1.5.6/plexus-utils-1.5.6.pom
(6 KB at 139.9 KB/sec)
Downloading: http://repo.maven.apache.org/maven2/org/codehaus/plexus/plexus/1.0.12/plexus-1.0.12.pom
Downloaded: http://repo.maven.apache.org/maven2/org/codehaus/plexus/plexus/1.0.12/plexus-1.0.12.pom
(10 KB at 273.4 KB/sec)
Downloading: http://repo.maven.apache.org/maven2/org/codehaus/plexus/plexus-utils/1.5.6/plexus-utils-1.5.6.jar
Downloaded: http://repo.maven.apache.org/maven2/org/codehaus/plexus/plexus-utils/1.5.6/plexus-utils-1.5.6.jar
(245 KB at 2659.5 KB/sec)
Uploading: https://repository.apache.org/service/local/staging/deploy/maven2/org/apache/usergrid/usergrid/1.0.2/usergrid-1.0.2.pom
[INFO] ------------------------------------------------------------------------
[INFO] Reactor Summary:
[INFO] 
[INFO] Usergrid Parent ................................... FAILURE [30.355s]
[INFO] Usergrid Java SDK 0.0.3 ........................... SKIPPED
[INFO] Usergrid Build Tools .............................. SKIPPED
[INFO] Usergrid Config ................................... SKIPPED
[INFO] Usergrid Test Utils ............................... SKIPPED
[INFO] Usergrid Core ..................................... SKIPPED
[INFO] Usergrid Services ................................. SKIPPED
[INFO] Usergrid MongoDB Emulator ......................... SKIPPED
[INFO] Usergrid REST ..................................... SKIPPED
[INFO] Usergrid Tools .................................... SKIPPED
[INFO] Usergrid Websocket ................................ SKIPPED
[INFO] Usergrid Launcher ................................. SKIPPED
[INFO] ------------------------------------------------------------------------
[INFO] BUILD FAILURE
[INFO] ------------------------------------------------------------------------
[INFO] Total time: 34.174s
[INFO] Finished at: Wed Aug 12 21:48:13 UTC 2015
[INFO] Final Memory: 21M/224M
[INFO] ------------------------------------------------------------------------
Waiting for Jenkins to finish collecting data[ERROR] Failed to execute goal org.apache.maven.plugins:maven-deploy-plugin:2.7:deploy
(default-deploy) on project usergrid: Failed to deploy artifacts: Could not transfer artifact
org.apache.usergrid:usergrid:pom:1.0.2 from/to apache.releases.https (https://repository.apache.org/service/local/staging/deploy/maven2):
Failed to transfer file: https://repository.apache.org/service/local/staging/deploy/maven2/org/apache/usergrid/usergrid/1.0.2/usergrid-1.0.2.pom.
Return code is: 401, ReasonPhrase:Unauthorized. -> [Help 1]

[ERROR] 
[ERROR] To see the full stack trace of the errors, re-run Maven with the -e switch.
[ERROR] Re-run Maven using the -X switch to enable full debug logging.
[ERROR] 
[ERROR] For more information about the errors and possible solutions, please read the following
articles:
[ERROR] [Help 1] http://cwiki.apache.org/confluence/display/MAVEN/MojoExecutionException
[JENKINS] Archiving <https://builds.apache.org/job/usergrid-stack/ws/stack/build-tools/pom.xml>
to org.apache.usergrid/build-tools/1.0.2/build-tools-1.0.2.pom
Sending artifact delta relative to usergrid-stack » Usergrid Build Tools #54
Archived 1 artifacts
Archive block size is 32768
Received 0 blocks and 1928 bytes
Compression is 0.0%
Took 2.8 sec
[JENKINS] Archiving <https://builds.apache.org/job/usergrid-stack/ws/stack/websocket/pom.xml>
to org.apache.usergrid/usergrid-websocket/1.0.2/usergrid-websocket-1.0.2.pom
Sending artifact delta relative to usergrid-stack » Usergrid Websocket #54
Archived 1 artifacts
Archive block size is 32768
Received 0 blocks and 6114 bytes
Compression is 0.0%
Took 0.15 sec
[JENKINS] Archiving <https://builds.apache.org/job/usergrid-stack/ws/stack/services/pom.xml>
to org.apache.usergrid/usergrid-services/1.0.2/usergrid-services-1.0.2.pom
Sending artifact delta relative to usergrid-stack » Usergrid Services #54
Archived 1 artifacts
Archive block size is 32768
Received 0 blocks and 18686 bytes
Compression is 0.0%
Took 0.15 sec
[JENKINS] Archiving <https://builds.apache.org/job/usergrid-stack/ws/stack/pom.xml>
to org.apache.usergrid/usergrid/1.0.2/usergrid-1.0.2.pom
[JENKINS] Archiving <https://builds.apache.org/job/usergrid-stack/ws/stack/target/usergrid-1.0.2-tests.jar>
to org.apache.usergrid/usergrid/1.0.2/usergrid-1.0.2-tests.jar
Sending artifact delta relative to usergrid-stack » Usergrid Parent #54
Archived 2 artifacts
Archive block size is 32768
Received 0 blocks and 66654 bytes
Compression is 0.0%
Took 0.49 sec
[JENKINS] Archiving <https://builds.apache.org/job/usergrid-stack/ws/stack/config/pom.xml>
to org.apache.usergrid/usergrid-config/1.0.2/usergrid-config-1.0.2.pom
Sending artifact delta relative to usergrid-stack » Usergrid Config #54
Archived 1 artifacts
Archive block size is 32768
Received 0 blocks and 1837 bytes
Compression is 0.0%
Took 0.14 sec
[JENKINS] Archiving <https://builds.apache.org/job/usergrid-stack/ws/stack/launcher/pom.xml>
to org.apache.usergrid/usergrid-launcher/1.0.2/usergrid-launcher-1.0.2.pom
Sending artifact delta relative to usergrid-stack » Usergrid Launcher #54
Archived 1 artifacts
Archive block size is 32768
Received 0 blocks and 7937 bytes
Compression is 0.0%
Took 0.79 sec
[JENKINS] Archiving <https://builds.apache.org/job/usergrid-stack/ws/stack/test-utils/pom.xml>
to org.apache.usergrid/usergrid-test-utils/1.0.2/usergrid-test-utils-1.0.2.pom
Sending artifact delta relative to usergrid-stack » Usergrid Test Utils #54
Archived 1 artifacts
Archive block size is 32768
Received 0 blocks and 7943 bytes
Compression is 0.0%
Took 0.19 sec
[JENKINS] Archiving <https://builds.apache.org/job/usergrid-stack/ws/stack/core/pom.xml>
to org.apache.usergrid/usergrid-core/1.0.2/usergrid-core-1.0.2.pom
Sending artifact delta relative to usergrid-stack » Usergrid Core #54
Archived 1 artifacts
Archive block size is 32768
Received 0 blocks and 19369 bytes
Compression is 0.0%
Took 0.15 sec
[JENKINS] Archiving <https://builds.apache.org/job/usergrid-stack/ws/stack/rest/pom.xml>
to org.apache.usergrid/usergrid-rest/1.0.2/usergrid-rest-1.0.2.pom
Sending artifact delta relative to usergrid-stack » Usergrid REST #54
Archived 1 artifacts
Archive block size is 32768
Received 0 blocks and 20158 bytes
Compression is 0.0%
Took 0.74 sec
[JENKINS] Archiving <https://builds.apache.org/job/usergrid-stack/ws/stack/mongo-emulator/pom.xml>
to org.apache.usergrid/usergrid-mongo-emulator/1.0.2/usergrid-mongo-emulator-1.0.2.pom
Sending artifact delta relative to usergrid-stack » Usergrid MongoDB Emulator #54
Archived 1 artifacts
Archive block size is 32768
Received 0 blocks and 5539 bytes
Compression is 0.0%
Took 0.37 sec
[JENKINS] Archiving <https://builds.apache.org/job/usergrid-stack/ws/stack/tools/pom.xml>
to org.apache.usergrid/usergrid-tools/1.0.2/usergrid-tools-1.0.2.pom
Sending artifact delta relative to usergrid-stack » Usergrid Tools #54
Archived 1 artifacts
Archive block size is 32768
Received 0 blocks and 8006 bytes
Compression is 0.0%
Took 8 sec
[JENKINS] Archiving <https://builds.apache.org/job/usergrid-stack/ws/stack/java-sdk-old/pom.xml>
to org.usergrid/usergrid-java-client/0.0.3/usergrid-java-client-0.0.3.pom
Sending artifact delta relative to usergrid-stack » Usergrid Java SDK 0.0.3 #54
Archived 1 artifacts
Archive block size is 32768
Received 0 blocks and 3870 bytes
Compression is 0.0%
Took 0.45 sec
Sending e-mails to: commits@usergrid.incubator.apache.org
channel stopped

Mime
View raw message