usergrid-commits mailing list archives

Site index · List index
Message view « Date » · « Thread »
Top « Date » · « Thread »
From Apache Jenkins Server <jenk...@builds.apache.org>
Subject Build failed in Jenkins: usergrid-stack #121
Date Sun, 26 May 2019 13:47:45 GMT
See <https://builds.apache.org/job/usergrid-stack/121/display/redirect>

------------------------------------------
[...truncated 301.00 KB...]
[INFO] --- maven-jar-plugin:2.5:jar (default-jar) @ usergrid-services ---
[INFO] Building jar: <https://builds.apache.org/job/usergrid-stack/ws/stack/services/target/usergrid-services-2.2.0-SNAPSHOT.jar>
[INFO] 
[INFO] --- maven-site-plugin:3.4:attach-descriptor (attach-descriptor) @ usergrid-services
---
[INFO] 
[INFO] --- maven-jar-plugin:2.5:test-jar (test-jar-execution) @ usergrid-services ---
[INFO] Building jar: <https://builds.apache.org/job/usergrid-stack/ws/stack/services/target/usergrid-services-2.2.0-SNAPSHOT-tests.jar>
[INFO] 
[INFO] --- jacoco-maven-plugin:0.7.5.201505241946:check (default-check) @ usergrid-services
---
[INFO] Skipping JaCoCo execution due to missing execution data <https://builds.apache.org/job/usergrid-stack/ws/stack/services/target/jacoco.exec>
[INFO] 
[INFO] --- apache-rat-plugin:0.11:check (default) @ usergrid-services ---
[INFO] 51 implicit excludes (use -debug for more details).
[INFO] Exclude: **/Coverage.md
[INFO] Exclude: **/jacoco/**
[INFO] Exclude: **/README.md
[INFO] Exclude: **/CHANGES.txt
[INFO] Exclude: **/*.json
[INFO] Exclude: **/*.log
[INFO] Exclude: **/*.md5
[INFO] Exclude: **/*.opts
[INFO] Exclude: **/.git/**
[INFO] Exclude: **/.gitignore
[INFO] Exclude: **/.idea/**
[INFO] Exclude: **/*.iml
[INFO] Exclude: **/*.log
[INFO] Exclude: **/nbactions.xml
[INFO] Exclude: **/nb-configuration.xml
[INFO] Exclude: **/.classpath/**
[INFO] Exclude: **/.project
[INFO] Exclude: **/.settings/**
[INFO] Exclude: **/logs/**
[INFO] Exclude: **/docs/**
[INFO] Exclude: **/tmp/**
[INFO] Exclude: **/target/**
[INFO] Exclude: **/antlr3/**
[INFO] Exclude: **/META-INF/**
[INFO] Exclude: **/dependency-reduced-pom.xml
[INFO] Exclude: **/**QueryFilter.tokens
[INFO] Exclude: **/**QueryFilterLexer.java
[INFO] Exclude: **/**QueryFilterParser.java
[INFO] Exclude: **/**.conf
[INFO] Exclude: **/**.csv
[INFO] Exclude: **/aws.properties
[INFO] Exclude: **/tempExport*
[INFO] Exclude: loadtests/loadtest_setup.sh
[INFO] Exclude: loadtests/gatling/user-files/request-bodies/**
[INFO] Exclude: loadtests/.java-version
[INFO] Exclude: loadtests/src/main/scala/org/apache/usergrid/datagenerators/datafiles/**.txt
[INFO] Exclude: loadtests/src/main/scala/org/apache/usergrid/datagenerators/**.txt
[INFO] Exclude: loadtests/src/test/resources/**.csv
[INFO] Exclude: **/catalina_base/**
[INFO] Exclude: **/m2/**
[INFO] Exclude: **/*.asc
[INFO] Exclude: **/dummy.txt
[INFO] Exclude: **/cloudbees.xml
[INFO] Exclude: **/catalina_base/**
[INFO] Exclude: **/*.p12
[INFO] 272 resources included (use -debug for more details)
[INFO] Rat check: Summary of files. Unapproved: 0 unknown: 0 generated: 0 approved: 271 licence.
[INFO] 
[INFO] --- maven-install-plugin:2.5.2:install (default-install) @ usergrid-services ---
[INFO] Installing <https://builds.apache.org/job/usergrid-stack/ws/stack/services/target/usergrid-services-2.2.0-SNAPSHOT.jar>
to /home/jenkins/jenkins-slave/maven-repositories/0/org/apache/usergrid/usergrid-services/2.2.0-SNAPSHOT/usergrid-services-2.2.0-SNAPSHOT.jar
[INFO] Installing <https://builds.apache.org/job/usergrid-stack/ws/stack/services/pom.xml>
to /home/jenkins/jenkins-slave/maven-repositories/0/org/apache/usergrid/usergrid-services/2.2.0-SNAPSHOT/usergrid-services-2.2.0-SNAPSHOT.pom
[INFO] Installing <https://builds.apache.org/job/usergrid-stack/ws/stack/services/target/usergrid-services-2.2.0-SNAPSHOT-tests.jar>
to /home/jenkins/jenkins-slave/maven-repositories/0/org/apache/usergrid/usergrid-services/2.2.0-SNAPSHOT/usergrid-services-2.2.0-SNAPSHOT-tests.jar
[INFO] 
[INFO] -----------------< org.apache.usergrid:usergrid-rest >------------------
[INFO] Building Usergrid REST 2.2.0-SNAPSHOT                            [18/20]
[INFO] --------------------------------[ war ]---------------------------------
[INFO] Downloading from central: https://repo.maven.apache.org/maven2/org/glassfish/jersey/ext/jersey-mvc-jsp/2.21/jersey-mvc-jsp-2.21.pom
[INFO] Downloaded from central: https://repo.maven.apache.org/maven2/org/glassfish/jersey/ext/jersey-mvc-jsp/2.21/jersey-mvc-jsp-2.21.pom
(4.9 kB at 273 kB/s)
[INFO] Downloading from central: https://repo.maven.apache.org/maven2/org/glassfish/jersey/ext/jersey-mvc/2.21/jersey-mvc-2.21.pom
[INFO] Downloaded from central: https://repo.maven.apache.org/maven2/org/glassfish/jersey/ext/jersey-mvc/2.21/jersey-mvc-2.21.pom
(4.1 kB at 339 kB/s)
[INFO] Downloading from central: https://repo.maven.apache.org/maven2/org/glassfish/jersey/media/jersey-media-multipart/2.21/jersey-media-multipart-2.21.pom
[INFO] Downloaded from central: https://repo.maven.apache.org/maven2/org/glassfish/jersey/media/jersey-media-multipart/2.21/jersey-media-multipart-2.21.pom
(5.3 kB at 410 kB/s)
[INFO] Downloading from central: https://repo.maven.apache.org/maven2/org/jvnet/mimepull/mimepull/1.9.6/mimepull-1.9.6.pom
[INFO] Downloaded from central: https://repo.maven.apache.org/maven2/org/jvnet/mimepull/mimepull/1.9.6/mimepull-1.9.6.pom
(14 kB at 912 kB/s)
[INFO] Downloading from central: https://repo.maven.apache.org/maven2/org/glassfish/jersey/ext/jersey-spring3/2.21/jersey-spring3-2.21.pom
[INFO] Downloaded from central: https://repo.maven.apache.org/maven2/org/glassfish/jersey/ext/jersey-spring3/2.21/jersey-spring3-2.21.pom
(7.0 kB at 464 kB/s)
[INFO] Downloading from central: https://repo.maven.apache.org/maven2/org/glassfish/hk2/hk2/2.4.0-b31/hk2-2.4.0-b31.pom
[INFO] Downloaded from central: https://repo.maven.apache.org/maven2/org/glassfish/hk2/hk2/2.4.0-b31/hk2-2.4.0-b31.pom
(5.4 kB at 358 kB/s)
[INFO] Downloading from central: https://repo.maven.apache.org/maven2/org/glassfish/hk2/config-types/2.4.0-b31/config-types-2.4.0-b31.pom
[INFO] Downloaded from central: https://repo.maven.apache.org/maven2/org/glassfish/hk2/config-types/2.4.0-b31/config-types-2.4.0-b31.pom
(4.2 kB at 353 kB/s)
[INFO] Downloading from central: https://repo.maven.apache.org/maven2/org/glassfish/hk2/hk2-xml-dom/2.4.0-b31/hk2-xml-dom-2.4.0-b31.pom
[INFO] Downloaded from central: https://repo.maven.apache.org/maven2/org/glassfish/hk2/hk2-xml-dom/2.4.0-b31/hk2-xml-dom-2.4.0-b31.pom
(2.8 kB at 232 kB/s)
[INFO] Downloading from central: https://repo.maven.apache.org/maven2/org/glassfish/hk2/hk2-configuration-persistence/2.4.0-b31/hk2-configuration-persistence-2.4.0-b31.pom
[INFO] Downloaded from central: https://repo.maven.apache.org/maven2/org/glassfish/hk2/hk2-configuration-persistence/2.4.0-b31/hk2-configuration-persistence-2.4.0-b31.pom
(2.8 kB at 229 kB/s)
[INFO] Downloading from central: https://repo.maven.apache.org/maven2/org/glassfish/hk2/hk2-configuration/2.4.0-b31/hk2-configuration-2.4.0-b31.pom
[INFO] Downloaded from central: https://repo.maven.apache.org/maven2/org/glassfish/hk2/hk2-configuration/2.4.0-b31/hk2-configuration-2.4.0-b31.pom
(2.7 kB at 210 kB/s)
[INFO] Downloading from central: https://repo.maven.apache.org/maven2/org/glassfish/hk2/hk2-config/2.4.0-b31/hk2-config-2.4.0-b31.pom
[INFO] Downloaded from central: https://repo.maven.apache.org/maven2/org/glassfish/hk2/hk2-config/2.4.0-b31/hk2-config-2.4.0-b31.pom
(6.2 kB at 479 kB/s)
[INFO] Downloading from central: https://repo.maven.apache.org/maven2/org/glassfish/hk2/hk2-core/2.4.0-b31/hk2-core-2.4.0-b31.pom
[INFO] Downloaded from central: https://repo.maven.apache.org/maven2/org/glassfish/hk2/hk2-core/2.4.0-b31/hk2-core-2.4.0-b31.pom
(4.2 kB at 321 kB/s)
[INFO] Downloading from central: https://repo.maven.apache.org/maven2/org/glassfish/hk2/external/bean-validator/2.4.0-b31/bean-validator-2.4.0-b31.pom
[INFO] Downloaded from central: https://repo.maven.apache.org/maven2/org/glassfish/hk2/external/bean-validator/2.4.0-b31/bean-validator-2.4.0-b31.pom
(12 kB at 604 kB/s)
[INFO] Downloading from central: https://repo.maven.apache.org/maven2/org/glassfish/hk2/hk2-runlevel/2.4.0-b31/hk2-runlevel-2.4.0-b31.pom
[INFO] Downloaded from central: https://repo.maven.apache.org/maven2/org/glassfish/hk2/hk2-runlevel/2.4.0-b31/hk2-runlevel-2.4.0-b31.pom
(4.3 kB at 330 kB/s)
[INFO] Downloading from central: https://repo.maven.apache.org/maven2/org/glassfish/hk2/class-model/2.4.0-b31/class-model-2.4.0-b31.pom
[INFO] Downloaded from central: https://repo.maven.apache.org/maven2/org/glassfish/hk2/class-model/2.4.0-b31/class-model-2.4.0-b31.pom
(4.5 kB at 266 kB/s)
[INFO] Downloading from central: https://repo.maven.apache.org/maven2/org/glassfish/hk2/external/asm-all-repackaged/2.4.0-b31/asm-all-repackaged-2.4.0-b31.pom
[INFO] Downloaded from central: https://repo.maven.apache.org/maven2/org/glassfish/hk2/external/asm-all-repackaged/2.4.0-b31/asm-all-repackaged-2.4.0-b31.pom
(4.9 kB at 352 kB/s)
[INFO] Downloading from central: https://repo.maven.apache.org/maven2/org/glassfish/hk2/spring-bridge/2.4.0-b31/spring-bridge-2.4.0-b31.pom
[INFO] Downloaded from central: https://repo.maven.apache.org/maven2/org/glassfish/hk2/spring-bridge/2.4.0-b31/spring-bridge-2.4.0-b31.pom
(4.0 kB at 210 kB/s)
[INFO] Downloading from central: https://repo.maven.apache.org/maven2/com/google/code/maven-play-plugin/net/tanesha/recaptcha4j/recaptcha4j/0.0.8/recaptcha4j-0.0.8.pom
[INFO] Downloaded from central: https://repo.maven.apache.org/maven2/com/google/code/maven-play-plugin/net/tanesha/recaptcha4j/recaptcha4j/0.0.8/recaptcha4j-0.0.8.pom
(4.7 kB at 359 kB/s)
[INFO] Downloading from central: https://repo.maven.apache.org/maven2/org/springframework/spring-webmvc/3.2.13.RELEASE/spring-webmvc-3.2.13.RELEASE.pom
[INFO] Downloaded from central: https://repo.maven.apache.org/maven2/org/springframework/spring-webmvc/3.2.13.RELEASE/spring-webmvc-3.2.13.RELEASE.pom
(8.9 kB at 687 kB/s)
[INFO] Downloading from central: https://repo.maven.apache.org/maven2/org/glassfish/jersey/test-framework/providers/jersey-test-framework-provider-external/2.21/jersey-test-framework-provider-external-2.21.pom
[INFO] Downloaded from central: https://repo.maven.apache.org/maven2/org/glassfish/jersey/test-framework/providers/jersey-test-framework-provider-external/2.21/jersey-test-framework-provider-external-2.21.pom
(3.4 kB at 259 kB/s)
[INFO] Downloading from Nexus: http://repository.apache.org/snapshots/org/apache/usergrid/usergrid-java-client/2.2.0-SNAPSHOT/maven-metadata.xml
[INFO] Downloading from Nexus: http://repository.apache.org/snapshots/org/apache/usergrid/usergrid-java-client/2.2.0-SNAPSHOT/usergrid-java-client-2.2.0-SNAPSHOT.pom
[WARNING] The POM for org.apache.usergrid:usergrid-java-client:jar:2.2.0-SNAPSHOT is missing,
no dependency information available
[INFO] Downloading from central: https://repo.maven.apache.org/maven2/com/sun/jersey/contribs/jersey-apache-client/1.19/jersey-apache-client-1.19.pom
[INFO] Downloaded from central: https://repo.maven.apache.org/maven2/com/sun/jersey/contribs/jersey-apache-client/1.19/jersey-apache-client-1.19.pom
(6.4 kB at 455 kB/s)
[INFO] Downloading from central: https://repo.maven.apache.org/maven2/org/glassfish/jersey/ext/jersey-mvc-jsp/2.21/jersey-mvc-jsp-2.21.jar
[INFO] Downloading from central: https://repo.maven.apache.org/maven2/org/glassfish/jersey/ext/jersey-mvc/2.21/jersey-mvc-2.21.jar
[INFO] Downloading from central: https://repo.maven.apache.org/maven2/org/glassfish/jersey/media/jersey-media-multipart/2.21/jersey-media-multipart-2.21.jar
[INFO] Downloading from central: https://repo.maven.apache.org/maven2/org/jvnet/mimepull/mimepull/1.9.6/mimepull-1.9.6.jar
[INFO] Downloading from central: https://repo.maven.apache.org/maven2/org/glassfish/jersey/ext/jersey-spring3/2.21/jersey-spring3-2.21.jar
[INFO] Downloaded from central: https://repo.maven.apache.org/maven2/org/glassfish/jersey/ext/jersey-spring3/2.21/jersey-spring3-2.21.jar
(22 kB at 1.3 MB/s)
[INFO] Downloading from central: https://repo.maven.apache.org/maven2/org/glassfish/hk2/hk2/2.4.0-b31/hk2-2.4.0-b31.jar
[INFO] Downloaded from central: https://repo.maven.apache.org/maven2/org/glassfish/jersey/ext/jersey-mvc-jsp/2.21/jersey-mvc-jsp-2.21.jar
(19 kB at 989 kB/s)
[INFO] Downloading from central: https://repo.maven.apache.org/maven2/org/glassfish/hk2/config-types/2.4.0-b31/config-types-2.4.0-b31.jar
[INFO] Downloaded from central: https://repo.maven.apache.org/maven2/org/jvnet/mimepull/mimepull/1.9.6/mimepull-1.9.6.jar
(64 kB at 3.0 MB/s)
[INFO] Downloading from central: https://repo.maven.apache.org/maven2/org/glassfish/hk2/hk2-core/2.4.0-b31/hk2-core-2.4.0-b31.jar
[INFO] Downloaded from central: https://repo.maven.apache.org/maven2/org/glassfish/jersey/ext/jersey-mvc/2.21/jersey-mvc-2.21.jar
(42 kB at 1.9 MB/s)
[INFO] Downloading from central: https://repo.maven.apache.org/maven2/org/glassfish/hk2/hk2-config/2.4.0-b31/hk2-config-2.4.0-b31.jar
[INFO] Downloaded from central: https://repo.maven.apache.org/maven2/org/glassfish/jersey/media/jersey-media-multipart/2.21/jersey-media-multipart-2.21.jar
(68 kB at 3.1 MB/s)
[INFO] Downloading from central: https://repo.maven.apache.org/maven2/org/glassfish/hk2/external/bean-validator/2.4.0-b31/bean-validator-2.4.0-b31.jar
[INFO] Downloaded from central: https://repo.maven.apache.org/maven2/org/glassfish/hk2/hk2/2.4.0-b31/hk2-2.4.0-b31.jar
(3.2 kB at 104 kB/s)
[INFO] Downloading from central: https://repo.maven.apache.org/maven2/org/glassfish/hk2/hk2-runlevel/2.4.0-b31/hk2-runlevel-2.4.0-b31.jar
[INFO] Downloaded from central: https://repo.maven.apache.org/maven2/org/glassfish/hk2/config-types/2.4.0-b31/config-types-2.4.0-b31.jar
(8.5 kB at 273 kB/s)
[INFO] Downloading from central: https://repo.maven.apache.org/maven2/org/glassfish/hk2/class-model/2.4.0-b31/class-model-2.4.0-b31.jar
[INFO] Downloaded from central: https://repo.maven.apache.org/maven2/org/glassfish/hk2/hk2-core/2.4.0-b31/hk2-core-2.4.0-b31.jar
(118 kB at 2.4 MB/s)
[INFO] Downloading from central: https://repo.maven.apache.org/maven2/org/glassfish/hk2/external/asm-all-repackaged/2.4.0-b31/asm-all-repackaged-2.4.0-b31.jar
[INFO] Downloaded from central: https://repo.maven.apache.org/maven2/org/glassfish/hk2/hk2-runlevel/2.4.0-b31/hk2-runlevel-2.4.0-b31.jar
(54 kB at 1.1 MB/s)
[INFO] Downloading from central: https://repo.maven.apache.org/maven2/org/glassfish/hk2/spring-bridge/2.4.0-b31/spring-bridge-2.4.0-b31.jar
[INFO] Downloaded from central: https://repo.maven.apache.org/maven2/org/glassfish/hk2/class-model/2.4.0-b31/class-model-2.4.0-b31.jar
(88 kB at 1.8 MB/s)
[INFO] Downloading from central: https://repo.maven.apache.org/maven2/com/google/code/maven-play-plugin/net/tanesha/recaptcha4j/recaptcha4j/0.0.8/recaptcha4j-0.0.8.jar
[INFO] Downloaded from central: https://repo.maven.apache.org/maven2/org/glassfish/hk2/hk2-config/2.4.0-b31/hk2-config-2.4.0-b31.jar
(204 kB at 3.9 MB/s)
[INFO] Downloading from central: https://repo.maven.apache.org/maven2/org/springframework/spring-webmvc/3.2.13.RELEASE/spring-webmvc-3.2.13.RELEASE.jar
[INFO] Downloaded from central: https://repo.maven.apache.org/maven2/org/glassfish/hk2/spring-bridge/2.4.0-b31/spring-bridge-2.4.0-b31.jar
(13 kB at 209 kB/s)
[INFO] Downloading from central: https://repo.maven.apache.org/maven2/org/glassfish/jersey/test-framework/providers/jersey-test-framework-provider-external/2.21/jersey-test-framework-provider-external-2.21.jar
[INFO] Downloaded from central: https://repo.maven.apache.org/maven2/com/google/code/maven-play-plugin/net/tanesha/recaptcha4j/recaptcha4j/0.0.8/recaptcha4j-0.0.8.jar
(10 kB at 159 kB/s)
[INFO] Downloading from central: https://repo.maven.apache.org/maven2/com/sun/jersey/contribs/jersey-apache-client/1.19/jersey-apache-client-1.19.jar
[INFO] Downloaded from central: https://repo.maven.apache.org/maven2/org/glassfish/jersey/test-framework/providers/jersey-test-framework-provider-external/2.21/jersey-test-framework-provider-external-2.21.jar
(6.5 kB at 83 kB/s)
[INFO] Downloaded from central: https://repo.maven.apache.org/maven2/com/sun/jersey/contribs/jersey-apache-client/1.19/jersey-apache-client-1.19.jar
(22 kB at 282 kB/s)
[INFO] Downloaded from central: https://repo.maven.apache.org/maven2/org/glassfish/hk2/external/bean-validator/2.4.0-b31/bean-validator-2.4.0-b31.jar
(813 kB at 8.7 MB/s)
[INFO] Downloaded from central: https://repo.maven.apache.org/maven2/org/glassfish/hk2/external/asm-all-repackaged/2.4.0-b31/asm-all-repackaged-2.4.0-b31.jar
(399 kB at 3.9 MB/s)
[INFO] Downloaded from central: https://repo.maven.apache.org/maven2/org/springframework/spring-webmvc/3.2.13.RELEASE/spring-webmvc-3.2.13.RELEASE.jar
(641 kB at 5.4 MB/s)
[INFO] Downloading from Nexus: http://repository.apache.org/snapshots/org/apache/usergrid/usergrid-java-client/2.2.0-SNAPSHOT/usergrid-java-client-2.2.0-SNAPSHOT.jar
[INFO] ------------------------------------------------------------------------
[INFO] Reactor Summary:
[INFO] 
[INFO] Usergrid Parent 2.2.0-SNAPSHOT ..................... SUCCESS [ 11.333 s]
[INFO] Usergrid Build Tools ............................... SUCCESS [  4.727 s]
[INFO] Usergrid Config .................................... SUCCESS [  3.913 s]
[INFO] Usergrid Persistence ............................... SUCCESS [  2.198 s]
[INFO] Usergrid Model ..................................... SUCCESS [  5.584 s]
[INFO] Usergrid Common .................................... SUCCESS [  8.764 s]
[INFO] Usergrid ActorSystem ............................... SUCCESS [  4.435 s]
[INFO] Usergrid Collection ................................ SUCCESS [  6.389 s]
[INFO] Usergrid Map ....................................... SUCCESS [  3.748 s]
[INFO] Usergrid Queue ..................................... SUCCESS [ 10.789 s]
[INFO] Usergrid QueryIndex ................................ SUCCESS [  9.047 s]
[INFO] Usergrid Test Utils ................................ SUCCESS [ 12.496 s]
[INFO] Usergrid Graph ..................................... SUCCESS [  5.234 s]
[INFO] Usergrid Cache ..................................... SUCCESS [  3.696 s]
[INFO] Usergrid Token ..................................... SUCCESS [  3.557 s]
[INFO] Usergrid Core ...................................... SUCCESS [ 16.996 s]
[INFO] Usergrid Services .................................. SUCCESS [ 17.860 s]
[INFO] Usergrid REST ...................................... FAILURE [  2.001 s]
[INFO] Usergrid Tools ..................................... SKIPPED
[INFO] Usergrid Query Validator 2.2.0-SNAPSHOT ............ SKIPPED
[INFO] ------------------------------------------------------------------------
[INFO] BUILD FAILURE
[INFO] ------------------------------------------------------------------------
[INFO] Total time: 03:45 min
[INFO] Finished at: 2019-05-26T13:47:14Z
[INFO] ------------------------------------------------------------------------
Waiting for Jenkins to finish collecting data
[ERROR] Failed to execute goal on project usergrid-rest: Could not resolve dependencies for
project org.apache.usergrid:usergrid-rest:war:2.2.0-SNAPSHOT: Could not find artifact org.apache.usergrid:usergrid-java-client:jar:2.2.0-SNAPSHOT
in Nexus (http://repository.apache.org/snapshots) -> [Help 1]
[ERROR] 
[ERROR] To see the full stack trace of the errors, re-run Maven with the -e switch.
[ERROR] Re-run Maven using the -X switch to enable full debug logging.
[ERROR] 
[ERROR] For more information about the errors and possible solutions, please read the following
articles:
[ERROR] [Help 1] http://cwiki.apache.org/confluence/display/MAVEN/DependencyResolutionException
[ERROR] 
[ERROR] After correcting the problems, you can resume the build with the command
[ERROR]   mvn <goals> -rf :usergrid-rest
[JENKINS] Archiving <https://builds.apache.org/job/usergrid-stack/ws/stack/tools/pom.xml>
to org.apache.usergrid/usergrid-tools/2.2.0-SNAPSHOT/usergrid-tools-2.2.0-SNAPSHOT.pom
[JENKINS] Archiving <https://builds.apache.org/job/usergrid-stack/ws/stack/corepersistence/collection/pom.xml>
to org.apache.usergrid/collection/2.2.0-SNAPSHOT/collection-2.2.0-SNAPSHOT.pom
[JENKINS] Archiving <https://builds.apache.org/job/usergrid-stack/ws/stack/corepersistence/collection/target/collection-2.2.0-SNAPSHOT.jar>
to org.apache.usergrid/collection/2.2.0-SNAPSHOT/collection-2.2.0-SNAPSHOT.jar
[JENKINS] Archiving <https://builds.apache.org/job/usergrid-stack/ws/stack/corepersistence/collection/target/collection-2.2.0-SNAPSHOT-tests.jar>
to org.apache.usergrid/collection/2.2.0-SNAPSHOT/collection-2.2.0-SNAPSHOT-tests.jar
[JENKINS] Archiving <https://builds.apache.org/job/usergrid-stack/ws/stack/corepersistence/queue/pom.xml>
to org.apache.usergrid/queue/2.2.0-SNAPSHOT/queue-2.2.0-SNAPSHOT.pom
[JENKINS] Archiving <https://builds.apache.org/job/usergrid-stack/ws/stack/corepersistence/queue/target/queue-2.2.0-SNAPSHOT.war>
to org.apache.usergrid/queue/2.2.0-SNAPSHOT/queue-2.2.0-SNAPSHOT.war
[JENKINS] Archiving <https://builds.apache.org/job/usergrid-stack/ws/stack/corepersistence/queue/target/queue-2.2.0-SNAPSHOT-classes.jar>
to org.apache.usergrid/queue/2.2.0-SNAPSHOT/queue-2.2.0-SNAPSHOT-classes.jar
[JENKINS] Archiving <https://builds.apache.org/job/usergrid-stack/ws/stack/corepersistence/queue/target/queue-2.2.0-SNAPSHOT-tests.jar>
to org.apache.usergrid/queue/2.2.0-SNAPSHOT/queue-2.2.0-SNAPSHOT-tests.jar
[Fast Archiver] Compressed 40.06 MB of artifacts by 90.3% relative to #120
[JENKINS] Archiving <https://builds.apache.org/job/usergrid-stack/ws/stack/corepersistence/token/pom.xml>
to org.apache.usergrid/token/2.2.0-SNAPSHOT/token-2.2.0-SNAPSHOT.pom
[JENKINS] Archiving <https://builds.apache.org/job/usergrid-stack/ws/stack/corepersistence/token/target/token-2.2.0-SNAPSHOT.jar>
to org.apache.usergrid/token/2.2.0-SNAPSHOT/token-2.2.0-SNAPSHOT.jar
[JENKINS] Archiving <https://builds.apache.org/job/usergrid-stack/ws/stack/corepersistence/token/target/token-2.2.0-SNAPSHOT-tests.jar>
to org.apache.usergrid/token/2.2.0-SNAPSHOT/token-2.2.0-SNAPSHOT-tests.jar
[JENKINS] Archiving <https://builds.apache.org/job/usergrid-stack/ws/stack/query-validator/pom.xml>
to org.apache.usergrid/usergrid-query-validator/2.2.0-SNAPSHOT/usergrid-query-validator-2.2.0-SNAPSHOT.pom
[Fast Archiver] No prior successful build to compare, so performing full copy of artifacts
[JENKINS] Archiving <https://builds.apache.org/job/usergrid-stack/ws/stack/corepersistence/graph/pom.xml>
to org.apache.usergrid/graph/2.2.0-SNAPSHOT/graph-2.2.0-SNAPSHOT.pom
[JENKINS] Archiving <https://builds.apache.org/job/usergrid-stack/ws/stack/corepersistence/graph/target/graph-2.2.0-SNAPSHOT.jar>
to org.apache.usergrid/graph/2.2.0-SNAPSHOT/graph-2.2.0-SNAPSHOT.jar
[JENKINS] Archiving <https://builds.apache.org/job/usergrid-stack/ws/stack/corepersistence/graph/target/graph-2.2.0-SNAPSHOT-tests.jar>
to org.apache.usergrid/graph/2.2.0-SNAPSHOT/graph-2.2.0-SNAPSHOT-tests.jar
[JENKINS] Archiving <https://builds.apache.org/job/usergrid-stack/ws/stack/rest/pom.xml>
to org.apache.usergrid/usergrid-rest/2.2.0-SNAPSHOT/usergrid-rest-2.2.0-SNAPSHOT.pom
[JENKINS] Archiving <https://builds.apache.org/job/usergrid-stack/ws/stack/corepersistence/queryindex/pom.xml>
to org.apache.usergrid/queryindex/2.2.0-SNAPSHOT/queryindex-2.2.0-SNAPSHOT.pom
[JENKINS] Archiving <https://builds.apache.org/job/usergrid-stack/ws/stack/corepersistence/queryindex/target/queryindex-2.2.0-SNAPSHOT.jar>
to org.apache.usergrid/queryindex/2.2.0-SNAPSHOT/queryindex-2.2.0-SNAPSHOT.jar
[JENKINS] Archiving <https://builds.apache.org/job/usergrid-stack/ws/stack/corepersistence/queryindex/target/queryindex-2.2.0-SNAPSHOT-tests.jar>
to org.apache.usergrid/queryindex/2.2.0-SNAPSHOT/queryindex-2.2.0-SNAPSHOT-tests.jar
[Fast Archiver] Compressed 560.94 KB of artifacts by 39.9% relative to #120
[JENKINS] Archiving <https://builds.apache.org/job/usergrid-stack/ws/stack/build-tools/pom.xml>
to org.apache.usergrid/build-tools/2.2.0-SNAPSHOT/build-tools-2.2.0-SNAPSHOT.pom
[JENKINS] Archiving <https://builds.apache.org/job/usergrid-stack/ws/stack/build-tools/target/build-tools-2.2.0-SNAPSHOT.jar>
to org.apache.usergrid/build-tools/2.2.0-SNAPSHOT/build-tools-2.2.0-SNAPSHOT.jar
[JENKINS] Archiving <https://builds.apache.org/job/usergrid-stack/ws/stack/build-tools/target/build-tools-2.2.0-SNAPSHOT-tests.jar>
to org.apache.usergrid/build-tools/2.2.0-SNAPSHOT/build-tools-2.2.0-SNAPSHOT-tests.jar
[JENKINS] Archiving <https://builds.apache.org/job/usergrid-stack/ws/stack/corepersistence/actorsystem/pom.xml>
to org.apache.usergrid/actorsystem/2.2.0-SNAPSHOT/actorsystem-2.2.0-SNAPSHOT.pom
[JENKINS] Archiving <https://builds.apache.org/job/usergrid-stack/ws/stack/corepersistence/actorsystem/target/actorsystem-2.2.0-SNAPSHOT.jar>
to org.apache.usergrid/actorsystem/2.2.0-SNAPSHOT/actorsystem-2.2.0-SNAPSHOT.jar
[JENKINS] Archiving <https://builds.apache.org/job/usergrid-stack/ws/stack/corepersistence/actorsystem/target/actorsystem-2.2.0-SNAPSHOT-tests.jar>
to org.apache.usergrid/actorsystem/2.2.0-SNAPSHOT/actorsystem-2.2.0-SNAPSHOT-tests.jar
[JENKINS] Archiving <https://builds.apache.org/job/usergrid-stack/ws/stack/pom.xml>
to org.apache.usergrid/usergrid/2.2.0-SNAPSHOT/usergrid-2.2.0-SNAPSHOT.pom
[JENKINS] Archiving <https://builds.apache.org/job/usergrid-stack/ws/stack/target/usergrid-2.2.0-SNAPSHOT-tests.jar>
to org.apache.usergrid/usergrid/2.2.0-SNAPSHOT/usergrid-2.2.0-SNAPSHOT-tests.jar
[Fast Archiver] Compressed 69.34 KB of artifacts by 46.1% relative to #120
[JENKINS] Archiving <https://builds.apache.org/job/usergrid-stack/ws/stack/corepersistence/model/pom.xml>
to org.apache.usergrid/model/2.2.0-SNAPSHOT/model-2.2.0-SNAPSHOT.pom
[JENKINS] Archiving <https://builds.apache.org/job/usergrid-stack/ws/stack/corepersistence/model/target/model-2.2.0-SNAPSHOT.jar>
to org.apache.usergrid/model/2.2.0-SNAPSHOT/model-2.2.0-SNAPSHOT.jar
[JENKINS] Archiving <https://builds.apache.org/job/usergrid-stack/ws/stack/corepersistence/model/target/model-2.2.0-SNAPSHOT-tests.jar>
to org.apache.usergrid/model/2.2.0-SNAPSHOT/model-2.2.0-SNAPSHOT-tests.jar
[JENKINS] Archiving <https://builds.apache.org/job/usergrid-stack/ws/stack/corepersistence/map/pom.xml>
to org.apache.usergrid/map/2.2.0-SNAPSHOT/map-2.2.0-SNAPSHOT.pom
[JENKINS] Archiving <https://builds.apache.org/job/usergrid-stack/ws/stack/corepersistence/map/target/map-2.2.0-SNAPSHOT.jar>
to org.apache.usergrid/map/2.2.0-SNAPSHOT/map-2.2.0-SNAPSHOT.jar
[JENKINS] Archiving <https://builds.apache.org/job/usergrid-stack/ws/stack/corepersistence/map/target/map-2.2.0-SNAPSHOT-tests.jar>
to org.apache.usergrid/map/2.2.0-SNAPSHOT/map-2.2.0-SNAPSHOT-tests.jar
[JENKINS] Archiving <https://builds.apache.org/job/usergrid-stack/ws/stack/services/pom.xml>
to org.apache.usergrid/usergrid-services/2.2.0-SNAPSHOT/usergrid-services-2.2.0-SNAPSHOT.pom
[JENKINS] Archiving <https://builds.apache.org/job/usergrid-stack/ws/stack/services/target/usergrid-services-2.2.0-SNAPSHOT.jar>
to org.apache.usergrid/usergrid-services/2.2.0-SNAPSHOT/usergrid-services-2.2.0-SNAPSHOT.jar
[JENKINS] Archiving <https://builds.apache.org/job/usergrid-stack/ws/stack/services/target/usergrid-services-2.2.0-SNAPSHOT-tests.jar>
to org.apache.usergrid/usergrid-services/2.2.0-SNAPSHOT/usergrid-services-2.2.0-SNAPSHOT-tests.jar
[JENKINS] Archiving <https://builds.apache.org/job/usergrid-stack/ws/stack/config/pom.xml>
to org.apache.usergrid/usergrid-config/2.2.0-SNAPSHOT/usergrid-config-2.2.0-SNAPSHOT.pom
[JENKINS] Archiving <https://builds.apache.org/job/usergrid-stack/ws/stack/config/target/usergrid-config-2.2.0-SNAPSHOT.jar>
to org.apache.usergrid/usergrid-config/2.2.0-SNAPSHOT/usergrid-config-2.2.0-SNAPSHOT.jar
[JENKINS] Archiving <https://builds.apache.org/job/usergrid-stack/ws/stack/config/target/usergrid-config-2.2.0-SNAPSHOT-tests.jar>
to org.apache.usergrid/usergrid-config/2.2.0-SNAPSHOT/usergrid-config-2.2.0-SNAPSHOT-tests.jar
[JENKINS] Archiving <https://builds.apache.org/job/usergrid-stack/ws/stack/corepersistence/cache/pom.xml>
to org.apache.usergrid/cache/2.2.0-SNAPSHOT/cache-2.2.0-SNAPSHOT.pom
[JENKINS] Archiving <https://builds.apache.org/job/usergrid-stack/ws/stack/corepersistence/cache/target/cache-2.2.0-SNAPSHOT.jar>
to org.apache.usergrid/cache/2.2.0-SNAPSHOT/cache-2.2.0-SNAPSHOT.jar
[JENKINS] Archiving <https://builds.apache.org/job/usergrid-stack/ws/stack/corepersistence/cache/target/cache-2.2.0-SNAPSHOT-tests.jar>
to org.apache.usergrid/cache/2.2.0-SNAPSHOT/cache-2.2.0-SNAPSHOT-tests.jar
[JENKINS] Archiving <https://builds.apache.org/job/usergrid-stack/ws/stack/corepersistence/common/pom.xml>
to org.apache.usergrid/common/2.2.0-SNAPSHOT/common-2.2.0-SNAPSHOT.pom
[JENKINS] Archiving <https://builds.apache.org/job/usergrid-stack/ws/stack/corepersistence/common/target/common-2.2.0-SNAPSHOT.jar>
to org.apache.usergrid/common/2.2.0-SNAPSHOT/common-2.2.0-SNAPSHOT.jar
[JENKINS] Archiving <https://builds.apache.org/job/usergrid-stack/ws/stack/corepersistence/common/target/common-2.2.0-SNAPSHOT-tests.jar>
to org.apache.usergrid/common/2.2.0-SNAPSHOT/common-2.2.0-SNAPSHOT-tests.jar
[JENKINS] Archiving <https://builds.apache.org/job/usergrid-stack/ws/stack/core/pom.xml>
to org.apache.usergrid/usergrid-core/2.2.0-SNAPSHOT/usergrid-core-2.2.0-SNAPSHOT.pom
[JENKINS] Archiving <https://builds.apache.org/job/usergrid-stack/ws/stack/core/target/usergrid-core-2.2.0-SNAPSHOT.jar>
to org.apache.usergrid/usergrid-core/2.2.0-SNAPSHOT/usergrid-core-2.2.0-SNAPSHOT.jar
[JENKINS] Archiving <https://builds.apache.org/job/usergrid-stack/ws/stack/core/target/usergrid-core-2.2.0-SNAPSHOT-tests.jar>
to org.apache.usergrid/usergrid-core/2.2.0-SNAPSHOT/usergrid-core-2.2.0-SNAPSHOT-tests.jar
[JENKINS] Archiving <https://builds.apache.org/job/usergrid-stack/ws/stack/corepersistence/pom.xml>
to org.apache.usergrid/persistence/2.2.0-SNAPSHOT/persistence-2.2.0-SNAPSHOT.pom
[JENKINS] Archiving <https://builds.apache.org/job/usergrid-stack/ws/stack/corepersistence/target/persistence-2.2.0-SNAPSHOT-tests.jar>
to org.apache.usergrid/persistence/2.2.0-SNAPSHOT/persistence-2.2.0-SNAPSHOT-tests.jar
[JENKINS] Archiving <https://builds.apache.org/job/usergrid-stack/ws/stack/test-utils/pom.xml>
to org.apache.usergrid/usergrid-test-utils/2.2.0-SNAPSHOT/usergrid-test-utils-2.2.0-SNAPSHOT.pom
[JENKINS] Archiving <https://builds.apache.org/job/usergrid-stack/ws/stack/test-utils/target/usergrid-test-utils-2.2.0-SNAPSHOT.jar>
to org.apache.usergrid/usergrid-test-utils/2.2.0-SNAPSHOT/usergrid-test-utils-2.2.0-SNAPSHOT.jar
[JENKINS] Archiving <https://builds.apache.org/job/usergrid-stack/ws/stack/test-utils/target/usergrid-test-utils-2.2.0-SNAPSHOT-tests.jar>
to org.apache.usergrid/usergrid-test-utils/2.2.0-SNAPSHOT/usergrid-test-utils-2.2.0-SNAPSHOT-tests.jar
channel stopped

Mime
View raw message