ws-dev mailing list archives

Site index · List index
Message view « Date » · « Thread »
Top « Date » · « Thread »
From Apache Jenkins Server <jenk...@builds.apache.org>
Subject Build failed in Jenkins: ws-axiom-trunk #712
Date Thu, 24 Nov 2011 01:28:48 GMT
See <https://builds.apache.org/job/ws-axiom-trunk/712/changes>

Changes:

[veithen] AXIOM-398: Normalize the return value of getNamespace for OMElement and OMSourcedElement
instances.

------------------------------------------
[...truncated 433 lines...]
[INFO] Copying sjsxp-1.0.1.jar to <https://builds.apache.org/job/ws-axiom-trunk/ws/axiom/modules/axiom-api/target/parsers/sjsxp-1.0.1.jar>
[INFO] Copying stax-1.2.0.jar to <https://builds.apache.org/job/ws-axiom-trunk/ws/axiom/modules/axiom-api/target/parsers/stax-1.2.0.jar>
[INFO] [resources:testResources {execution: default-testResources}]
[INFO] Using 'UTF-8' encoding to copy filtered resources.
[INFO] Copying 54 resources
[INFO] Copying 1 resource
[INFO] Copying 3 resources
[INFO] [compiler:testCompile {execution: default-testCompile}]
[INFO] Compiling 100 source files to <https://builds.apache.org/job/ws-axiom-trunk/ws/axiom/modules/axiom-api/target/test-classes>
[WARNING] DEPRECATED [systemProperties]: Use systemPropertyVariables instead.
[INFO] [surefire:test {execution: default-test}]
[INFO] Surefire report directory: <https://builds.apache.org/job/ws-axiom-trunk/ws/axiom/modules/axiom-api/target/surefire-reports>

-------------------------------------------------------
 T E S T S
-------------------------------------------------------
Running org.apache.axiom.soap.DOMCompatibilityTest
Tests run: 14, Failures: 0, Errors: 0, Skipped: 0, Time elapsed: 0.046 sec
Running org.apache.axiom.attachments.AttachmentCacheMonitorTest
Tests run: 1, Failures: 0, Errors: 0, Skipped: 0, Time elapsed: 45.02 sec
Running org.apache.axiom.attachments.PartOnFileTest
Tests run: 2, Failures: 0, Errors: 0, Skipped: 0, Time elapsed: 0.106 sec
Running org.apache.axiom.attachments.PdfAttachmentStreamingTest
Tests run: 1, Failures: 0, Errors: 0, Skipped: 0, Time elapsed: 0.004 sec
Running org.apache.axiom.attachments.AttachmentsTest
Tests run: 36, Failures: 0, Errors: 0, Skipped: 0, Time elapsed: 130.731 sec
Running org.apache.axiom.attachments.utils.BAATest
Tests run: 1, Failures: 0, Errors: 0, Skipped: 0, Time elapsed: 0.133 sec
Running org.apache.axiom.attachments.utils.BAAInputStreamTest
Tests run: 1, Failures: 0, Errors: 0, Skipped: 0, Time elapsed: 0 sec
Running org.apache.axiom.attachments.impl.BufferUtilsTest
Tests run: 4, Failures: 0, Errors: 0, Skipped: 0, Time elapsed: 0.149 sec
Running org.apache.axiom.mime.impl.axiom.MultipartWriterTest
Tests run: 2, Failures: 0, Errors: 0, Skipped: 0, Time elapsed: 0.013 sec
Running org.apache.axiom.mime.impl.javamail.MultipartWriterTest
Tests run: 2, Failures: 0, Errors: 0, Skipped: 0, Time elapsed: 0.007 sec
Running org.apache.axiom.util.namespace.ScopedNamespaceContextTest
Tests run: 5, Failures: 0, Errors: 0, Skipped: 0, Time elapsed: 0.002 sec
Running org.apache.axiom.util.stax.XMLStreamReaderUtilsTest
Tests run: 10, Failures: 0, Errors: 0, Skipped: 0, Time elapsed: 0.089 sec
Running org.apache.axiom.util.stax.xop.XOPUtilsTest
Tests run: 2, Failures: 0, Errors: 0, Skipped: 0, Time elapsed: 0.001 sec
Running org.apache.axiom.util.stax.xop.XOPDecodingStreamReaderTest
Tests run: 2, Failures: 0, Errors: 0, Skipped: 0, Time elapsed: 0.187 sec
Running org.apache.axiom.util.stax.xop.XOPEncodingStreamReaderTest
Tests run: 1, Failures: 0, Errors: 0, Skipped: 0, Time elapsed: 0.034 sec
Running org.apache.axiom.util.stax.debug.XMLStreamReaderValidatorTest
Tests run: 2, Failures: 0, Errors: 0, Skipped: 0, Time elapsed: 0.001 sec
Running org.apache.axiom.util.stax.dialect.DialectTestSuite
Warning: SJSXP doesn't report character data in prolog
[JENKINS] Recording test results
Warning: Woodstox doesn't report character data in prolog
Warning: Woodstox doesn't report character data in prolog
Tests run: 861, Failures: 0, Errors: 0, Skipped: 0, Time elapsed: 1.959 sec
Running org.apache.axiom.util.stax.XMLFragmentStreamReaderTest
Tests run: 1, Failures: 0, Errors: 0, Skipped: 0, Time elapsed: 0 sec
Running org.apache.axiom.util.blob.MemoryBlobTest
Tests run: 9, Failures: 0, Errors: 0, Skipped: 0, Time elapsed: 0 sec
Running org.apache.axiom.util.blob.OverflowBlobTest
Tests run: 9, Failures: 0, Errors: 0, Skipped: 0, Time elapsed: 0.004 sec
Running org.apache.axiom.util.UIDGeneratorTest
Tests run: 4, Failures: 0, Errors: 0, Skipped: 0, Time elapsed: 0.875 sec
Running org.apache.axiom.util.activation.DataHandlerWrapperTest
Tests run: 1, Failures: 0, Errors: 0, Skipped: 0, Time elapsed: 0 sec
Running org.apache.axiom.om.DOMCompatibilityTest
Tests run: 10, Failures: 0, Errors: 0, Skipped: 0, Time elapsed: 0.003 sec
Running org.apache.axiom.om.OMOutputFormatTest
Tests run: 9, Failures: 0, Errors: 0, Skipped: 0, Time elapsed: 0.001 sec
Running org.apache.axiom.om.impl.serialize.StreamingOMSerializerTest
Tests run: 15, Failures: 0, Errors: 0, Skipped: 0, Time elapsed: 0.102 sec
Running org.apache.axiom.om.util.Base64Test
Tests run: 1, Failures: 0, Errors: 0, Skipped: 0, Time elapsed: 0.002 sec
Running org.apache.axiom.om.util.CommonUtilsTest
Tests run: 1, Failures: 0, Errors: 0, Skipped: 0, Time elapsed: 0 sec
Running org.apache.axiom.om.util.StAXUtilsTest
Tests run: 2, Failures: 0, Errors: 0, Skipped: 0, Time elapsed: 0 sec

Results :

Tests run: 1009, Failures: 0, Errors: 0, Skipped: 0

log4j:WARN No appenders could be found for logger (org.apache.commons.beanutils.converters.BooleanConverter).
log4j:WARN Please initialize the log4j system properly.
[INFO] [bundle:bundle {execution: default-bundle}]
[INFO] Preparing source:jar
[WARNING] Removing: jar from forked lifecycle, to prevent recursive invocation.
[INFO] No goals needed for project - skipping
[INFO] [source:jar {execution: attach-sources}]
[INFO] META-INF already added, skipping
[INFO] META-INF already added, skipping
[INFO] META-INF/DEPENDENCIES already added, skipping
[INFO] META-INF/NOTICE already added, skipping
[INFO] META-INF/LICENSE already added, skipping
[INFO] Building jar: <https://builds.apache.org/job/ws-axiom-trunk/ws/axiom/modules/axiom-api/target/axiom-api-1.2.13-SNAPSHOT-sources.jar>
[INFO] META-INF already added, skipping
[INFO] META-INF already added, skipping
[INFO] META-INF/DEPENDENCIES already added, skipping
[INFO] META-INF/NOTICE already added, skipping
[INFO] META-INF/LICENSE already added, skipping
[INFO] [jar:test-jar {execution: default}]
[INFO] Building jar: <https://builds.apache.org/job/ws-axiom-trunk/ws/axiom/modules/axiom-api/target/axiom-api-1.2.13-SNAPSHOT-tests.jar>
[INFO] [apache-rat:check {execution: default}]
[INFO] Exclude: src/test/resources/**
[INFO] Exclude: dependency-reduced-pom.xml
[JENKINS] Archiving site from <https://builds.apache.org/job/ws-axiom-trunk/ws/axiom/modules/axiom-api/target/site>
to /home/hudson/hudson/jobs/ws-axiom-trunk/site/axiom-api
[INFO] [install:install {execution: default-install}]
[INFO] Installing <https://builds.apache.org/job/ws-axiom-trunk/ws/axiom/modules/axiom-api/target/axiom-api-1.2.13-SNAPSHOT.jar>
to <https://builds.apache.org/job/ws-axiom-trunk/ws/.repository/org/apache/ws/commons/axiom/axiom-api/1.2.13-SNAPSHOT/axiom-api-1.2.13-SNAPSHOT.jar>
[INFO] Installing <https://builds.apache.org/job/ws-axiom-trunk/ws/axiom/modules/axiom-api/target/axiom-api-1.2.13-SNAPSHOT-sources.jar>
to <https://builds.apache.org/job/ws-axiom-trunk/ws/.repository/org/apache/ws/commons/axiom/axiom-api/1.2.13-SNAPSHOT/axiom-api-1.2.13-SNAPSHOT-sources.jar>
[INFO] Installing <https://builds.apache.org/job/ws-axiom-trunk/ws/axiom/modules/axiom-api/target/axiom-api-1.2.13-SNAPSHOT-tests.jar>
to <https://builds.apache.org/job/ws-axiom-trunk/ws/.repository/org/apache/ws/commons/axiom/axiom-api/1.2.13-SNAPSHOT/axiom-api-1.2.13-SNAPSHOT-tests.jar>
[INFO] [bundle:install {execution: default-install}]
[INFO] Parsing <https://builds.apache.org/job/ws-axiom-trunk/ws/.repository/repository.xml>
[INFO] Installing org/apache/ws/commons/axiom/axiom-api/1.2.13-SNAPSHOT/axiom-api-1.2.13-SNAPSHOT.jar
[INFO] Writing OBR metadata
[INFO] [deploy:deploy {execution: default-deploy}]
[INFO] Retrieving previous build number from apache.snapshots.https
Uploading: https://repository.apache.org/content/repositories/snapshots/org/apache/ws/commons/axiom/axiom-api/1.2.13-SNAPSHOT/axiom-api-1.2.13-20111124.011627-283.jar
413K uploaded  (axiom-api-1.2.13-20111124.011627-283.jar)
[INFO] Uploading project information for axiom-api 1.2.13-20111124.011627-283
[INFO] Retrieving previous metadata from apache.snapshots.https
[INFO] Uploading repository metadata for: 'snapshot org.apache.ws.commons.axiom:axiom-api:1.2.13-SNAPSHOT'
[INFO] Retrieving previous metadata from apache.snapshots.https
[INFO] Uploading repository metadata for: 'artifact org.apache.ws.commons.axiom:axiom-api'
[INFO] Retrieving previous build number from apache.snapshots.https
Uploading: https://repository.apache.org/content/repositories/snapshots/org/apache/ws/commons/axiom/axiom-api/1.2.13-SNAPSHOT/axiom-api-1.2.13-20111124.011627-283-sources.jar
482K uploaded  (axiom-api-1.2.13-20111124.011627-283-sources.jar)
[INFO] Retrieving previous build number from apache.snapshots.https
Uploading: https://repository.apache.org/content/repositories/snapshots/org/apache/ws/commons/axiom/axiom-api/1.2.13-SNAPSHOT/axiom-api-1.2.13-20111124.011627-283-tests.jar
450K uploaded  (axiom-api-1.2.13-20111124.011627-283-tests.jar)
[INFO] [bundle:deploy {execution: default-deploy}]
[INFO] Remote OBR update disabled (enable with -DremoteOBR)
[INFO] [site:site {execution: default-site}]
[INFO] Parent project loaded from repository: org.apache:apache:pom:9
[JENKINS] Archiving <https://builds.apache.org/job/ws-axiom-trunk/ws/axiom/modules/axiom-api/pom.xml>
to /home/hudson/hudson/jobs/ws-axiom-trunk/modules/org.apache.ws.commons.axiom$axiom-api/builds/2011-11-24_01-16-04/archive/org.apache.ws.commons.axiom/axiom-api/1.2.13-SNAPSHOT/axiom-api-1.2.13-SNAPSHOT.pom
[JENKINS] Archiving <https://builds.apache.org/job/ws-axiom-trunk/ws/axiom/modules/axiom-api/target/axiom-api-1.2.13-SNAPSHOT.jar>
to /home/hudson/hudson/jobs/ws-axiom-trunk/modules/org.apache.ws.commons.axiom$axiom-api/builds/2011-11-24_01-16-04/archive/org.apache.ws.commons.axiom/axiom-api/1.2.13-20111124.011627-283/axiom-api-1.2.13-20111124.011627-283.jar
[JENKINS] Archiving <https://builds.apache.org/job/ws-axiom-trunk/ws/axiom/modules/axiom-api/target/axiom-api-1.2.13-SNAPSHOT-sources.jar>
to /home/hudson/hudson/jobs/ws-axiom-trunk/modules/org.apache.ws.commons.axiom$axiom-api/builds/2011-11-24_01-16-04/archive/org.apache.ws.commons.axiom/axiom-api/1.2.13-20111124.011627-283/axiom-api-1.2.13-20111124.011627-283-sources.jar
[JENKINS] Archiving <https://builds.apache.org/job/ws-axiom-trunk/ws/axiom/modules/axiom-api/target/axiom-api-1.2.13-SNAPSHOT-tests.jar>
to /home/hudson/hudson/jobs/ws-axiom-trunk/modules/org.apache.ws.commons.axiom$axiom-api/builds/2011-11-24_01-16-04/archive/org.apache.ws.commons.axiom/axiom-api/1.2.13-20111124.011627-283/axiom-api-1.2.13-20111124.011627-283-tests.jar
[JENKINS] Recording test results
[INFO] ------------------------------------------------------------------------
[INFO] Building Axiom DOM Test Suite
[INFO]    task-segment: [clean, deploy, site]
[INFO] ------------------------------------------------------------------------
[INFO] [clean:clean {execution: default-clean}]
[INFO] Deleting <https://builds.apache.org/job/ws-axiom-trunk/ws/axiom/modules/axiom-dom-testsuite/target>
[INFO] [remote-resources:process {execution: default}]
[INFO] [resources:resources {execution: default-resources}]
[INFO] Using 'UTF-8' encoding to copy filtered resources.
[INFO] Copying 1 resource
[INFO] Copying 3 resources
[INFO] [compiler:compile {execution: default-compile}]
[INFO] Compiling 29 source files to <https://builds.apache.org/job/ws-axiom-trunk/ws/axiom/modules/axiom-dom-testsuite/target/classes>
[INFO] [resources:testResources {execution: default-testResources}]
[INFO] Using 'UTF-8' encoding to copy filtered resources.
[INFO] skip non existing resourceDirectory <https://builds.apache.org/job/ws-axiom-trunk/ws/axiom/modules/axiom-dom-testsuite/src/test/resources>
[INFO] Copying 3 resources
[INFO] [compiler:testCompile {execution: default-testCompile}]
[INFO] Compiling 1 source file to <https://builds.apache.org/job/ws-axiom-trunk/ws/axiom/modules/axiom-dom-testsuite/target/test-classes>
[WARNING] DEPRECATED [systemProperties]: Use systemPropertyVariables instead.
[INFO] [surefire:test {execution: default-test}]
[INFO] Surefire report directory: <https://builds.apache.org/job/ws-axiom-trunk/ws/axiom/modules/axiom-dom-testsuite/target/surefire-reports>

-------------------------------------------------------
 T E S T S
-------------------------------------------------------
Running org.apache.axiom.ts.dom.XercesTest
Tests run: 27, Failures: 0, Errors: 0, Skipped: 0, Time elapsed: 0.189 sec

Results :

Tests run: 27, Failures: 0, Errors: 0, Skipped: 0

[INFO] [jar:jar {execution: default-jar}]
[INFO] Building jar: <https://builds.apache.org/job/ws-axiom-trunk/ws/axiom/modules/axiom-dom-testsuite/target/axiom-dom-testsuite-1.2.13-SNAPSHOT.jar>
[INFO] Preparing source:jar
[WARNING] Removing: jar from forked lifecycle, to prevent recursive invocation.
[INFO] No goals needed for project - skipping
[INFO] [source:jar {execution: attach-sources}]
[INFO] META-INF already added, skipping
[INFO] META-INF/DEPENDENCIES already added, skipping
[INFO] META-INF/NOTICE already added, skipping
[INFO] META-INF/LICENSE already added, skipping
[INFO] Building jar: <https://builds.apache.org/job/ws-axiom-trunk/ws/axiom/modules/axiom-dom-testsuite/target/axiom-dom-testsuite-1.2.13-SNAPSHOT-sources.jar>
[INFO] META-INF already added, skipping
[INFO] META-INF/DEPENDENCIES already added, skipping
[INFO] META-INF/NOTICE already added, skipping
[INFO] META-INF/LICENSE already added, skipping
[INFO] [apache-rat:check {execution: default}]
[INFO] Exclude: src/main/resources/**
[INFO] [install:install {execution: default-install}]
[INFO] Installing <https://builds.apache.org/job/ws-axiom-trunk/ws/axiom/modules/axiom-dom-testsuite/target/axiom-dom-testsuite-1.2.13-SNAPSHOT.jar>
to <https://builds.apache.org/job/ws-axiom-trunk/ws/.repository/org/apache/ws/commons/axiom/axiom-dom-testsuite/1.2.13-SNAPSHOT/axiom-dom-testsuite-1.2.13-SNAPSHOT.jar>
[INFO] Installing <https://builds.apache.org/job/ws-axiom-trunk/ws/axiom/modules/axiom-dom-testsuite/target/axiom-dom-testsuite-1.2.13-SNAPSHOT-sources.jar>
to <https://builds.apache.org/job/ws-axiom-trunk/ws/.repository/org/apache/ws/commons/axiom/axiom-dom-testsuite/1.2.13-SNAPSHOT/axiom-dom-testsuite-1.2.13-SNAPSHOT-sources.jar>
[INFO] [deploy:deploy {execution: default-deploy}]
[INFO] Retrieving previous build number from apache.snapshots.https
Uploading: https://repository.apache.org/content/repositories/snapshots/org/apache/ws/commons/axiom/axiom-dom-testsuite/1.2.13-SNAPSHOT/axiom-dom-testsuite-1.2.13-20111124.011627-134.jar
39K uploaded  (axiom-dom-testsuite-1.2.13-20111124.011627-134.jar)
[INFO] Retrieving previous metadata from apache.snapshots.https
[INFO] Uploading repository metadata for: 'snapshot org.apache.ws.commons.axiom:axiom-dom-testsuite:1.2.13-SNAPSHOT'
[INFO] Uploading project information for axiom-dom-testsuite 1.2.13-20111124.011627-134
[INFO] Retrieving previous metadata from apache.snapshots.https
[INFO] Uploading repository metadata for: 'artifact org.apache.ws.commons.axiom:axiom-dom-testsuite'
[JENKINS] Archiving site from <https://builds.apache.org/job/ws-axiom-trunk/ws/axiom/modules/axiom-dom-testsuite/target/site>
to /home/hudson/hudson/jobs/ws-axiom-trunk/site/axiom-dom-testsuite
[JENKINS] Archiving <https://builds.apache.org/job/ws-axiom-trunk/ws/axiom/modules/axiom-dom-testsuite/pom.xml>
to /home/hudson/hudson/jobs/ws-axiom-trunk/modules/org.apache.ws.commons.axiom$axiom-dom-testsuite/builds/2011-11-24_01-16-04/archive/org.apache.ws.commons.axiom/axiom-dom-testsuite/1.2.13-SNAPSHOT/axiom-dom-testsuite-1.2.13-SNAPSHOT.pom
[JENKINS] Archiving <https://builds.apache.org/job/ws-axiom-trunk/ws/axiom/modules/axiom-dom-testsuite/target/axiom-dom-testsuite-1.2.13-SNAPSHOT.jar>
to /home/hudson/hudson/jobs/ws-axiom-trunk/modules/org.apache.ws.commons.axiom$axiom-dom-testsuite/builds/2011-11-24_01-16-04/archive/org.apache.ws.commons.axiom/axiom-dom-testsuite/1.2.13-20111124.011627-134/axiom-dom-testsuite-1.2.13-20111124.011627-134.jar
[JENKINS] Archiving <https://builds.apache.org/job/ws-axiom-trunk/ws/axiom/modules/axiom-dom-testsuite/target/axiom-dom-testsuite-1.2.13-SNAPSHOT-sources.jar>
to /home/hudson/hudson/jobs/ws-axiom-trunk/modules/org.apache.ws.commons.axiom$axiom-dom-testsuite/builds/2011-11-24_01-16-04/archive/org.apache.ws.commons.axiom/axiom-dom-testsuite/1.2.13-20111124.011627-134/axiom-dom-testsuite-1.2.13-20111124.011627-134-sources.jar
[INFO] Retrieving previous build number from apache.snapshots.https
Uploading: https://repository.apache.org/content/repositories/snapshots/org/apache/ws/commons/axiom/axiom-dom-testsuite/1.2.13-SNAPSHOT/axiom-dom-testsuite-1.2.13-20111124.011627-134-sources.jar
35K uploaded  (axiom-dom-testsuite-1.2.13-20111124.011627-134-sources.jar)
[INFO] [site:site {execution: default-site}]
[INFO] Parent project loaded from repository: org.apache:apache:pom:9
[INFO] ------------------------------------------------------------------------
[INFO] Building Axiom Implementation Test Suite
[INFO]    task-segment: [clean, deploy, site]
[INFO] ------------------------------------------------------------------------
[INFO] [clean:clean {execution: default-clean}]
[INFO] Deleting <https://builds.apache.org/job/ws-axiom-trunk/ws/axiom/modules/axiom-testsuite/target>
[INFO] [remote-resources:process {execution: default}]
[INFO] snapshot org.apache.ws.commons.axiom:axiom-api:1.2.13-SNAPSHOT: checking for updates
from apache.snapshots
[INFO] [resources:resources {execution: default-resources}]
[INFO] Using 'UTF-8' encoding to copy filtered resources.
[INFO] Copying 15 resources
[INFO] Copying 3 resources
[INFO] [compiler:compile {execution: default-compile}]
[INFO] Compiling 323 source files to <https://builds.apache.org/job/ws-axiom-trunk/ws/axiom/modules/axiom-testsuite/target/classes>
[INFO] -------------------------------------------------------------
[ERROR] COMPILATION ERROR : 
[INFO] -------------------------------------------------------------
[ERROR] <https://builds.apache.org/job/ws-axiom-trunk/ws/axiom/modules/axiom-testsuite/src/main/java/org/apache/axiom/ts/OMTestSuiteBuilder.java>:[282,61]
cannot find symbol
symbol  : class TestGetNamespaceNormalized2
location: package org.apache.axiom.ts.om.sourcedelement
[INFO] 1 error
[INFO] -------------------------------------------------------------
[JENKINS] Archiving <https://builds.apache.org/job/ws-axiom-trunk/ws/axiom/modules/axiom-testsuite/pom.xml>
to /home/hudson/hudson/jobs/ws-axiom-trunk/modules/org.apache.ws.commons.axiom$axiom-testsuite/builds/2011-11-24_01-16-04/archive/org.apache.ws.commons.axiom/axiom-testsuite/1.2.13-SNAPSHOT/axiom-testsuite-1.2.13-SNAPSHOT.pom
[INFO] ------------------------------------------------------------------------
[ERROR] BUILD FAILURE
[INFO] ------------------------------------------------------------------------
[INFO] Compilation failure
<https://builds.apache.org/job/ws-axiom-trunk/ws/axiom/modules/axiom-testsuite/src/main/java/org/apache/axiom/ts/OMTestSuiteBuilder.java>:[282,61]
cannot find symbol
symbol  : class TestGetNamespaceNormalized2
location: package org.apache.axiom.ts.om.sourcedelement

[INFO] ------------------------------------------------------------------------
[INFO] For more information, run Maven with the -e switch
[INFO] ------------------------------------------------------------------------
[INFO] Total time: 5 minutes 17 seconds
[INFO] Finished at: Thu Nov 24 01:21:34 GMT 2011
[INFO] Final Memory: 92M/431M
[INFO] ------------------------------------------------------------------------
Sending e-mails to: dev@ws.apache.org andreas.veithen@gmail.com
channel stopped
Updating AXIOM-398


---------------------------------------------------------------------
To unsubscribe, e-mail: dev-unsubscribe@ws.apache.org
For additional commands, e-mail: dev-help@ws.apache.org


Mime
View raw message