ws-dev mailing list archives

Site index · List index
Message view « Date » · « Thread »
Top « Date » · « Thread »
From Apache Jenkins Server <jenk...@builds.apache.org>
Subject Build failed in Jenkins: wss4j-trunk #241
Date Tue, 15 Nov 2011 15:01:32 GMT
See <https://builds.apache.org/job/wss4j-trunk/241/changes>

Changes:

[coheigea] Adding a key length check to WSSecurityUtil.prepareSecretKey

------------------------------------------
[...truncated 258 lines...]
A         src/main/java/org/apache/ws/security/components/crypto
A         src/main/java/org/apache/ws/security/components/crypto/CertificateStore.java
AU        src/main/java/org/apache/ws/security/components/crypto/Crypto.java
A         src/main/java/org/apache/ws/security/components/crypto/DERDecoder.java
AU        src/main/java/org/apache/ws/security/components/crypto/X509NameTokenizer.java
A         src/main/java/org/apache/ws/security/components/crypto/CryptoType.java
AU        src/main/java/org/apache/ws/security/components/crypto/Merlin.java
A         src/main/java/org/apache/ws/security/components/crypto/MerlinDevice.java
AU        src/main/java/org/apache/ws/security/components/crypto/CryptoFactory.java
AU        src/main/java/org/apache/ws/security/components/crypto/CredentialException.java
A         src/main/java/org/apache/ws/security/components/crypto/X509SubjectPublicKeyInfo.java
AU        src/main/java/org/apache/ws/security/components/crypto/CryptoBase.java
AU        src/main/java/org/apache/ws/security/WSSecurityEngineResult.java
AU        src/main/java/org/apache/ws/security/WSSecurityEngine.java
AU        src/main/java/org/apache/ws/security/WSDerivedKeyTokenPrincipal.java
A         src/main/java/org/apache/ws/security/validate
A         src/main/java/org/apache/ws/security/validate/NoOpValidator.java
A         src/main/java/org/apache/ws/security/validate/KerberosTokenDecoder.java
A         src/main/java/org/apache/ws/security/validate/KerberosTokenValidator.java
A         src/main/java/org/apache/ws/security/validate/JAASUsernameTokenValidator.java
A         src/main/java/org/apache/ws/security/validate/Validator.java
A         src/main/java/org/apache/ws/security/validate/UsernameTokenValidator.java
A         src/main/java/org/apache/ws/security/validate/SignatureTrustValidator.java
A         src/main/java/org/apache/ws/security/validate/TimestampValidator.java
A         src/main/java/org/apache/ws/security/validate/Credential.java
A         src/main/java/org/apache/ws/security/validate/SamlAssertionValidator.java
A         src/main/java/org/apache/ws/security/saml
AU        src/main/java/org/apache/ws/security/saml/SAMLIssuerFactory.java
A         src/main/java/org/apache/ws/security/saml/ext
A         src/main/java/org/apache/ws/security/saml/ext/SAMLParms.java
A         src/main/java/org/apache/ws/security/saml/ext/bean
A         src/main/java/org/apache/ws/security/saml/ext/bean/ConditionsBean.java
A         src/main/java/org/apache/ws/security/saml/ext/bean/ActionBean.java
A         src/main/java/org/apache/ws/security/saml/ext/bean/SubjectBean.java
A         src/main/java/org/apache/ws/security/saml/ext/bean/SubjectLocalityBean.java
A         src/main/java/org/apache/ws/security/saml/ext/bean/AttributeBean.java
A         src/main/java/org/apache/ws/security/saml/ext/bean/AuthDecisionStatementBean.java
A         src/main/java/org/apache/ws/security/saml/ext/bean/AuthenticationStatementBean.java
A         src/main/java/org/apache/ws/security/saml/ext/bean/KeyInfoBean.java
A         src/main/java/org/apache/ws/security/saml/ext/bean/AttributeStatementBean.java
A         src/main/java/org/apache/ws/security/saml/ext/builder
A         src/main/java/org/apache/ws/security/saml/ext/builder/SAML1ComponentBuilder.java
A         src/main/java/org/apache/ws/security/saml/ext/builder/SAML2ComponentBuilder.java
A         src/main/java/org/apache/ws/security/saml/ext/builder/SAML1Constants.java
A         src/main/java/org/apache/ws/security/saml/ext/builder/SAML2Constants.java
A         src/main/java/org/apache/ws/security/saml/ext/AssertionWrapper.java
A         src/main/java/org/apache/ws/security/saml/ext/SAMLCallback.java
A         src/main/java/org/apache/ws/security/saml/ext/OpenSAMLBootstrap.java
A         src/main/java/org/apache/ws/security/saml/ext/OpenSAMLUtil.java
AU        src/main/java/org/apache/ws/security/saml/SAMLKeyInfo.java
AU        src/main/java/org/apache/ws/security/saml/WSSecSignatureSAML.java
AU        src/main/java/org/apache/ws/security/saml/SAMLIssuer.java
AU        src/main/java/org/apache/ws/security/saml/SAMLIssuerImpl.java
AU        src/main/java/org/apache/ws/security/saml/SAMLUtil.java
AU        src/main/java/org/apache/ws/security/CustomTokenPrincipal.java
A         src/main/java/org/apache/ws/security/NamePasswordCallbackHandler.java
A         src/main/java/org/apache/ws/security/WSDataRef.java
AU        src/main/java/org/apache/ws/security/WSConstants.java
A         src/main/java/org/apache/ws/security/str
A         src/main/java/org/apache/ws/security/str/DerivedKeyTokenSTRParser.java
A         src/main/java/org/apache/ws/security/str/STRParser.java
A         src/main/java/org/apache/ws/security/str/SignatureSTRParser.java
A         src/main/java/org/apache/ws/security/str/BSPEnforcer.java
A         src/main/java/org/apache/ws/security/str/SecurityTokenRefSTRParser.java
A         src/main/java/org/apache/ws/security/str/EncryptedKeySTRParser.java
AU        src/main/java/org/apache/ws/security/WSPasswordCallback.java
AU        src/main/java/org/apache/ws/security/PublicKeyPrincipal.java
A         src/main/java/org/apache/ws/security/conversation
A         src/main/java/org/apache/ws/security/conversation/dkalgo
AU        src/main/java/org/apache/ws/security/conversation/dkalgo/AlgoFactory.java
AU        src/main/java/org/apache/ws/security/conversation/dkalgo/DerivationAlgorithm.java
AU        src/main/java/org/apache/ws/security/conversation/dkalgo/P_SHA1.java
AU        src/main/java/org/apache/ws/security/conversation/ConversationConstants.java
AU        src/main/java/org/apache/ws/security/conversation/ConversationException.java
AU        src/main/java/org/apache/ws/security/WSEncryptionPart.java
AU        src/main/java/org/apache/ws/security/WSDocInfo.java
A         src/main/java/org/apache/ws/security/transform
A         src/main/java/org/apache/ws/security/transform/STRTransformProvider.java
AU        src/main/java/org/apache/ws/security/transform/STRTransformUtil.java
AU        src/main/java/org/apache/ws/security/transform/STRTransform.java
AU        src/main/java/org/apache/ws/security/WSUsernameTokenPrincipal.java
AU        src/main/java/org/apache/ws/security/WsuIdAllocator.java
A         src/main/java/org/apache/ws/security/action
AU        src/main/java/org/apache/ws/security/action/SignatureAction.java
AU        src/main/java/org/apache/ws/security/action/TimestampAction.java
AU        src/main/java/org/apache/ws/security/action/SAMLTokenSignedAction.java
AU        src/main/java/org/apache/ws/security/action/EncryptionAction.java
AU        src/main/java/org/apache/ws/security/action/SAMLTokenUnsignedAction.java
AU        src/main/java/org/apache/ws/security/action/SignatureConfirmationAction.java
AU        src/main/java/org/apache/ws/security/action/UsernameTokenSignedAction.java
AU        src/main/java/org/apache/ws/security/action/Action.java
AU        src/main/java/org/apache/ws/security/action/UsernameTokenAction.java
A         src/main/java/org/apache/ws/security/handler
AU        src/main/java/org/apache/ws/security/handler/RequestData.java
AU        src/main/java/org/apache/ws/security/handler/WSHandlerConstants.java
AU        src/main/java/org/apache/ws/security/handler/WSHandlerResult.java
AU        src/main/java/org/apache/ws/security/handler/WSHandler.java
A         src/main/java/org/apache/ws/security/util
AU        src/main/java/org/apache/ws/security/util/WSSecurityUtil.java
AU        src/main/java/org/apache/ws/security/util/XMLUtils.java
AU        src/main/java/org/apache/ws/security/util/Base64.java
AU        src/main/java/org/apache/ws/security/util/StringUtil.java
AU        src/main/java/org/apache/ws/security/util/Loader.java
AU        src/main/java/org/apache/ws/security/util/NSStack.java
AU        src/main/java/org/apache/ws/security/util/XmlSchemaDateFormat.java
AU        src/main/java/org/apache/ws/security/util/Mapping.java
AU        src/main/java/org/apache/ws/security/util/UUIDGenerator.java
AU        src/main/java/org/apache/ws/security/util/DOM2Writer.java
A         src/main/resources
A         src/main/resources/org
A         src/main/resources/org/apache
A         src/main/resources/org/apache/ws
A         src/main/resources/org/apache/ws/security
A         src/main/resources/org/apache/ws/security/components
A         src/main/resources/org/apache/ws/security/components/crypto
AU        src/main/resources/org/apache/ws/security/components/crypto/errors.properties
AU        src/main/resources/org/apache/ws/security/errors.properties
A         src/main/resources/org/apache/ws/security/conversation
A         src/main/resources/org/apache/ws/security/conversation/errors.properties
A         src/main/resources/org/apache/ws/security/saml
AU        src/main/resources/org/apache/ws/security/saml/saml.properties
A         src/site
A         src/site/site.xml
A         src/site/xdoc
A         src/site/xdoc/topics.xml
A         src/site/xdoc/wss4j16.xml
A         src/site/xdoc/axis.xml
A         src/site/xdoc/config.xml
A         src/site/xdoc/using.xml
A         src/site/xdoc/download.xml
A         src/site/xdoc/index.xml
A         src/site/xdoc/package.xml
A         pom.xml
A         README.txt
AU        build.xml
 U        .
At revision 1202224
Parsing POMs
[wss4j] $ /home/hudson/tools/java/jdk1.6.0_20-32-unlimited-security/bin/java -cp /home/jenkins/jenkins-slave/maven3-agent.jar:/home/hudson/tools/maven/latest/boot/plexus-classworlds-2.4.jar
org.jvnet.hudson.maven3.agent.Maven3Main /home/hudson/tools/maven/latest /home/jenkins/jenkins-slave/slave.jar
/home/jenkins/jenkins-slave/maven3-interceptor.jar 57372
<===[JENKINS REMOTING CAPACITY]===>channel started
   Executing Maven:  -B -f <https://builds.apache.org/job/wss4j-trunk/ws/wss4j/pom.xml>
clean deploy
[INFO] Scanning for projects...
[INFO]                                                                         
[INFO] ------------------------------------------------------------------------
[INFO] Building WSS4J 1.6.4-SNAPSHOT
[INFO] ------------------------------------------------------------------------
Downloading: http://repository.apache.org/snapshots/org/apache/santuario/xmlsec/1.5.0-SNAPSHOT/maven-metadata.xml
Downloaded: http://repository.apache.org/snapshots/org/apache/santuario/xmlsec/1.5.0-SNAPSHOT/maven-metadata.xml
(988 B at 1.1 KB/sec)
Downloading: http://repository.apache.org/snapshots/org/apache/santuario/xmlsec/1.5.0-SNAPSHOT/xmlsec-1.5.0-20111110.180556-5.pom
Downloaded: http://repository.apache.org/snapshots/org/apache/santuario/xmlsec/1.5.0-SNAPSHOT/xmlsec-1.5.0-20111110.180556-5.pom
(13 KB at 72.8 KB/sec)
Downloading: http://repository.apache.org/snapshots/org/apache/santuario/xmlsec/1.5.0-SNAPSHOT/xmlsec-1.5.0-20111110.180556-5.jar
Downloaded: http://repository.apache.org/snapshots/org/apache/santuario/xmlsec/1.5.0-SNAPSHOT/xmlsec-1.5.0-20111110.180556-5.jar
(582 KB at 1229.2 KB/sec)
[INFO] 
[INFO] --- maven-clean-plugin:2.4.1:clean (default-clean) @ wss4j ---
[INFO] 
[INFO] --- maven-pmd-plugin:2.5:pmd (pmd) @ wss4j ---
[JENKINS] Archiving <https://builds.apache.org/job/wss4j-trunk/ws/wss4j/pom.xml> to
/home/hudson/hudson/jobs/wss4j-trunk/modules/org.apache.ws.security$wss4j/builds/2011-11-15_15-00-42/archive/org.apache.ws.security/wss4j/1.6.4-SNAPSHOT/wss4j-1.6.4-SNAPSHOT.pom
[INFO] [INFO] 

[INFO] --- maven-pmd-plugin:2.5:check (validate) @ wss4j ---
[INFO] 
[INFO] --- maven-remote-resources-plugin:1.0:process (default) @ wss4j ---
[INFO] Setting property: classpath.resource.loader.class => 'org.codehaus.plexus.velocity.ContextClassLoaderResourceLoader'.
[INFO] Setting property: velocimacro.messages.on => 'false'.
[INFO] Setting property: resource.loader => 'classpath'.
[INFO] Setting property: resource.manager.logwhenfound => 'false'.
[INFO] 
[INFO] --- maven-resources-plugin:2.5:resources (default-resources) @ wss4j ---
[debug] execute contextualize
[INFO] Using 'UTF-8' encoding to copy filtered resources.
[INFO] Copying 0 resource
[INFO] Copying 4 resources
[INFO] Copying 3 resources
[INFO] 
[INFO] --- maven-compiler-plugin:2.3.2:compile (default-compile) @ wss4j ---
[INFO] Compiling 146 source files to <https://builds.apache.org/job/wss4j-trunk/ws/wss4j/target/classes>
[INFO] -------------------------------------------------------------
[ERROR] COMPILATION ERROR : 
[INFO] -------------------------------------------------------------
[ERROR] <https://builds.apache.org/job/wss4j-trunk/ws/wss4j/src/main/java/org/apache/ws/security/util/WSSecurityUtil.java>:[768,28]
cannot find symbol
symbol  : method getKeyLengthFromURI(java.lang.String)
location: class org.apache.xml.security.algorithms.JCEMapper
[INFO] 1 error
[INFO] -------------------------------------------------------------
[INFO] ------------------------------------------------------------------------
[INFO] BUILD FAILURE
[INFO] ------------------------------------------------------------------------
[INFO] Total time: 37.886s
[INFO] Finished at: Tue Nov 15 15:01:31 UTC 2011
[INFO] Final Memory: 17M/67M
[INFO] ------------------------------------------------------------------------
Waiting for Jenkins to finish collecting data
mavenExecutionResult exceptions not empty
message : Failed to execute goal org.apache.maven.plugins:maven-compiler-plugin:2.3.2:compile
(default-compile) on project wss4j: Compilation failure
<https://builds.apache.org/job/wss4j-trunk/ws/wss4j/src/main/java/org/apache/ws/security/util/WSSecurityUtil.java>:[768,28]
cannot find symbol
symbol  : method getKeyLengthFromURI(java.lang.String)
location: class org.apache.xml.security.algorithms.JCEMapper

cause : Compilation failure
<https://builds.apache.org/job/wss4j-trunk/ws/wss4j/src/main/java/org/apache/ws/security/util/WSSecurityUtil.java>:[768,28]
cannot find symbol
symbol  : method getKeyLengthFromURI(java.lang.String)
location: class org.apache.xml.security.algorithms.JCEMapper

Stack trace : 
org.apache.maven.lifecycle.LifecycleExecutionException: Failed to execute goal org.apache.maven.plugins:maven-compiler-plugin:2.3.2:compile
(default-compile) on project wss4j: Compilation failure
<https://builds.apache.org/job/wss4j-trunk/ws/wss4j/src/main/java/org/apache/ws/security/util/WSSecurityUtil.java>:[768,28]
cannot find symbol
symbol  : method getKeyLengthFromURI(java.lang.String)
location: class org.apache.xml.security.algorithms.JCEMapper

	at org.apache.maven.lifecycle.internal.MojoExecutor.execute(MojoExecutor.java:213)
	at org.apache.maven.lifecycle.internal.MojoExecutor.execute(MojoExecutor.java:153)
	at org.apache.maven.lifecycle.internal.MojoExecutor.execute(MojoExecutor.java:145)
	at org.apache.maven.lifecycle.internal.LifecycleModuleBuilder.buildProject(LifecycleModuleBuilder.java:84)
	at org.apache.maven.lifecycle.internal.LifecycleModuleBuilder.buildProject(LifecycleModuleBuilder.java:59)
	at org.apache.maven.lifecycle.internal.LifecycleStarter.singleThreadedBuild(LifecycleStarter.java:183)
	at org.apache.maven.lifecycle.internal.LifecycleStarter.execute(LifecycleStarter.java:161)
	at org.apache.maven.DefaultMaven.doExecute(DefaultMaven.java:319)
	at org.apache.maven.DefaultMaven.execute(DefaultMaven.java:156)
	at org.jvnet.hudson.maven3.launcher.Maven3Launcher.main(Maven3Launcher.java:79)
	at sun.reflect.NativeMethodAccessorImpl.invoke0(Native Method)
	at sun.reflect.NativeMethodAccessorImpl.invoke(NativeMethodAccessorImpl.java:39)
	at sun.reflect.DelegatingMethodAccessorImpl.invoke(DelegatingMethodAccessorImpl.java:25)
	at java.lang.reflect.Method.invoke(Method.java:597)
	at org.codehaus.plexus.classworlds.launcher.Launcher.launchStandard(Launcher.java:329)
	at org.codehaus.plexus.classworlds.launcher.Launcher.launch(Launcher.java:239)
	at org.jvnet.hudson.maven3.agent.Maven3Main.launch(Maven3Main.java:158)
	at hudson.maven.Maven3Builder.call(Maven3Builder.java:122)
	at hudson.maven.Maven3Builder.call(Maven3Builder.java:74)
	at hudson.remoting.UserRequest.perform(UserRequest.java:118)
	at hudson.remoting.UserRequest.perform(UserRequest.java:48)
	at hudson.remoting.Request$2.run(Request.java:287)
	at java.util.concurrent.Executors$RunnableAdapter.call(Executors.java:441)
	at java.util.concurrent.FutureTask$Sync.innerRun(FutureTask.java:303)
	at java.util.concurrent.FutureTask.run(FutureTask.java:138)
	at java.util.concurrent.ThreadPoolExecutor$Worker.runTask(ThreadPoolExecutor.java:886)
	at java.util.concurrent.ThreadPoolExecutor$Worker.run(ThreadPoolExecutor.java:908)
	at java.lang.Thread.run(Thread.java:619)
Caused by: org.apache.maven.plugin.CompilationFailureException: Compilation failure
<https://builds.apache.org/job/wss4j-trunk/ws/wss4j/src/main/java/org/apache/ws/security/util/WSSecurityUtil.java>:[768,28]
cannot find symbol
symbol  : method getKeyLengthFromURI(java.lang.String)
location: class org.apache.xml.security.algorithms.JCEMapper

	at org.apache.maven.plugin.AbstractCompilerMojo.execute(AbstractCompilerMojo.java:656)
	at org.apache.maven.plugin.CompilerMojo.execute(CompilerMojo.java:128)
	at org.apache.maven.plugin.DefaultBuildPluginManager.executeMojo(DefaultBuildPluginManager.java:101)
	at org.apache.maven.lifecycle.internal.MojoExecutor.execute(MojoExecutor.java:209)
	... 27 more
Sending e-mails to: dev@ws.apache.org coheigea@apache.org
channel stopped


---------------------------------------------------------------------
To unsubscribe, e-mail: dev-unsubscribe@ws.apache.org
For additional commands, e-mail: dev-help@ws.apache.org


Mime
View raw message