ws-dev mailing list archives

Site index · List index
Message view « Date » · « Thread »
Top « Date » · « Thread »
From Apache Jenkins Server <jenk...@builds.apache.org>
Subject Build failed in Jenkins: ws-axiom-trunk » Axiom Implementation Test Suite #713
Date Thu, 24 Nov 2011 02:02:32 GMT
See <https://builds.apache.org/job/ws-axiom-trunk/org.apache.ws.commons.axiom$axiom-testsuite/713/>

------------------------------------------
[INFO] ------------------------------------------------------------------------
[INFO] Building Axiom Implementation Test Suite
[INFO]    task-segment: [clean, deploy, site]
[INFO] ------------------------------------------------------------------------
[INFO] [clean:clean {execution: default-clean}]
[INFO] Deleting <https://builds.apache.org/job/ws-axiom-trunk/org.apache.ws.commons.axiom$axiom-testsuite/ws/target>
[INFO] [remote-resources:process {execution: default}]
[INFO] snapshot org.apache.ws.commons.axiom:axiom-api:1.2.13-SNAPSHOT: checking for updates
from apache.snapshots
[INFO] [resources:resources {execution: default-resources}]
[INFO] Using 'UTF-8' encoding to copy filtered resources.
[INFO] Copying 15 resources
[INFO] Copying 3 resources
[INFO] [compiler:compile {execution: default-compile}]
[INFO] Compiling 323 source files to <https://builds.apache.org/job/ws-axiom-trunk/org.apache.ws.commons.axiom$axiom-testsuite/ws/target/classes>
[JENKINS] Archiving <https://builds.apache.org/job/ws-axiom-trunk/org.apache.ws.commons.axiom$axiom-testsuite/ws/pom.xml>
to /home/hudson/hudson/jobs/ws-axiom-trunk/modules/org.apache.ws.commons.axiom$axiom-testsuite/builds/2011-11-24_01-57-52/archive/org.apache.ws.commons.axiom/axiom-testsuite/1.2.13-SNAPSHOT/axiom-testsuite-1.2.13-SNAPSHOT.pom
[INFO] -------------------------------------------------------------
[ERROR] COMPILATION ERROR : 
[INFO] -------------------------------------------------------------
[ERROR] <https://builds.apache.org/job/ws-axiom-trunk/org.apache.ws.commons.axiom$axiom-testsuite/ws/src/main/java/org/apache/axiom/ts/OMTestSuiteBuilder.java>:[282,61]
cannot find symbol
symbol  : class TestGetNamespaceNormalized2
location: package org.apache.axiom.ts.om.sourcedelement
[INFO] 1 error
[INFO] -------------------------------------------------------------
[INFO] ------------------------------------------------------------------------
[ERROR] BUILD FAILURE
[INFO] ------------------------------------------------------------------------
[INFO] Compilation failure
<https://builds.apache.org/job/ws-axiom-trunk/org.apache.ws.commons.axiom$axiom-testsuite/ws/src/main/java/org/apache/axiom/ts/OMTestSuiteBuilder.java>:[282,61]
cannot find symbol
symbol  : class TestGetNamespaceNormalized2
location: package org.apache.axiom.ts.om.sourcedelement

[INFO] ------------------------------------------------------------------------
[INFO] For more information, run Maven with the -e switch
[INFO] ------------------------------------------------------------------------
[INFO] Total time: 4 minutes 26 seconds
[INFO] Finished at: Thu Nov 24 02:02:31 GMT 2011


---------------------------------------------------------------------
To unsubscribe, e-mail: dev-unsubscribe@ws.apache.org
For additional commands, e-mail: dev-help@ws.apache.org


Mime
View raw message