ws-dev mailing list archives

Site index · List index
Message view « Date » · « Thread »
Top « Date » · « Thread »
From Apache Jenkins Server <jenk...@builds.apache.org>
Subject Build failed in Jenkins: ws-axiom-trunk #703
Date Tue, 22 Nov 2011 09:35:32 GMT
See <https://builds.apache.org/job/ws-axiom-trunk/703/>

------------------------------------------
[...truncated 195 lines...]
[INFO] META-INF/NOTICE already added, skipping
[INFO] [shade:shade {execution: default}]
[INFO] Including org.apache.maven.plugins:maven-shade-plugin:jar:1.4 in the shaded jar.
[INFO] Excluding org.apache.maven:maven-plugin-api:jar:2.0.6 from the shaded jar.
[INFO] Excluding org.apache.maven:maven-model:jar:2.0.6 from the shaded jar.
[INFO] Excluding org.codehaus.plexus:plexus-utils:jar:1.5.5 from the shaded jar.
[INFO] Excluding org.apache.maven:maven-project:jar:2.0.6 from the shaded jar.
[INFO] Excluding org.apache.maven:maven-settings:jar:2.0.6 from the shaded jar.
[INFO] Excluding org.codehaus.plexus:plexus-container-default:jar:1.0-alpha-9-stable-1 from
the shaded jar.
[INFO] Excluding junit:junit:jar:4.9 from the shaded jar.
[INFO] Excluding org.hamcrest:hamcrest-core:jar:1.1 from the shaded jar.
[INFO] Excluding classworlds:classworlds:jar:1.1-alpha-2 from the shaded jar.
[INFO] Excluding org.apache.maven:maven-profile:jar:2.0.6 from the shaded jar.
[INFO] Excluding org.apache.maven:maven-artifact-manager:jar:2.0.6 from the shaded jar.
[INFO] Excluding org.apache.maven:maven-repository-metadata:jar:2.0.6 from the shaded jar.
[INFO] Excluding org.apache.maven:maven-artifact:jar:2.0.6 from the shaded jar.
[INFO] Excluding org.apache.maven.wagon:wagon-provider-api:jar:1.0-beta-2 from the shaded
jar.
[INFO] Excluding org.apache.maven:maven-plugin-registry:jar:2.0.6 from the shaded jar.
[INFO] Excluding asm:asm:jar:3.2 from the shaded jar.
[INFO] Excluding asm:asm-commons:jar:3.2 from the shaded jar.
[INFO] Excluding asm:asm-tree:jar:3.2 from the shaded jar.
[INFO] Excluding org.jdom:jdom:jar:1.1 from the shaded jar.
[INFO] Excluding org.apache.maven.shared:maven-dependency-tree:jar:1.1 from the shaded jar.
[INFO] Excluding org.vafer:jdependency:jar:0.6 from the shaded jar.
[INFO] Excluding org.apache.commons:commons-io:jar:1.3.2 from the shaded jar.
[INFO] Excluding asm:asm-analysis:jar:3.2 from the shaded jar.
[INFO] Excluding asm:asm-util:jar:3.2 from the shaded jar.
[INFO] Replacing original artifact with shaded artifact.
[INFO] Replacing <https://builds.apache.org/job/ws-axiom-trunk/ws/axiom/modules/shade-plugin-patched/target/shade-plugin-patched-1.2.13-SNAPSHOT.jar>
with <https://builds.apache.org/job/ws-axiom-trunk/ws/axiom/modules/shade-plugin-patched/target/shade-plugin-patched-1.2.13-SNAPSHOT-shaded.jar>
[INFO] [apache-rat:check {execution: default}]
[INFO] Exclude: src/test/resources/**
[INFO] Exclude: dependency-reduced-pom.xml
[INFO] [install:install {execution: default-install}]
[INFO] Installing <https://builds.apache.org/job/ws-axiom-trunk/ws/axiom/modules/shade-plugin-patched/target/shade-plugin-patched-1.2.13-SNAPSHOT.jar>
to <https://builds.apache.org/job/ws-axiom-trunk/ws/.repository/org/apache/ws/commons/axiom/shade-plugin-patched/1.2.13-SNAPSHOT/shade-plugin-patched-1.2.13-SNAPSHOT.jar>
[INFO] Installing <https://builds.apache.org/job/ws-axiom-trunk/ws/axiom/modules/shade-plugin-patched/target/shade-plugin-patched-1.2.13-SNAPSHOT-sources.jar>
to <https://builds.apache.org/job/ws-axiom-trunk/ws/.repository/org/apache/ws/commons/axiom/shade-plugin-patched/1.2.13-SNAPSHOT/shade-plugin-patched-1.2.13-SNAPSHOT-sources.jar>
[INFO] [deploy:deploy {execution: default-deploy}]
[INFO] Retrieving previous build number from apache.snapshots.https
Uploading: https://repository.apache.org/content/repositories/snapshots/org/apache/ws/commons/axiom/shade-plugin-patched/1.2.13-SNAPSHOT/shade-plugin-patched-1.2.13-20111122.093437-113.jar
85K uploaded  (shade-plugin-patched-1.2.13-20111122.093437-113.jar)
[INFO] Retrieving previous metadata from apache.snapshots.https
[INFO] Uploading repository metadata for: 'org.apache.ws.commons.axiom'
[INFO] Retrieving previous metadata from apache.snapshots.https
[INFO] Uploading repository metadata for: 'snapshot org.apache.ws.commons.axiom:shade-plugin-patched:1.2.13-SNAPSHOT'
[INFO] Uploading project information for shade-plugin-patched 1.2.13-20111122.093437-113
[INFO] Retrieving previous metadata from apache.snapshots.https
[INFO] Uploading repository metadata for: 'artifact org.apache.ws.commons.axiom:shade-plugin-patched'
[INFO] Retrieving previous build number from apache.snapshots.https
Uploading: https://repository.apache.org/content/repositories/snapshots/org/apache/ws/commons/axiom/shade-plugin-patched/1.2.13-SNAPSHOT/shade-plugin-patched-1.2.13-20111122.093437-113-sources.jar
9K uploaded  (shade-plugin-patched-1.2.13-20111122.093437-113-sources.jar)
[INFO] [site:site {execution: default-site}]
[INFO] Parent project loaded from repository: org.apache:apache:pom:9
[JENKINS] Archiving site from <https://builds.apache.org/job/ws-axiom-trunk/ws/axiom/modules/shade-plugin-patched/target/site>
to /home/hudson/hudson/jobs/ws-axiom-trunk/site/shade-plugin-patched
[JENKINS] Archiving <https://builds.apache.org/job/ws-axiom-trunk/ws/axiom/modules/shade-plugin-patched/dependency-reduced-pom.xml>
to /home/hudson/hudson/jobs/ws-axiom-trunk/modules/org.apache.ws.commons.axiom$shade-plugin-patched/builds/2011-11-22_09-33-59/archive/org.apache.ws.commons.axiom/shade-plugin-patched/1.2.13-SNAPSHOT/shade-plugin-patched-1.2.13-SNAPSHOT.pom
[JENKINS] Archiving <https://builds.apache.org/job/ws-axiom-trunk/ws/axiom/modules/shade-plugin-patched/target/shade-plugin-patched-1.2.13-SNAPSHOT.jar>
to /home/hudson/hudson/jobs/ws-axiom-trunk/modules/org.apache.ws.commons.axiom$shade-plugin-patched/builds/2011-11-22_09-33-59/archive/org.apache.ws.commons.axiom/shade-plugin-patched/1.2.13-20111122.093437-113/shade-plugin-patched-1.2.13-20111122.093437-113.jar
[JENKINS] Archiving <https://builds.apache.org/job/ws-axiom-trunk/ws/axiom/modules/shade-plugin-patched/target/shade-plugin-patched-1.2.13-SNAPSHOT-sources.jar>
to /home/hudson/hudson/jobs/ws-axiom-trunk/modules/org.apache.ws.commons.axiom$shade-plugin-patched/builds/2011-11-22_09-33-59/archive/org.apache.ws.commons.axiom/shade-plugin-patched/1.2.13-20111122.093437-113/shade-plugin-patched-1.2.13-20111122.093437-113-sources.jar
[INFO] ------------------------------------------------------------------------
[INFO] Building Axiom Test Utilities
[INFO]    task-segment: [clean, deploy, site]
[INFO] ------------------------------------------------------------------------
[INFO] [clean:clean {execution: default-clean}]
[INFO] Deleting <https://builds.apache.org/job/ws-axiom-trunk/ws/axiom/modules/axiom-testutils/target>
[INFO] [remote-resources:process {execution: default}]
[INFO] [resources:resources {execution: default-resources}]
[INFO] Using 'UTF-8' encoding to copy filtered resources.
[INFO] skip non existing resourceDirectory <https://builds.apache.org/job/ws-axiom-trunk/ws/axiom/modules/axiom-testutils/src/main/resources>
[INFO] Copying 3 resources
[INFO] [compiler:compile {execution: default-compile}]
[INFO] Compiling 17 source files to <https://builds.apache.org/job/ws-axiom-trunk/ws/axiom/modules/axiom-testutils/target/classes>
[INFO] [resources:testResources {execution: default-testResources}]
[INFO] Using 'UTF-8' encoding to copy filtered resources.
[INFO] skip non existing resourceDirectory <https://builds.apache.org/job/ws-axiom-trunk/ws/axiom/modules/axiom-testutils/src/test/resources>
[INFO] Copying 3 resources
[INFO] [compiler:testCompile {execution: default-testCompile}]
[INFO] No sources to compile
[WARNING] DEPRECATED [systemProperties]: Use systemPropertyVariables instead.
[INFO] [surefire:test {execution: default-test}]
[INFO] Surefire report directory: <https://builds.apache.org/job/ws-axiom-trunk/ws/axiom/modules/axiom-testutils/target/surefire-reports>

-------------------------------------------------------
 T E S T S
-------------------------------------------------------

Results :

Tests run: 0, Failures: 0, Errors: 0, Skipped: 0

[JENKINS] Recording test results
[INFO] [jar:jar {execution: default-jar}]
[INFO] Building jar: <https://builds.apache.org/job/ws-axiom-trunk/ws/axiom/modules/axiom-testutils/target/axiom-testutils-1.2.13-SNAPSHOT.jar>
[INFO] Preparing source:jar
[WARNING] Removing: jar from forked lifecycle, to prevent recursive invocation.
[INFO] No goals needed for project - skipping
[INFO] [source:jar {execution: attach-sources}]
[INFO] META-INF already added, skipping
[INFO] META-INF/LICENSE already added, skipping
[INFO] META-INF/DEPENDENCIES already added, skipping
[INFO] META-INF/NOTICE already added, skipping
[INFO] Building jar: <https://builds.apache.org/job/ws-axiom-trunk/ws/axiom/modules/axiom-testutils/target/axiom-testutils-1.2.13-SNAPSHOT-sources.jar>
[INFO] META-INF already added, skipping
[INFO] META-INF/LICENSE already added, skipping
[INFO] META-INF/DEPENDENCIES already added, skipping
[INFO] META-INF/NOTICE already added, skipping
[INFO] [apache-rat:check {execution: default}]
[INFO] Exclude: src/test/resources/**
[INFO] Exclude: dependency-reduced-pom.xml
[INFO] [install:install {execution: default-install}]
[INFO] Installing <https://builds.apache.org/job/ws-axiom-trunk/ws/axiom/modules/axiom-testutils/target/axiom-testutils-1.2.13-SNAPSHOT.jar>
to <https://builds.apache.org/job/ws-axiom-trunk/ws/.repository/org/apache/ws/commons/axiom/axiom-testutils/1.2.13-SNAPSHOT/axiom-testutils-1.2.13-SNAPSHOT.jar>
[INFO] Installing <https://builds.apache.org/job/ws-axiom-trunk/ws/axiom/modules/axiom-testutils/target/axiom-testutils-1.2.13-SNAPSHOT-sources.jar>
to <https://builds.apache.org/job/ws-axiom-trunk/ws/.repository/org/apache/ws/commons/axiom/axiom-testutils/1.2.13-SNAPSHOT/axiom-testutils-1.2.13-SNAPSHOT-sources.jar>
[INFO] [deploy:deploy {execution: default-deploy}]
[INFO] Retrieving previous build number from apache.snapshots.https
Uploading: https://repository.apache.org/content/repositories/snapshots/org/apache/ws/commons/axiom/axiom-testutils/1.2.13-SNAPSHOT/axiom-testutils-1.2.13-20111122.093437-277.jar
30K uploaded  (axiom-testutils-1.2.13-20111122.093437-277.jar)
[INFO] Retrieving previous metadata from apache.snapshots.https
[INFO] Uploading repository metadata for: 'artifact org.apache.ws.commons.axiom:axiom-testutils'
[INFO] Uploading project information for axiom-testutils 1.2.13-20111122.093437-277
[INFO] Retrieving previous metadata from apache.snapshots.https
[INFO] Uploading repository metadata for: 'snapshot org.apache.ws.commons.axiom:axiom-testutils:1.2.13-SNAPSHOT'
[INFO] Retrieving previous build number from apache.snapshots.https
Uploading: https://repository.apache.org/content/repositories/snapshots/org/apache/ws/commons/axiom/axiom-testutils/1.2.13-SNAPSHOT/axiom-testutils-1.2.13-20111122.093437-277-sources.jar
26K uploaded  (axiom-testutils-1.2.13-20111122.093437-277-sources.jar)
[INFO] [site:site {execution: default-site}]
[INFO] Parent project loaded from repository: org.apache:apache:pom:9
[JENKINS] Archiving site from <https://builds.apache.org/job/ws-axiom-trunk/ws/axiom/modules/axiom-testutils/target/site>
to /home/hudson/hudson/jobs/ws-axiom-trunk/site/axiom-testutils
[JENKINS] Archiving <https://builds.apache.org/job/ws-axiom-trunk/ws/axiom/modules/axiom-testutils/pom.xml>
to /home/hudson/hudson/jobs/ws-axiom-trunk/modules/org.apache.ws.commons.axiom$axiom-testutils/builds/2011-11-22_09-33-59/archive/org.apache.ws.commons.axiom/axiom-testutils/1.2.13-SNAPSHOT/axiom-testutils-1.2.13-SNAPSHOT.pom
[JENKINS] Archiving <https://builds.apache.org/job/ws-axiom-trunk/ws/axiom/modules/axiom-testutils/target/axiom-testutils-1.2.13-SNAPSHOT.jar>
to /home/hudson/hudson/jobs/ws-axiom-trunk/modules/org.apache.ws.commons.axiom$axiom-testutils/builds/2011-11-22_09-33-59/archive/org.apache.ws.commons.axiom/axiom-testutils/1.2.13-20111122.093437-277/axiom-testutils-1.2.13-20111122.093437-277.jar
[JENKINS] Archiving <https://builds.apache.org/job/ws-axiom-trunk/ws/axiom/modules/axiom-testutils/target/axiom-testutils-1.2.13-SNAPSHOT-sources.jar>
to /home/hudson/hudson/jobs/ws-axiom-trunk/modules/org.apache.ws.commons.axiom$axiom-testutils/builds/2011-11-22_09-33-59/archive/org.apache.ws.commons.axiom/axiom-testutils/1.2.13-20111122.093437-277/axiom-testutils-1.2.13-20111122.093437-277-sources.jar
[INFO] ------------------------------------------------------------------------
[INFO] Building Axiom Jaxen Test Suite
[INFO]    task-segment: [clean, deploy, site]
[INFO] ------------------------------------------------------------------------
[INFO] [clean:clean {execution: default-clean}]
[INFO] Deleting <https://builds.apache.org/job/ws-axiom-trunk/ws/axiom/modules/axiom-jaxen-testsuite/target>
[INFO] [remote-resources:process {execution: default}]
[INFO] [resources:resources {execution: default-resources}]
[INFO] Using 'UTF-8' encoding to copy filtered resources.
[INFO] Copying 30 resources
[INFO] Copying 3 resources
[INFO] [compiler:compile {execution: default-compile}]
[INFO] Compiling 4 source files to <https://builds.apache.org/job/ws-axiom-trunk/ws/axiom/modules/axiom-jaxen-testsuite/target/classes>
[INFO] [resources:testResources {execution: default-testResources}]
[INFO] Using 'UTF-8' encoding to copy filtered resources.
[INFO] skip non existing resourceDirectory <https://builds.apache.org/job/ws-axiom-trunk/ws/axiom/modules/axiom-jaxen-testsuite/src/test/resources>
[INFO] Copying 3 resources
[INFO] [compiler:testCompile {execution: default-testCompile}]
[INFO] No sources to compile
[WARNING] DEPRECATED [systemProperties]: Use systemPropertyVariables instead.
[INFO] [surefire:test {execution: default-test}]
[INFO] Surefire report directory: <https://builds.apache.org/job/ws-axiom-trunk/ws/axiom/modules/axiom-jaxen-testsuite/target/surefire-reports>

-------------------------------------------------------
 T E S T S
-------------------------------------------------------

Results :

Tests run: 0, Failures: 0, Errors: 0, Skipped: 0

[JENKINS] Recording test results
[INFO] [jar:jar {execution: default-jar}]
[INFO] Building jar: <https://builds.apache.org/job/ws-axiom-trunk/ws/axiom/modules/axiom-jaxen-testsuite/target/axiom-jaxen-testsuite-1.2.13-SNAPSHOT.jar>
[INFO] Preparing source:jar
[WARNING] Removing: jar from forked lifecycle, to prevent recursive invocation.
[INFO] No goals needed for project - skipping
[INFO] [source:jar {execution: attach-sources}]
[INFO] META-INF already added, skipping
[INFO] META-INF already added, skipping
[INFO] META-INF/LICENSE already added, skipping
[INFO] META-INF/DEPENDENCIES already added, skipping
[INFO] META-INF/NOTICE already added, skipping
[INFO] Building jar: <https://builds.apache.org/job/ws-axiom-trunk/ws/axiom/modules/axiom-jaxen-testsuite/target/axiom-jaxen-testsuite-1.2.13-SNAPSHOT-sources.jar>
[INFO] META-INF already added, skipping
[INFO] META-INF already added, skipping
[INFO] META-INF/LICENSE already added, skipping
[INFO] META-INF/DEPENDENCIES already added, skipping
[INFO] META-INF/NOTICE already added, skipping
[INFO] [apache-rat:check {execution: default}]
[INFO] Exclude: src/main/resources/xml/**
[INFO] Exclude: src/main/java/org/jaxen/test/**
[INFO] Exclude: src/main/resources/META-INF/LICENSE-JAXEN
[INFO] [install:install {execution: default-install}]
[INFO] Installing <https://builds.apache.org/job/ws-axiom-trunk/ws/axiom/modules/axiom-jaxen-testsuite/target/axiom-jaxen-testsuite-1.2.13-SNAPSHOT.jar>
to <https://builds.apache.org/job/ws-axiom-trunk/ws/.repository/org/apache/ws/commons/axiom/axiom-jaxen-testsuite/1.2.13-SNAPSHOT/axiom-jaxen-testsuite-1.2.13-SNAPSHOT.jar>
[INFO] Installing <https://builds.apache.org/job/ws-axiom-trunk/ws/axiom/modules/axiom-jaxen-testsuite/target/axiom-jaxen-testsuite-1.2.13-SNAPSHOT-sources.jar>
to <https://builds.apache.org/job/ws-axiom-trunk/ws/.repository/org/apache/ws/commons/axiom/axiom-jaxen-testsuite/1.2.13-SNAPSHOT/axiom-jaxen-testsuite-1.2.13-SNAPSHOT-sources.jar>
[INFO] [deploy:deploy {execution: default-deploy}]
[INFO] Retrieving previous build number from apache.snapshots.https
Uploading: https://repository.apache.org/content/repositories/snapshots/org/apache/ws/commons/axiom/axiom-jaxen-testsuite/1.2.13-SNAPSHOT/axiom-jaxen-testsuite-1.2.13-20111122.093437-277.jar
100K uploaded  (axiom-jaxen-testsuite-1.2.13-20111122.093437-277.jar)
[INFO] Retrieving previous metadata from apache.snapshots.https
[INFO] Uploading repository metadata for: 'artifact org.apache.ws.commons.axiom:axiom-jaxen-testsuite'
[INFO] Retrieving previous metadata from apache.snapshots.https
[INFO] Uploading repository metadata for: 'snapshot org.apache.ws.commons.axiom:axiom-jaxen-testsuite:1.2.13-SNAPSHOT'
[INFO] Uploading project information for axiom-jaxen-testsuite 1.2.13-20111122.093437-277
[INFO] Retrieving previous build number from apache.snapshots.https
Uploading: https://repository.apache.org/content/repositories/snapshots/org/apache/ws/commons/axiom/axiom-jaxen-testsuite/1.2.13-SNAPSHOT/axiom-jaxen-testsuite-1.2.13-20111122.093437-277-sources.jar
89K uploaded  (axiom-jaxen-testsuite-1.2.13-20111122.093437-277-sources.jar)
[INFO] [site:site {execution: default-site}]
[INFO] Parent project loaded from repository: org.apache:apache:pom:9
[JENKINS] Archiving site from <https://builds.apache.org/job/ws-axiom-trunk/ws/axiom/modules/axiom-jaxen-testsuite/target/site>
to /home/hudson/hudson/jobs/ws-axiom-trunk/site/axiom-jaxen-testsuite
[JENKINS] Archiving <https://builds.apache.org/job/ws-axiom-trunk/ws/axiom/modules/axiom-jaxen-testsuite/pom.xml>
to /home/hudson/hudson/jobs/ws-axiom-trunk/modules/org.apache.ws.commons.axiom$axiom-jaxen-testsuite/builds/2011-11-22_09-33-59/archive/org.apache.ws.commons.axiom/axiom-jaxen-testsuite/1.2.13-SNAPSHOT/axiom-jaxen-testsuite-1.2.13-SNAPSHOT.pom
[JENKINS] Archiving <https://builds.apache.org/job/ws-axiom-trunk/ws/axiom/modules/axiom-jaxen-testsuite/target/axiom-jaxen-testsuite-1.2.13-SNAPSHOT.jar>
to /home/hudson/hudson/jobs/ws-axiom-trunk/modules/org.apache.ws.commons.axiom$axiom-jaxen-testsuite/builds/2011-11-22_09-33-59/archive/org.apache.ws.commons.axiom/axiom-jaxen-testsuite/1.2.13-20111122.093437-277/axiom-jaxen-testsuite-1.2.13-20111122.093437-277.jar
[JENKINS] Archiving <https://builds.apache.org/job/ws-axiom-trunk/ws/axiom/modules/axiom-jaxen-testsuite/target/axiom-jaxen-testsuite-1.2.13-SNAPSHOT-sources.jar>
to /home/hudson/hudson/jobs/ws-axiom-trunk/modules/org.apache.ws.commons.axiom$axiom-jaxen-testsuite/builds/2011-11-22_09-33-59/archive/org.apache.ws.commons.axiom/axiom-jaxen-testsuite/1.2.13-20111122.093437-277/axiom-jaxen-testsuite-1.2.13-20111122.093437-277-sources.jar
[INFO] ------------------------------------------------------------------------
[INFO] Building Axiom API
[INFO]    task-segment: [clean, deploy, site]
[INFO] ------------------------------------------------------------------------
[INFO] [clean:clean {execution: default-clean}]
[INFO] Deleting <https://builds.apache.org/job/ws-axiom-trunk/ws/axiom/modules/axiom-api/target>
[INFO] [remote-resources:process {execution: default}]
[INFO] snapshot org.apache.james:apache-mime4j-core:0.8-SNAPSHOT: checking for updates from
apache.snapshots
Downloading: http://repository.apache.org/snapshots/org/apache/james/apache-mime4j-core/0.8-SNAPSHOT/apache-mime4j-core-0.8-20111122.093109-99.pom
2K downloaded  (apache-mime4j-core-0.8-20111122.093109-99.pom)
[INFO] snapshot org.apache.james:apache-mime4j-project:0.8-SNAPSHOT: checking for updates
from apache.snapshots
Downloading: http://repository.apache.org/snapshots/org/apache/james/apache-mime4j-project/0.8-SNAPSHOT/apache-mime4j-project-0.8-20111122.093048-125.pom
9K downloaded  (apache-mime4j-project-0.8-20111122.093048-125.pom)
Downloading: http://repo1.maven.org/maven2/org/apache/james/james-project/1.8/james-project-1.8.pom

Downloading: http://repository.apache.org/snapshots/org/apache/james/apache-mime4j-core/0.8-SNAPSHOT/apache-mime4j-core-0.8-20111122.093109-99.jar
97K downloaded  (apache-mime4j-core-0.8-20111122.093109-99.jar)
[INFO] [resources:resources {execution: default-resources}]
[INFO] Using 'UTF-8' encoding to copy filtered resources.
[INFO] Copying 0 resource
[INFO] Copying 3 resources
[INFO] [compiler:compile {execution: default-compile}]
[INFO] Compiling 283 source files to <https://builds.apache.org/job/ws-axiom-trunk/ws/axiom/modules/axiom-api/target/classes>
[INFO] -------------------------------------------------------------
[ERROR] COMPILATION ERROR : 
[INFO] -------------------------------------------------------------
[ERROR] <https://builds.apache.org/job/ws-axiom-trunk/ws/axiom/modules/axiom-api/src/main/java/org/apache/axiom/attachments/PartImpl.java>:[27,-1]
cannot access org.apache.james.mime4j.MimeException
bad class file: <https://builds.apache.org/job/ws-axiom-trunk/ws/.repository/org/apache/james/apache-mime4j-core/0.8-SNAPSHOT/apache-mime4j-core-0.8-SNAPSHOT.jar(org/apache/james/mime4j/MimeException.class)>
class file has wrong version 50.0, should be 49.0
[INFO] 1 error
[INFO] -------------------------------------------------------------
[JENKINS] Archiving <https://builds.apache.org/job/ws-axiom-trunk/ws/axiom/modules/axiom-api/pom.xml>
to /home/hudson/hudson/jobs/ws-axiom-trunk/modules/org.apache.ws.commons.axiom$axiom-api/builds/2011-11-22_09-33-59/archive/org.apache.ws.commons.axiom/axiom-api/1.2.13-SNAPSHOT/axiom-api-1.2.13-SNAPSHOT.pom
[INFO] ------------------------------------------------------------------------
[ERROR] BUILD FAILURE
[INFO] ------------------------------------------------------------------------
[INFO] Compilation failure
<https://builds.apache.org/job/ws-axiom-trunk/ws/axiom/modules/axiom-api/src/main/java/org/apache/axiom/attachments/PartImpl.java>:[27,-1]
cannot access org.apache.james.mime4j.MimeException
bad class file: <https://builds.apache.org/job/ws-axiom-trunk/ws/.repository/org/apache/james/apache-mime4j-core/0.8-SNAPSHOT/apache-mime4j-core-0.8-SNAPSHOT.jar(org/apache/james/mime4j/MimeException.class)>
class file has wrong version 50.0, should be 49.0

[INFO] ------------------------------------------------------------------------
[INFO] For more information, run Maven with the -e switch
[INFO] ------------------------------------------------------------------------
[INFO] Total time: 1 minute 2 seconds
[INFO] Finished at: Tue Nov 22 09:35:29 UTC 2011
[INFO] Final Memory: 74M/208M
[INFO] ------------------------------------------------------------------------
Sending e-mails to: dev@ws.apache.org
channel stopped


---------------------------------------------------------------------
To unsubscribe, e-mail: dev-unsubscribe@ws.apache.org
For additional commands, e-mail: dev-help@ws.apache.org


Mime
View raw message