ws-dev mailing list archives

Site index · List index
Message view « Date » · « Thread »
Top « Date » · « Thread »
From Apache Jenkins Server <jenk...@builds.apache.org>
Subject Build failed in Jenkins: woden-trunk #589
Date Sun, 11 Mar 2012 13:05:46 GMT
See <https://builds.apache.org/job/woden-trunk/589/changes>

Changes:

[veithen] Fixed an incorrect iterator usage. Woden was assuming that Iterator#next() returns
null if there are no more items. This however is incorrect and the code only worked because
of a bug in Axiom.

------------------------------------------
[...truncated 589 lines...]
Downloaded: http://repository.apache.org/snapshots/org/apache/ws/commons/axiom/axiom-impl/1.2.13-SNAPSHOT/maven-metadata.xml
(376 B at 3.7 KB/sec)
Downloading: http://repository.apache.org/snapshots/org/apache/ws/commons/axiom/axiom-impl/1.2.13-SNAPSHOT/axiom-impl-1.2.13-20120311.101739-388.pom
Downloaded: http://repository.apache.org/snapshots/org/apache/ws/commons/axiom/axiom-impl/1.2.13-SNAPSHOT/axiom-impl-1.2.13-20120311.101739-388.pom
(8 KB at 81.7 KB/sec)
Downloading: http://repository.apache.org/snapshots/org/apache/woden/woden-impl-om/1.0-SNAPSHOT/woden-impl-om-1.0-20120311.010538-390.jar
Downloading: http://repository.apache.org/snapshots/org/apache/ws/commons/axiom/axiom-api/1.2.13-SNAPSHOT/axiom-api-1.2.13-20120311.101739-390.jar
Downloading: http://repository.apache.org/snapshots/org/apache/ws/commons/axiom/axiom-impl/1.2.13-SNAPSHOT/axiom-impl-1.2.13-20120311.101739-388.jar
Downloaded: http://repository.apache.org/snapshots/org/apache/woden/woden-impl-om/1.0-SNAPSHOT/woden-impl-om-1.0-20120311.010538-390.jar
(38 KB at 136.5 KB/sec)
Downloaded: http://repository.apache.org/snapshots/org/apache/ws/commons/axiom/axiom-impl/1.2.13-SNAPSHOT/axiom-impl-1.2.13-20120311.101739-388.jar
(155 KB at 514.9 KB/sec)
Downloaded: http://repository.apache.org/snapshots/org/apache/ws/commons/axiom/axiom-api/1.2.13-SNAPSHOT/axiom-api-1.2.13-20120311.101739-390.jar
(411 KB at 937.9 KB/sec)
[INFO] 
[INFO] --- maven-remote-resources-plugin:1.1:process (default) @ woden-tests-impl-om ---
[INFO] Setting property: classpath.resource.loader.class => 'org.codehaus.plexus.velocity.ContextClassLoaderResourceLoader'.
[INFO] Setting property: velocimacro.messages.on => 'false'.
[INFO] Setting property: resource.loader => 'classpath'.
[INFO] Setting property: resource.manager.logwhenfound => 'false'.
[INFO] 
[INFO] --- maven-resources-plugin:2.4:resources (default-resources) @ woden-tests-impl-om
---
[INFO] Using 'UTF-8' encoding to copy filtered resources.
[INFO] Copying 1 resource
[INFO] Copying 3 resources
[INFO] 
[INFO] --- maven-compiler-plugin:2.0.2:compile (default-compile) @ woden-tests-impl-om ---
[INFO] No sources to compile
[INFO] 
[INFO] --- maven-resources-plugin:2.4:testResources (default-testResources) @ woden-tests-impl-om
---
[INFO] Using 'UTF-8' encoding to copy filtered resources.
[INFO] Copying 29 resources
[INFO] Copying 3 resources
[INFO] 
[INFO] --- maven-compiler-plugin:2.0.2:testCompile (default-testCompile) @ woden-tests-impl-om
---
[INFO] Compiling 71 source files to <https://builds.apache.org/job/woden-trunk/ws/woden/woden-tests/target/om/test-classes>
[INFO] 
[INFO] --- maven-surefire-plugin:2.4.3:test (default-test) @ woden-tests-impl-om ---
[INFO] Surefire report directory: <https://builds.apache.org/job/woden-trunk/ws/woden/woden-tests/target/om/surefire-reports>

-------------------------------------------------------
 T E S T S
-------------------------------------------------------
Running org.apache.woden.wsdl20.xml.InterfaceFaultElementTest
Tests run: 3, Failures: 0, Errors: 0, Skipped: 0, Time elapsed: 0.257 sec
Running org.apache.woden.wsdl20.ElementDeclarationTest
Tests run: 4, Failures: 0, Errors: 0, Skipped: 0, Time elapsed: 0.008 sec
Running org.apache.woden.wsdl20.xml.ChildElementCreationTest
Tests run: 9, Failures: 0, Errors: 0, Skipped: 0, Time elapsed: 0.019 sec
Running org.apache.woden.wsdl20.xml.BindingOperationElementTest
Tests run: 4, Failures: 0, Errors: 0, Skipped: 0, Time elapsed: 0.006 sec
Running org.apache.woden.wsdl20.TypeDefinitionTest
Tests run: 4, Failures: 0, Errors: 0, Skipped: 0, Time elapsed: 0.005 sec
Running org.apache.woden.internal.wsdl20.assertions.TestInterface1010
Tests run: 5, Failures: 0, Errors: 0, Skipped: 0, Time elapsed: 0.046 sec
Running org.apache.woden.internal.wsdl20.assertions.TestDescription1001
Tests run: 3, Failures: 0, Errors: 0, Skipped: 0, Time elapsed: 0.1 sec
Running org.apache.woden.wsdl20.InterfaceTest
Tests run: 7, Failures: 0, Errors: 0, Skipped: 0, Time elapsed: 0.008 sec
Running org.apache.woden.xml.IntOrTokenAttrTest
Tests run: 5, Failures: 0, Errors: 0, Skipped: 0, Time elapsed: 0.018 sec
Running org.apache.woden.internal.wsdl20.validation.WSDLDocumentValidatorTest
Tests run: 8, Failures: 0, Errors: 0, Skipped: 0, Time elapsed: 0.058 sec
Running org.apache.woden.wsdl20.BindingOperationTest
Tests run: 4, Failures: 0, Errors: 0, Skipped: 0, Time elapsed: 0.005 sec
Running org.apache.woden.wsdl20.extensions.http.HTTPLocationTemplateTest
Tests run: 5, Failures: 0, Errors: 0, Skipped: 0, Time elapsed: 0.004 sec
Running org.apache.woden.wsdl20.InterfaceOperationTest
Tests run: 6, Failures: 0, Errors: 0, Skipped: 0, Time elapsed: 0.005 sec
Running org.apache.woden.wsdl20.xml.BindingFaultElementTest
Tests run: 2, Failures: 0, Errors: 0, Skipped: 0, Time elapsed: 0.003 sec
Running org.apache.woden.internal.wsdl20.validation.WSDLComponentValidatorTest
Tests run: 18, Failures: 0, Errors: 0, Skipped: 0, Time elapsed: 0.068 sec
Running org.apache.woden.tests.TestErrorHandler
Tests run: 0, Failures: 0, Errors: 0, Skipped: 0, Time elapsed: 0.002 sec
Running org.apache.woden.wsdl20.xml.WSDLElementTest
Tests run: 3, Failures: 0, Errors: 0, Skipped: 0, Time elapsed: 0.008 sec
Running org.apache.woden.wsdl20.BindingMessageReferenceTest
Tests run: 2, Failures: 0, Errors: 0, Skipped: 0, Time elapsed: 0.002 sec
Running org.apache.woden.wsdl20.DescriptionTest
Tests run: 11, Failures: 0, Errors: 0, Skipped: 0, Time elapsed: 0.036 sec
Running org.apache.woden.wsdl20.InterfaceMessageReferenceTest
Tests run: 5, Failures: 0, Errors: 0, Skipped: 0, Time elapsed: 0.008 sec
Running org.apache.woden.wsdl20.xml.NameAttributeTest
Tests run: 1, Failures: 0, Errors: 0, Skipped: 0, Time elapsed: 0.003 sec
Running org.apache.woden.wsdl20.xml.EndpointElementTest
Tests run: 8, Failures: 0, Errors: 8, Skipped: 0, Time elapsed: 0.165 sec <<< FAILURE!
Running org.apache.woden.wsdl20.xml.DocumentationElementTest
Tests run: 2, Failures: 0, Errors: 0, Skipped: 0, Time elapsed: 0.003 sec
Running org.apache.woden.wsdl20.BindingFaultReferenceTest
Tests run: 2, Failures: 0, Errors: 0, Skipped: 0, Time elapsed: 0.003 sec
Running org.apache.woden.wsdl20.EndpointTest
Tests run: 5, Failures: 0, Errors: 0, Skipped: 0, Time elapsed: 0.003 sec
Running org.apache.woden.wsdl20.xml.IncludeElementTest
Tests run: 2, Failures: 0, Errors: 0, Skipped: 0, Time elapsed: 0.004 sec
Running org.apache.woden.internal.wsdl20.assertions.TestInterface1009
Tests run: 4, Failures: 0, Errors: 0, Skipped: 0, Time elapsed: 0.011 sec
Running org.apache.woden.wsdl20.xml.BindingFaultReferenceElementTest
Tests run: 3, Failures: 0, Errors: 0, Skipped: 0, Time elapsed: 0.003 sec
Running org.apache.woden.wsdl20.extensions.ExtensionRegistryTest
Tests run: 2, Failures: 0, Errors: 0, Skipped: 0, Time elapsed: 0.007 sec
Running org.apache.woden.wsdl20.xml.InterfaceOperationElementTest
Tests run: 5, Failures: 0, Errors: 0, Skipped: 0, Time elapsed: 0.004 sec
Running org.apache.woden.wsdl20.BindingFaultTest
Tests run: 2, Failures: 0, Errors: 0, Skipped: 0, Time elapsed: 0.003 sec
Running org.apache.woden.wsdl20.xml.InterfaceFaultReferenceElementTest
Tests run: 4, Failures: 0, Errors: 0, Skipped: 0, Time elapsed: 0.003 sec
Running org.apache.woden.WSDLFactoryTest
Tests run: 2, Failures: 0, Errors: 0, Skipped: 0, Time elapsed: 0.004 sec
Running org.apache.woden.wsdl20.InterfaceFaultTest
Tests run: 4, Failures: 0, Errors: 0, Skipped: 0, Time elapsed: 0.006 sec
Running org.apache.woden.wsdl20.xml.InterfaceMessageReferenceElementTest
Tests run: 4, Failures: 0, Errors: 0, Skipped: 0, Time elapsed: 0.006 sec
Running org.apache.woden.wsdl20.xml.BindingMessageReferenceElementTest
Tests run: 3, Failures: 0, Errors: 0, Skipped: 0, Time elapsed: 0.003 sec
Running org.apache.woden.wsdl20.xml.TypesElementTest
Tests run: 5, Failures: 0, Errors: 0, Skipped: 0, Time elapsed: 0.004 sec
Running org.apache.woden.wsdl20.xml.DescriptiontElementTest
Tests run: 9, Failures: 0, Errors: 0, Skipped: 0, Time elapsed: 0.006 sec
Running org.apache.woden.xml.TokenAttrTest
Tests run: 3, Failures: 0, Errors: 0, Skipped: 0, Time elapsed: 0.008 sec
Running org.apache.woden.wsdl20.ServiceTest
Tests run: 4, Failures: 0, Errors: 0, Skipped: 0, Time elapsed: 0.004 sec
Running org.apache.woden.wsdl20.xml.ImportElementTest
Tests run: 5, Failures: 0, Errors: 0, Skipped: 0, Time elapsed: 0.004 sec
Running org.apache.woden.wsdl20.xml.ServiceElementTest
Tests run: 6, Failures: 0, Errors: 6, Skipped: 0, Time elapsed: 0.028 sec <<< FAILURE!
Running org.apache.woden.wsdl20.extensions.http.HTTPLocationTest
Tests run: 16, Failures: 0, Errors: 0, Skipped: 0, Time elapsed: 0.012 sec
Running org.apache.woden.wsdl20.InterfaceFaultReferenceTest
Tests run: 4, Failures: 0, Errors: 0, Skipped: 0, Time elapsed: 0.003 sec
Running org.apache.woden.wsdl20.fragids.FragmentIdentificationTest
Tests run: 1, Failures: 1, Errors: 0, Skipped: 0, Time elapsed: 0.007 sec <<< FAILURE!
Running org.apache.woden.wsdl20.xml.BindingElementTest
Tests run: 6, Failures: 0, Errors: 0, Skipped: 0, Time elapsed: 0.004 sec
Running testcase.resolver.schemaloc.SchemaLocationTest
Tests run: 6, Failures: 0, Errors: 0, Skipped: 0, Time elapsed: 0.013 sec
Running org.apache.woden.wsdl20.BindingTest
Tests run: 6, Failures: 0, Errors: 0, Skipped: 0, Time elapsed: 0.004 sec
Running org.apache.woden.wsdl20.xml.InterfaceElementTest
Tests run: 6, Failures: 0, Errors: 0, Skipped: 0, Time elapsed: 0.004 sec

Results :

Failed tests: 
  testSerialisation(org.apache.woden.wsdl20.fragids.FragmentIdentificationTest)

Tests in error: 
  testGetNameParsed(org.apache.woden.wsdl20.xml.EndpointElementTest)
  testSetAndGetName(org.apache.woden.wsdl20.xml.EndpointElementTest)
  testGetBindingNameParsed(org.apache.woden.wsdl20.xml.EndpointElementTest)
  testSetAndGetBindingName(org.apache.woden.wsdl20.xml.EndpointElementTest)
  testGetBindingElementParsed(org.apache.woden.wsdl20.xml.EndpointElementTest)
  testGetAddressParsed(org.apache.woden.wsdl20.xml.EndpointElementTest)
  testGetAddressParsedOptional(org.apache.woden.wsdl20.xml.EndpointElementTest)
  testSetAndGetAddress(org.apache.woden.wsdl20.xml.EndpointElementTest)
  testGetNameParsed(org.apache.woden.wsdl20.xml.ServiceElementTest)
  testSetAndGetName(org.apache.woden.wsdl20.xml.ServiceElementTest)
  testGetInterfaceNameParsed(org.apache.woden.wsdl20.xml.ServiceElementTest)
  testSetAndGetInterfaceName(org.apache.woden.wsdl20.xml.ServiceElementTest)
  testGetInterfaceElementParsed(org.apache.woden.wsdl20.xml.ServiceElementTest)
  testGetEndpointElementsParsed(org.apache.woden.wsdl20.xml.ServiceElementTest)

Tests run: 238, Failures: 1, Errors: 14, Skipped: 0

[INFO] ------------------------------------------------------------------------
[INFO] BUILD FAILURE
[INFO] ------------------------------------------------------------------------
[INFO] Total time: 7.151s
[INFO] Finished at: Sun Mar 11 13:05:44 UTC 2012
[INFO] Final Memory: 9M/199M
[INFO] ------------------------------------------------------------------------
[ERROR] Failed to execute goal org.apache.maven.plugins:maven-surefire-plugin:2.4.3:test (default-test)
on project woden-tests-impl-om: There are test failures.
[ERROR] 
[ERROR] Please refer to <https://builds.apache.org/job/woden-trunk/ws/woden/woden-tests/target/om/surefire-reports>
for the individual test results.
[ERROR] -> [Help 1]
[ERROR] 
[ERROR] To see the full stack trace of the errors, re-run Maven with the -e switch.
[ERROR] Re-run Maven using the -X switch to enable full debug logging.
[ERROR] 
[ERROR] For more information about the errors and possible solutions, please read the following
articles:
[ERROR] [Help 1] http://cwiki.apache.org/confluence/display/MAVEN/MojoFailureException
[INFO] ...FAILED[code=1]. See <https://builds.apache.org/job/woden-trunk/ws/woden/woden-tests/build.log>
for details.
[INFO] 

---------------------------------------
Execution Summary:
Builds Passing: 0
Builds Failing: 1
---------------------------------------

The following builds failed:

*  pom-impl-om.xml

[JENKINS] Archiving <https://builds.apache.org/job/woden-trunk/ws/woden/woden-tests/pom.xml>
to /home/hudson/hudson/jobs/woden-trunk/modules/org.apache.woden$woden-tests/builds/2012-03-11_13-04-04/archive/org.apache.woden/woden-tests/1.0-SNAPSHOT/woden-tests-1.0-SNAPSHOT.pom
[INFO] ------------------------------------------------------------------------
[INFO] Reactor Summary:
[INFO] 
[INFO] Woden ............................................. SUCCESS [23.038s]
[INFO] Woden - API ....................................... SUCCESS [14.295s]
[INFO] Woden - Commons ................................... SUCCESS [3.993s]
[INFO] Woden - DOM ....................................... SUCCESS [4.661s]
[INFO] Woden - OM ........................................ SUCCESS [5.106s]
[INFO] Woden - Tests ..................................... FAILURE [32.206s]
[INFO] Woden - Tool ...................................... SKIPPED
[INFO] Woden - converter Maven plugin .................... SKIPPED
[INFO] Woden - Ant ....................................... SKIPPED
[INFO] ------------------------------------------------------------------------
[INFO] BUILD FAILURE
[INFO] ------------------------------------------------------------------------
[INFO] Total time: 1:32.077s
[INFO] Finished at: Sun Mar 11 13:05:45 UTC 2012
[INFO] Final Memory: 19M/154M
[INFO] ------------------------------------------------------------------------
mavenExecutionResult exceptions not empty
message : Failed to execute goal org.apache.maven.plugins:maven-invoker-plugin:1.2:run (test-om)
on project woden-tests: 1 builds failed.
cause : 1 builds failed.
Stack trace : 
org.apache.maven.lifecycle.LifecycleExecutionException: Failed to execute goal org.apache.maven.plugins:maven-invoker-plugin:1.2:run
(test-om) on project woden-tests: 1 builds failed.
	at org.apache.maven.lifecycle.internal.MojoExecutor.execute(MojoExecutor.java:213)
	at org.apache.maven.lifecycle.internal.MojoExecutor.execute(MojoExecutor.java:153)
	at org.apache.maven.lifecycle.internal.MojoExecutor.execute(MojoExecutor.java:145)
	at org.apache.maven.lifecycle.internal.LifecycleModuleBuilder.buildProject(LifecycleModuleBuilder.java:84)
	at org.apache.maven.lifecycle.internal.LifecycleModuleBuilder.buildProject(LifecycleModuleBuilder.java:59)
	at org.apache.maven.lifecycle.internal.LifecycleStarter.singleThreadedBuild(LifecycleStarter.java:183)
	at org.apache.maven.lifecycle.internal.LifecycleStarter.execute(LifecycleStarter.java:161)
	at org.apache.maven.DefaultMaven.doExecute(DefaultMaven.java:319)
	at org.apache.maven.DefaultMaven.execute(DefaultMaven.java:156)
	at org.jvnet.hudson.maven3.launcher.Maven3Launcher.main(Maven3Launcher.java:79)
	at sun.reflect.NativeMethodAccessorImpl.invoke0(Native Method)
	at sun.reflect.NativeMethodAccessorImpl.invoke(NativeMethodAccessorImpl.java:39)
	at sun.reflect.DelegatingMethodAccessorImpl.invoke(DelegatingMethodAccessorImpl.java:25)
	at java.lang.reflect.Method.invoke(Method.java:592)
	at org.codehaus.plexus.classworlds.launcher.Launcher.launchStandard(Launcher.java:329)
	at org.codehaus.plexus.classworlds.launcher.Launcher.launch(Launcher.java:239)
	at org.jvnet.hudson.maven3.agent.Maven3Main.launch(Maven3Main.java:158)
	at hudson.maven.Maven3Builder.call(Maven3Builder.java:104)
	at hudson.maven.Maven3Builder.call(Maven3Builder.java:70)
	at hudson.remoting.UserRequest.perform(UserRequest.java:118)
	at hudson.remoting.UserRequest.perform(UserRequest.java:48)
	at hudson.remoting.Request$2.run(Request.java:287)
	at hudson.remoting.InterceptingExecutorService$1.call(InterceptingExecutorService.java:72)
	at java.util.concurrent.FutureTask$Sync.innerRun(FutureTask.java:269)
	at java.util.concurrent.FutureTask.run(FutureTask.java:123)
	at java.util.concurrent.ThreadPoolExecutor$Worker.runTask(ThreadPoolExecutor.java:651)
	at java.util.concurrent.ThreadPoolExecutor$Worker.run(ThreadPoolExecutor.java:676)
	at java.lang.Thread.run(Thread.java:595)
Caused by: org.apache.maven.plugin.MojoFailureException: 1 builds failed.
	at org.apache.maven.plugin.invoker.InvokerMojo.execute(InvokerMojo.java:487)
	at org.apache.maven.plugin.DefaultBuildPluginManager.executeMojo(DefaultBuildPluginManager.java:101)
	at org.apache.maven.lifecycle.internal.MojoExecutor.execute(MojoExecutor.java:209)
	... 27 more
channel stopped


---------------------------------------------------------------------
To unsubscribe, e-mail: dev-unsubscribe@ws.apache.org
For additional commands, e-mail: dev-help@ws.apache.org


Mime
View raw message