ws-dev mailing list archives

Site index · List index
Message view « Date » · « Thread »
Top « Date » · « Thread »
From Apache Jenkins Server <jenk...@builds.apache.org>
Subject Build failed in Jenkins: neethi-trunk #460
Date Mon, 21 May 2012 10:31:48 GMT
See <https://builds.apache.org/job/neethi-trunk/460/>

------------------------------------------
[...truncated 190 lines...]
Generating <https://builds.apache.org/job/neethi-trunk/ws/neethi/target/apidocs/org/apache/neethi/class-use//ExactlyOne.html...>
Generating <https://builds.apache.org/job/neethi-trunk/ws/neethi/target/apidocs/org/apache/neethi/class-use//Assertion.html...>
Generating <https://builds.apache.org/job/neethi-trunk/ws/neethi/target/apidocs/org/apache/neethi/class-use//IntersectableAssertion.html...>
Generating <https://builds.apache.org/job/neethi-trunk/ws/neethi/target/apidocs/org/apache/neethi/class-use//PolicyRegistryImpl.html...>
Generating <https://builds.apache.org/job/neethi-trunk/ws/neethi/target/apidocs/org/apache/neethi/class-use//PolicyEngine.html...>
Generating <https://builds.apache.org/job/neethi-trunk/ws/neethi/target/apidocs/org/apache/neethi/class-use//Constants.html...>
Generating <https://builds.apache.org/job/neethi-trunk/ws/neethi/target/apidocs/org/apache/neethi/class-use//PolicyRegistry.html...>
Generating <https://builds.apache.org/job/neethi-trunk/ws/neethi/target/apidocs/org/apache/neethi/class-use//AbstractPolicyOperator.html...>
Generating <https://builds.apache.org/job/neethi-trunk/ws/neethi/target/apidocs/org/apache/neethi/class-use//PolicyBuilder.html...>
Generating <https://builds.apache.org/job/neethi-trunk/ws/neethi/target/apidocs/org/apache/neethi/class-use//PolicyContainingAssertion.html...>
Generating <https://builds.apache.org/job/neethi-trunk/ws/neethi/target/apidocs/org/apache/neethi/class-use//PolicyComponent.html...>
Generating <https://builds.apache.org/job/neethi-trunk/ws/neethi/target/apidocs/org/apache/neethi/util/class-use//PolicyIntersector.html...>
Generating <https://builds.apache.org/job/neethi-trunk/ws/neethi/target/apidocs/org/apache/neethi/util/class-use//Service.html...>
Generating <https://builds.apache.org/job/neethi-trunk/ws/neethi/target/apidocs/org/apache/neethi/util/class-use//PolicyComparator.html...>
Generating <https://builds.apache.org/job/neethi-trunk/ws/neethi/target/apidocs/org/apache/neethi/builders/class-use//AssertionBuilder.html...>
Generating <https://builds.apache.org/job/neethi-trunk/ws/neethi/target/apidocs/org/apache/neethi/builders/class-use//PrimitiveAssertion.html...>
Generating <https://builds.apache.org/job/neethi-trunk/ws/neethi/target/apidocs/org/apache/neethi/builders/class-use//PolicyContainingPrimitiveAssertion.html...>
Generating <https://builds.apache.org/job/neethi-trunk/ws/neethi/target/apidocs/org/apache/neethi/builders/converters/class-use//OMToDOMConverter.html...>
Generating <https://builds.apache.org/job/neethi-trunk/ws/neethi/target/apidocs/org/apache/neethi/builders/converters/class-use//AbstractStaxConverter.html...>
Generating <https://builds.apache.org/job/neethi-trunk/ws/neethi/target/apidocs/org/apache/neethi/builders/converters/class-use//StaxToDOMConverter.html...>
Generating <https://builds.apache.org/job/neethi-trunk/ws/neethi/target/apidocs/org/apache/neethi/builders/converters/class-use//ConverterException.html...>
Generating <https://builds.apache.org/job/neethi-trunk/ws/neethi/target/apidocs/org/apache/neethi/builders/converters/class-use//AbstractOMConverter.html...>
Generating <https://builds.apache.org/job/neethi-trunk/ws/neethi/target/apidocs/org/apache/neethi/builders/converters/class-use//Converter.html...>
Generating <https://builds.apache.org/job/neethi-trunk/ws/neethi/target/apidocs/org/apache/neethi/builders/converters/class-use//AbstractDOMConverter.html...>
Generating <https://builds.apache.org/job/neethi-trunk/ws/neethi/target/apidocs/org/apache/neethi/builders/converters/class-use//StaxToStaxConverter.html...>
Generating <https://builds.apache.org/job/neethi-trunk/ws/neethi/target/apidocs/org/apache/neethi/builders/converters/class-use//DOMToOMConverter.html...>
Generating <https://builds.apache.org/job/neethi-trunk/ws/neethi/target/apidocs/org/apache/neethi/builders/converters/class-use//DOMToStaxConverter.html...>
Generating <https://builds.apache.org/job/neethi-trunk/ws/neethi/target/apidocs/org/apache/neethi/builders/converters/class-use//OMToStaxConverter.html...>
Generating <https://builds.apache.org/job/neethi-trunk/ws/neethi/target/apidocs/org/apache/neethi/builders/converters/class-use//StaxToOMConverter.html...>
Generating <https://builds.apache.org/job/neethi-trunk/ws/neethi/target/apidocs/org/apache/neethi/builders/converters/class-use//ConverterRegistry.html...>
Generating <https://builds.apache.org/job/neethi-trunk/ws/neethi/target/apidocs/org/apache/neethi/builders/converters/class-use//DOMToDOMConverter.html...>
Generating <https://builds.apache.org/job/neethi-trunk/ws/neethi/target/apidocs/org/apache/neethi/builders/converters/class-use//OMToOMConverter.html...>
Generating <https://builds.apache.org/job/neethi-trunk/ws/neethi/target/apidocs/org/apache/neethi/builders/xml/class-use//XMLPrimitiveAssertionBuilder.html...>
Generating <https://builds.apache.org/job/neethi-trunk/ws/neethi/target/apidocs/org/apache/neethi/builders/xml/class-use//XmlPrimitiveAssertion.html...>
Generating <https://builds.apache.org/job/neethi-trunk/ws/neethi/target/apidocs/org/apache/neethi//package-use.html...>
Generating <https://builds.apache.org/job/neethi-trunk/ws/neethi/target/apidocs/org/apache/neethi/builders//package-use.html...>
Generating <https://builds.apache.org/job/neethi-trunk/ws/neethi/target/apidocs/org/apache/neethi/builders/converters//package-use.html...>
Generating <https://builds.apache.org/job/neethi-trunk/ws/neethi/target/apidocs/org/apache/neethi/builders/xml//package-use.html...>
Generating <https://builds.apache.org/job/neethi-trunk/ws/neethi/target/apidocs/org/apache/neethi/util//package-use.html...>
Building index for all the packages and classes...
Generating <https://builds.apache.org/job/neethi-trunk/ws/neethi/target/apidocs/overview-tree.html...>
Generating <https://builds.apache.org/job/neethi-trunk/ws/neethi/target/apidocs/index-all.html...>
Generating <https://builds.apache.org/job/neethi-trunk/ws/neethi/target/apidocs/deprecated-list.html...>
Building index for all classes...
Generating <https://builds.apache.org/job/neethi-trunk/ws/neethi/target/apidocs/allclasses-frame.html...>
Generating <https://builds.apache.org/job/neethi-trunk/ws/neethi/target/apidocs/allclasses-noframe.html...>
Generating <https://builds.apache.org/job/neethi-trunk/ws/neethi/target/apidocs/index.html...>
Generating <https://builds.apache.org/job/neethi-trunk/ws/neethi/target/apidocs/overview-summary.html...>
Generating <https://builds.apache.org/job/neethi-trunk/ws/neethi/target/apidocs/help-doc.html...>
Generating <https://builds.apache.org/job/neethi-trunk/ws/neethi/target/apidocs/stylesheet.css...>
6 warnings
[WARNING] Javadoc Warnings
[WARNING] <https://builds.apache.org/job/neethi-trunk/ws/neethi/src/main/java/org/apache/neethi/AssertionBuilderFactory.java>:47:
warning - @return tag has no arguments.
[WARNING] <https://builds.apache.org/job/neethi-trunk/ws/neethi/src/main/java/org/apache/neethi/AssertionBuilderFactory.java>:39:
warning - @return tag has no arguments.
[WARNING] <https://builds.apache.org/job/neethi-trunk/ws/neethi/src/main/java/org/apache/neethi/Policy.java>:227:
warning - @return tag has no arguments.
[WARNING] <https://builds.apache.org/job/neethi-trunk/ws/neethi/src/main/java/org/apache/neethi/PolicyEngine.java>:99:
warning - @retun is an unknown tag.
[WARNING] <https://builds.apache.org/job/neethi-trunk/ws/neethi/src/main/java/org/apache/neethi/PolicyEngine.java>:110:
warning - @retun is an unknown tag.
[WARNING] <https://builds.apache.org/job/neethi-trunk/ws/neethi/src/main/java/org/apache/neethi/builders/xml/XmlPrimitiveAssertion.java>:76:
warning - @param argument "element" is not a parameter name.
[INFO] Building jar: <https://builds.apache.org/job/neethi-trunk/ws/neethi/target/neethi-3.0.3-SNAPSHOT-javadoc.jar>
[INFO] [gpg:sign {execution: default}]
[INFO] [apache-rat:check {execution: default}]
[INFO] Exclude: .gitignore
[INFO] Exclude: .git/**
[INFO] Exclude: .pmd/**
[INFO] Exclude: .checkstyle/**
[INFO] Exclude: RELEASE-NOTE.txt
[INFO] Exclude: src/test/test-resources/w3tests/**
[INFO] [install:install {execution: default-install}]
[INFO] Installing <https://builds.apache.org/job/neethi-trunk/ws/neethi/target/neethi-3.0.3-SNAPSHOT.jar>
to <https://builds.apache.org/job/neethi-trunk/ws/.repository/org/apache/neethi/neethi/3.0.3-SNAPSHOT/neethi-3.0.3-SNAPSHOT.jar>
[INFO] Installing <https://builds.apache.org/job/neethi-trunk/ws/neethi/target/neethi-3.0.3-SNAPSHOT-bin.zip>
to <https://builds.apache.org/job/neethi-trunk/ws/.repository/org/apache/neethi/neethi/3.0.3-SNAPSHOT/neethi-3.0.3-SNAPSHOT-bin.zip>
[INFO] Installing <https://builds.apache.org/job/neethi-trunk/ws/neethi/target/neethi-3.0.3-SNAPSHOT-source-release.zip>
to <https://builds.apache.org/job/neethi-trunk/ws/.repository/org/apache/neethi/neethi/3.0.3-SNAPSHOT/neethi-3.0.3-SNAPSHOT-source-release.zip>
[INFO] Installing <https://builds.apache.org/job/neethi-trunk/ws/neethi/target/neethi-3.0.3-SNAPSHOT-sources.jar>
to <https://builds.apache.org/job/neethi-trunk/ws/.repository/org/apache/neethi/neethi/3.0.3-SNAPSHOT/neethi-3.0.3-SNAPSHOT-sources.jar>
[INFO] Installing <https://builds.apache.org/job/neethi-trunk/ws/neethi/target/neethi-3.0.3-SNAPSHOT-sources.jar>
to <https://builds.apache.org/job/neethi-trunk/ws/.repository/org/apache/neethi/neethi/3.0.3-SNAPSHOT/neethi-3.0.3-SNAPSHOT-sources.jar>
[INFO] Installing <https://builds.apache.org/job/neethi-trunk/ws/neethi/target/neethi-3.0.3-SNAPSHOT-javadoc.jar>
to <https://builds.apache.org/job/neethi-trunk/ws/.repository/org/apache/neethi/neethi/3.0.3-SNAPSHOT/neethi-3.0.3-SNAPSHOT-javadoc.jar>
[INFO] [bundle:install {execution: default-install}]
[INFO] Installing org/apache/neethi/neethi/3.0.3-SNAPSHOT/neethi-3.0.3-SNAPSHOT.jar
[INFO] Writing OBR metadata
[INFO] [deploy:deploy {execution: default-deploy}]
[INFO] Retrieving previous build number from apache.snapshots.https
[WARNING] *** CHECKSUM FAILED - Checksum failed on download: local = '6d6a79e4b023763d6709e1a87d84ff665db3ed30';
remote = '96ca2a868d6a4f89e9eb34419f91f31245a3f1ae' - RETRYING
[WARNING] *** CHECKSUM FAILED - Checksum failed on download: local = '6d6a79e4b023763d6709e1a87d84ff665db3ed30';
remote = '96ca2a868d6a4f89e9eb34419f91f31245a3f1ae' - IGNORING
Uploading: https://repository.apache.org/content/repositories/snapshots/org/apache/neethi/neethi/3.0.3-SNAPSHOT/neethi-3.0.3-20120521.103111-116.jar
69K uploaded  (neethi-3.0.3-20120521.103111-116.jar)
[INFO] Retrieving previous metadata from apache.snapshots.https
[WARNING] *** CHECKSUM FAILED - Checksum failed on download: local = '6d6a79e4b023763d6709e1a87d84ff665db3ed30';
remote = '96ca2a868d6a4f89e9eb34419f91f31245a3f1ae' - RETRYING
[WARNING] *** CHECKSUM FAILED - Checksum failed on download: local = '6d6a79e4b023763d6709e1a87d84ff665db3ed30';
remote = '96ca2a868d6a4f89e9eb34419f91f31245a3f1ae' - IGNORING
[INFO] Uploading repository metadata for: 'snapshot org.apache.neethi:neethi:3.0.3-SNAPSHOT'
[INFO] Retrieving previous metadata from apache.snapshots.https
[WARNING] *** CHECKSUM FAILED - Checksum failed on download: local = 'ddbb3f177fba38c9a8c244de39926ee8d1a07dee';
remote = 'c6b3f5077c44265ad347ef876d41a495d3abf6cf' - RETRYING
[WARNING] *** CHECKSUM FAILED - Checksum failed on download: local = 'ddbb3f177fba38c9a8c244de39926ee8d1a07dee';
remote = 'c6b3f5077c44265ad347ef876d41a495d3abf6cf' - IGNORING
[INFO] Uploading repository metadata for: 'artifact org.apache.neethi:neethi'
[INFO] Uploading project information for neethi 3.0.3-20120521.103111-116
[INFO] Retrieving previous build number from apache.snapshots.https
Uploading: https://repository.apache.org/content/repositories/snapshots/org/apache/neethi/neethi/3.0.3-SNAPSHOT/neethi-3.0.3-20120521.103111-116-bin.zip
68K uploaded  (neethi-3.0.3-20120521.103111-116-bin.zip)
[INFO] Retrieving previous build number from apache.snapshots.https
Uploading: https://repository.apache.org/content/repositories/snapshots/org/apache/neethi/neethi/3.0.3-SNAPSHOT/neethi-3.0.3-20120521.103111-116-source-release.zip
310K uploaded  (neethi-3.0.3-20120521.103111-116-source-release.zip)
[INFO] Retrieving previous build number from apache.snapshots.https
Uploading: https://repository.apache.org/content/repositories/snapshots/org/apache/neethi/neethi/3.0.3-SNAPSHOT/neethi-3.0.3-20120521.103111-116-sources.jar
59K uploaded  (neethi-3.0.3-20120521.103111-116-sources.jar)
[INFO] Retrieving previous build number from apache.snapshots.https
Uploading: https://repository.apache.org/content/repositories/snapshots/org/apache/neethi/neethi/3.0.3-SNAPSHOT/neethi-3.0.3-20120521.103111-116-sources.jar
59K uploaded  (neethi-3.0.3-20120521.103111-116-sources.jar)
[INFO] Retrieving previous build number from apache.snapshots.https
Uploading: https://repository.apache.org/content/repositories/snapshots/org/apache/neethi/neethi/3.0.3-SNAPSHOT/neethi-3.0.3-20120521.103111-116-javadoc.jar
243K uploaded  (neethi-3.0.3-20120521.103111-116-javadoc.jar)
[INFO] [bundle:deploy {execution: default-deploy}]
[INFO] Remote OBR update disabled (enable with -DremoteOBR)
[INFO] Preparing javadoc:test-javadoc
[JENKINS] Archiving <https://builds.apache.org/job/neethi-trunk/ws/neethi/pom.xml> to
/home/hudson/hudson/jobs/neethi-trunk/modules/org.apache.neethi$neethi/builds/2012-05-21_10-29-59/archive/org.apache.neethi/neethi/3.0.3-SNAPSHOT/neethi-3.0.3-SNAPSHOT.pom
[JENKINS] Archiving <https://builds.apache.org/job/neethi-trunk/ws/neethi/target/neethi-3.0.3-SNAPSHOT.jar>
to /home/hudson/hudson/jobs/neethi-trunk/modules/org.apache.neethi$neethi/builds/2012-05-21_10-29-59/archive/org.apache.neethi/neethi/3.0.3-20120521.103111-116/neethi-3.0.3-20120521.103111-116.jar
[JENKINS] Archiving <https://builds.apache.org/job/neethi-trunk/ws/neethi/target/neethi-3.0.3-SNAPSHOT-bin.zip>
to /home/hudson/hudson/jobs/neethi-trunk/modules/org.apache.neethi$neethi/builds/2012-05-21_10-29-59/archive/org.apache.neethi/neethi/3.0.3-20120521.103111-116/neethi-3.0.3-20120521.103111-116-bin.zip
[JENKINS] Archiving <https://builds.apache.org/job/neethi-trunk/ws/neethi/target/neethi-3.0.3-SNAPSHOT-source-release.zip>
to /home/hudson/hudson/jobs/neethi-trunk/modules/org.apache.neethi$neethi/builds/2012-05-21_10-29-59/archive/org.apache.neethi/neethi/3.0.3-20120521.103111-116/neethi-3.0.3-20120521.103111-116-source-release.zip
[JENKINS] Archiving <https://builds.apache.org/job/neethi-trunk/ws/neethi/target/neethi-3.0.3-SNAPSHOT-sources.jar>
to /home/hudson/hudson/jobs/neethi-trunk/modules/org.apache.neethi$neethi/builds/2012-05-21_10-29-59/archive/org.apache.neethi/neethi/3.0.3-20120521.103111-116/neethi-3.0.3-20120521.103111-116-sources.jar
[JENKINS] Archiving <https://builds.apache.org/job/neethi-trunk/ws/neethi/target/neethi-3.0.3-SNAPSHOT-javadoc.jar>
to /home/hudson/hudson/jobs/neethi-trunk/modules/org.apache.neethi$neethi/builds/2012-05-21_10-29-59/archive/org.apache.neethi/neethi/3.0.3-20120521.103111-116/neethi-3.0.3-20120521.103111-116-javadoc.jar
[INFO] [remote-resources:process {execution: default}]
[INFO] [resources:resources {execution: default-resources}]
[INFO] Using 'UTF-8' encoding to copy filtered resources.
[INFO] skip non existing resourceDirectory <https://builds.apache.org/job/neethi-trunk/ws/neethi/src/main/resources>
[INFO] Copying 3 resources
[INFO] Copying 3 resources
[INFO] [compiler:compile {execution: default-compile}]
[INFO] Nothing to compile - all classes are up to date
[INFO] Preparing javadoc:test-aggregate
[INFO] ------------------------------------------------------------------------
[INFO] Building Apache Neethi
[INFO] ------------------------------------------------------------------------
[INFO] [remote-resources:process {execution: default}]
[INFO] [resources:resources {execution: default-resources}]
[INFO] Using 'UTF-8' encoding to copy filtered resources.
[INFO] skip non existing resourceDirectory <https://builds.apache.org/job/neethi-trunk/ws/neethi/src/main/resources>
[INFO] Copying 3 resources
[INFO] Copying 3 resources
[INFO] Copying 3 resources
[INFO] [compiler:compile {execution: default-compile}]
[INFO] Nothing to compile - all classes are up to date
[INFO] Preparing javadoc:aggregate
[INFO] ------------------------------------------------------------------------
[INFO] Building Apache Neethi
[INFO] ------------------------------------------------------------------------
[INFO] No goals needed for project - skipping
[INFO] Preparing javadoc:javadoc
[INFO] No goals needed for project - skipping
[INFO] [site:site {execution: default-site}]
[INFO] Parent project loaded from repository.
[INFO] Parent project loaded from repository.
[INFO] Skipped "Test JavaDocs" report, file "testapidocs/index.html" already exists for the
English version.
[INFO] Skipped "JavaDocs" report, file "apidocs/index.html" already exists for the English
version.
[INFO] Generating "Test JavaDocs" report.
[INFO] 
Loading source files for package org.apache.neethi...
Constructing Javadoc information...
Standard Doclet version 1.5.0_22
Building tree for all the packages and classes...
Generating <https://builds.apache.org/job/neethi-trunk/ws/neethi/target/site/testapidocs/org/apache/neethi//BasicTestCases.html...>
Generating <https://builds.apache.org/job/neethi-trunk/ws/neethi/target/site/testapidocs/org/apache/neethi//IntersectTest.html...>
Generating <https://builds.apache.org/job/neethi-trunk/ws/neethi/target/site/testapidocs/org/apache/neethi//MergeTest.html...>
Generating <https://builds.apache.org/job/neethi-trunk/ws/neethi/target/site/testapidocs/org/apache/neethi//Normalize2Test.html...>
Generating <https://builds.apache.org/job/neethi-trunk/ws/neethi/target/site/testapidocs/org/apache/neethi//NormalizeTest.html...>
Generating <https://builds.apache.org/job/neethi-trunk/ws/neethi/target/site/testapidocs/org/apache/neethi//PolicyTestCase.html...>
Generating <https://builds.apache.org/job/neethi-trunk/ws/neethi/target/site/testapidocs/org/apache/neethi//package-frame.html...>
Generating <https://builds.apache.org/job/neethi-trunk/ws/neethi/target/site/testapidocs/org/apache/neethi//package-summary.html...>
Generating <https://builds.apache.org/job/neethi-trunk/ws/neethi/target/site/testapidocs/org/apache/neethi//package-tree.html...>
Generating <https://builds.apache.org/job/neethi-trunk/ws/neethi/target/site/testapidocs/constant-values.html...>
Generating <https://builds.apache.org/job/neethi-trunk/ws/neethi/target/site/testapidocs/org/apache/neethi/class-use//PolicyTestCase.html...>
Generating <https://builds.apache.org/job/neethi-trunk/ws/neethi/target/site/testapidocs/org/apache/neethi/class-use//NormalizeTest.html...>
Generating <https://builds.apache.org/job/neethi-trunk/ws/neethi/target/site/testapidocs/org/apache/neethi/class-use//Normalize2Test.html...>
Generating <https://builds.apache.org/job/neethi-trunk/ws/neethi/target/site/testapidocs/org/apache/neethi/class-use//BasicTestCases.html...>
Generating <https://builds.apache.org/job/neethi-trunk/ws/neethi/target/site/testapidocs/org/apache/neethi/class-use//MergeTest.html...>
Generating <https://builds.apache.org/job/neethi-trunk/ws/neethi/target/site/testapidocs/org/apache/neethi/class-use//IntersectTest.html...>
Generating <https://builds.apache.org/job/neethi-trunk/ws/neethi/target/site/testapidocs/org/apache/neethi//package-use.html...>
Building index for all the packages and classes...
Generating <https://builds.apache.org/job/neethi-trunk/ws/neethi/target/site/testapidocs/overview-tree.html...>
Generating <https://builds.apache.org/job/neethi-trunk/ws/neethi/target/site/testapidocs/index-all.html...>
Generating <https://builds.apache.org/job/neethi-trunk/ws/neethi/target/site/testapidocs/deprecated-list.html...>
Building index for all classes...
Generating <https://builds.apache.org/job/neethi-trunk/ws/neethi/target/site/testapidocs/allclasses-frame.html...>
Generating <https://builds.apache.org/job/neethi-trunk/ws/neethi/target/site/testapidocs/allclasses-noframe.html...>
Generating <https://builds.apache.org/job/neethi-trunk/ws/neethi/target/site/testapidocs/index.html...>
Generating <https://builds.apache.org/job/neethi-trunk/ws/neethi/target/site/testapidocs/help-doc.html...>
Generating <https://builds.apache.org/job/neethi-trunk/ws/neethi/target/site/testapidocs/stylesheet.css...>
[JENKINS] Archiving  javadoc
Successfully loaded native POSIX impl.
[INFO] Generating "JavaDocs" report.
May 21, 2012 10:31:46 AM hudson.remoting.SynchronousCommandTransport$ReaderThread run
SEVERE: I/O error in channel channel
java.io.StreamCorruptedException
	at java.io.ObjectInputStream.readObject0(ObjectInputStream.java:1332)
	at java.io.ObjectInputStream.readObject(ObjectInputStream.java:348)
	at hudson.remoting.Command.readFrom(Command.java:90)
	at hudson.remoting.ClassicCommandTransport.read(ClassicCommandTransport.java:59)
	at hudson.remoting.SynchronousCommandTransport$ReaderThread.run(SynchronousCommandTransport.java:48)
killed.
channel stopped
[INFO] ------------------------------------------------------------------------
[ERROR] FATAL ERROR
[INFO] ------------------------------------------------------------------------
[INFO] null
[INFO] ------------------------------------------------------------------------
[INFO] Trace
java.lang.reflect.UndeclaredThrowableException
	at $Proxy2.isArchivingDisabled(Unknown Source)
	at hudson.maven.MavenBuildProxy$Filter.isArchivingDisabled(MavenBuildProxy.java:227)
	at hudson.maven.reporters.MavenArtifact.archive(MavenArtifact.java:223)
	at hudson.maven.reporters.MavenArtifactArchiver.postBuild(MavenArtifactArchiver.java:108)
	at hudson.maven.Maven2Builder.postModule(Maven2Builder.java:127)
	at hudson.maven.MavenBuilder$Adapter.fireLeaveModule(MavenBuilder.java:327)
	at hudson.maven.MavenBuilder$Adapter.postBuild(MavenBuilder.java:285)
	at org.apache.maven.lifecycle.LifecycleExecutorInterceptor.execute(LifecycleExecutorInterceptor.java:68)
	at org.apache.maven.DefaultMaven.doExecute(DefaultMaven.java:328)
	at org.apache.maven.DefaultMaven.execute(DefaultMaven.java:138)
	at org.apache.maven.cli.MavenCli.main(MavenCli.java:362)
	at sun.reflect.NativeMethodAccessorImpl.invoke0(Native Method)
	at sun.reflect.NativeMethodAccessorImpl.invoke(NativeMethodAccessorImpl.java:39)
	at sun.reflect.DelegatingMethodAccessorImpl.invoke(DelegatingMethodAccessorImpl.java:25)
	at java.lang.reflect.Method.invoke(Method.java:592)
	at org.codehaus.classworlds.Launcher.launchEnhanced(Launcher.java:315)
	at org.codehaus.classworlds.Launcher.launch(Launcher.java:255)
	at hudson.maven.agent.Main.launch(Main.java:185)
	at hudson.maven.MavenBuilder.call(MavenBuilder.java:151)
	at hudson.maven.Maven2Builder.call(Maven2Builder.java:77)
	at hudson.maven.Maven2Builder.call(Maven2Builder.java:53)
	at hudson.remoting.UserRequest.perform(UserRequest.java:118)
	at hudson.remoting.UserRequest.perform(UserRequest.java:48)
	at hudson.remoting.Request$2.run(Request.java:287)
	at hudson.remoting.InterceptingExecutorService$1.call(InterceptingExecutorService.java:72)
	at java.util.concurrent.FutureTask$Sync.innerRun(FutureTask.java:269)
	at java.util.concurrent.FutureTask.run(FutureTask.java:123)
	at java.util.concurrent.ThreadPoolExecutor$Worker.runTask(ThreadPoolExecutor.java:651)
	at java.util.concurrent.ThreadPoolExecutor$Worker.run(ThreadPoolExecutor.java:676)
	at java.lang.Thread.run(Thread.java:595)
Caused by: hudson.remoting.ChannelClosedException: channel is already closed
	at hudson.remoting.Channel.send(Channel.java:475)
	at hudson.remoting.Request.call(Request.java:110)
	at hudson.remoting.Channel.call(Channel.java:646)
	at hudson.remoting.RemoteInvocationHandler.invoke(RemoteInvocationHandler.java:158)
	... 30 more
Caused by: java.io.StreamCorruptedException
	at java.io.ObjectInputStream.readObject0(ObjectInputStream.java:1332)
	at java.io.ObjectInputStream.readObject(ObjectInputStream.java:348)
	at hudson.remoting.Command.readFrom(Command.java:90)
	at hudson.remoting.ClassicCommandTransport.read(ClassicCommandTransport.java:59)
	at hudson.remoting.SynchronousCommandTransport$ReaderThread.run(SynchronousCommandTransport.java:48)
[INFO] ------------------------------------------------------------------------
[INFO] Total time: 1 minute 16 seconds
[INFO] Finished at: Mon May 21 10:31:46 UTC 2012
ERROR: Maven JVM terminated unexpectedly with exit code 0


---------------------------------------------------------------------
To unsubscribe, e-mail: dev-unsubscribe@ws.apache.org
For additional commands, e-mail: dev-help@ws.apache.org


Mime
View raw message