ws-dev mailing list archives

Site index · List index
Message view « Date » · « Thread »
Top « Date » · « Thread »
From Apache Jenkins Server <jenk...@builds.apache.org>
Subject Build failed in Jenkins: ws-axiom-trunk #1014
Date Thu, 07 Jun 2012 01:14:54 GMT
See <https://builds.apache.org/job/ws-axiom-trunk/1014/>

------------------------------------------
[...truncated 329 lines...]

[INFO] 
[INFO] --- maven-assembly-plugin:2.2:single (source-release-assembly) @ axiom-testutils ---
mojoSucceeded org.apache.maven.plugins:maven-assembly-plugin:2.2(source-release-assembly)
Jun 7, 2012 1:14:38 AM hudson.maven.ExecutedMojo <init>
WARNING: Failed to getClass for org.apache.maven.plugin.source.SourceJarMojo
mojoStarted org.apache.maven.plugins:maven-source-plugin:2.1.2(attach-sources)
[INFO] 
[INFO] --- maven-source-plugin:2.1.2:jar (attach-sources) @ axiom-testutils ---
[INFO] org already added, skipping
[INFO] org/apache already added, skipping
[INFO] org/apache/axiom already added, skipping
[INFO] org/apache/axiom/testutils already added, skipping
[INFO] org/apache/axiom/testutils/conformance already added, skipping
[INFO] org already added, skipping
[INFO] org/apache already added, skipping
[INFO] org/apache/axiom already added, skipping
[INFO] org/apache/axiom/testutils already added, skipping
[INFO] org/apache/axiom/testutils/conformance already added, skipping
[INFO] META-INF already added, skipping
[INFO] META-INF/LICENSE already added, skipping
[INFO] META-INF/NOTICE already added, skipping
[INFO] META-INF/DEPENDENCIES already added, skipping
[INFO] Building jar: <https://builds.apache.org/job/ws-axiom-trunk/ws/axiom/modules/axiom-testutils/target/axiom-testutils-1.2.14-SNAPSHOT-sources.jar>
[INFO] org already added, skipping
[INFO] org/apache already added, skipping
[INFO] org/apache/axiom already added, skipping
[INFO] org/apache/axiom/testutils already added, skipping
[INFO] org/apache/axiom/testutils/conformance already added, skipping
[INFO] org already added, skipping
[INFO] org/apache already added, skipping
[INFO] org/apache/axiom already added, skipping
[INFO] org/apache/axiom/testutils already added, skipping
[INFO] org/apache/axiom/testutils/conformance already added, skipping
[INFO] META-INF already added, skipping
[INFO] META-INF/LICENSE already added, skipping
[INFO] META-INF/NOTICE already added, skipping
[INFO] META-INF/DEPENDENCIES already added, skipping
mojoSucceeded org.apache.maven.plugins:maven-source-plugin:2.1.2(attach-sources)
mojoStarted org.apache.maven.plugins:maven-javadoc-plugin:2.5(attach-javadocs)
[INFO] 
[INFO] --- maven-javadoc-plugin:2.5:jar (attach-javadocs) @ axiom-testutils ---
Loading source files for package org.apache.axiom.testutils...
Loading source files for package org.apache.axiom.testutils.concurrent...
Loading source files for package org.apache.axiom.testutils.stax...
Loading source files for package org.apache.axiom.testutils.io...
Loading source files for package org.apache.axiom.testutils.suite...
Loading source files for package org.apache.axiom.testutils.namespace...
Loading source files for package org.apache.axiom.testutils.activation...
Loading source files for package org.apache.axiom.testutils.conformance...
Constructing Javadoc information...
Standard Doclet version 1.5.0_22
Building tree for all the packages and classes...
Generating <https://builds.apache.org/job/ws-axiom-trunk/ws/axiom/modules/axiom-testutils/target/apidocs/org/apache/axiom/testutils//DigestUtils.html...>
Generating <https://builds.apache.org/job/ws-axiom-trunk/ws/axiom/modules/axiom-testutils/target/apidocs/org/apache/axiom/testutils//InvocationCounter.html...>
Generating <https://builds.apache.org/job/ws-axiom-trunk/ws/axiom/modules/axiom-testutils/target/apidocs/org/apache/axiom/testutils//PortAllocator.html...>
Generating <https://builds.apache.org/job/ws-axiom-trunk/ws/axiom/modules/axiom-testutils/target/apidocs/org/apache/axiom/testutils//RandomUtils.html...>
Generating <https://builds.apache.org/job/ws-axiom-trunk/ws/axiom/modules/axiom-testutils/target/apidocs/org/apache/axiom/testutils/concurrent//Action.html...>
Generating <https://builds.apache.org/job/ws-axiom-trunk/ws/axiom/modules/axiom-testutils/target/apidocs/org/apache/axiom/testutils/concurrent//ConcurrentTestUtils.html...>
Generating <https://builds.apache.org/job/ws-axiom-trunk/ws/axiom/modules/axiom-testutils/target/apidocs/org/apache/axiom/testutils/stax//XMLStreamReaderComparator.html...>
Generating <https://builds.apache.org/job/ws-axiom-trunk/ws/axiom/modules/axiom-testutils/target/apidocs/org/apache/axiom/testutils/io//ByteStreamComparator.html...>
Generating <https://builds.apache.org/job/ws-axiom-trunk/ws/axiom/modules/axiom-testutils/target/apidocs/org/apache/axiom/testutils/io//CharacterStreamComparator.html...>
Generating <https://builds.apache.org/job/ws-axiom-trunk/ws/axiom/modules/axiom-testutils/target/apidocs/org/apache/axiom/testutils/io//CloseSensorInputStream.html...>
Generating <https://builds.apache.org/job/ws-axiom-trunk/ws/axiom/modules/axiom-testutils/target/apidocs/org/apache/axiom/testutils/io//CloseSensorReader.html...>
Generating <https://builds.apache.org/job/ws-axiom-trunk/ws/axiom/modules/axiom-testutils/target/apidocs/org/apache/axiom/testutils/io//CloseSensorWriter.html...>
Generating <https://builds.apache.org/job/ws-axiom-trunk/ws/axiom/modules/axiom-testutils/target/apidocs/org/apache/axiom/testutils/io//ExceptionInputStream.html...>
Generating <https://builds.apache.org/job/ws-axiom-trunk/ws/axiom/modules/axiom-testutils/target/apidocs/org/apache/axiom/testutils/io//IOTestUtils.html...>
Generating <https://builds.apache.org/job/ws-axiom-trunk/ws/axiom/modules/axiom-testutils/target/apidocs/org/apache/axiom/testutils/suite//TestCaseEx.html...>
Generating <https://builds.apache.org/job/ws-axiom-trunk/ws/axiom/modules/axiom-testutils/target/apidocs/org/apache/axiom/testutils/suite//TestSuiteBuilder.html...>
Generating <https://builds.apache.org/job/ws-axiom-trunk/ws/axiom/modules/axiom-testutils/target/apidocs/org/apache/axiom/testutils/namespace//NamespaceContextTestUtils.html...>
Generating <https://builds.apache.org/job/ws-axiom-trunk/ws/axiom/modules/axiom-testutils/target/apidocs/org/apache/axiom/testutils/activation//RandomDataSource.html...>
Generating <https://builds.apache.org/job/ws-axiom-trunk/ws/axiom/modules/axiom-testutils/target/apidocs/org/apache/axiom/testutils/activation//TestDataSource.html...>
Generating <https://builds.apache.org/job/ws-axiom-trunk/ws/axiom/modules/axiom-testutils/target/apidocs/org/apache/axiom/testutils/conformance//Conformance.html...>
Generating <https://builds.apache.org/job/ws-axiom-trunk/ws/axiom/modules/axiom-testutils/target/apidocs/overview-frame.html...>
Generating <https://builds.apache.org/job/ws-axiom-trunk/ws/axiom/modules/axiom-testutils/target/apidocs/org/apache/axiom/testutils//package-frame.html...>
Generating <https://builds.apache.org/job/ws-axiom-trunk/ws/axiom/modules/axiom-testutils/target/apidocs/org/apache/axiom/testutils//package-summary.html...>
Generating <https://builds.apache.org/job/ws-axiom-trunk/ws/axiom/modules/axiom-testutils/target/apidocs/org/apache/axiom/testutils//package-tree.html...>
Generating <https://builds.apache.org/job/ws-axiom-trunk/ws/axiom/modules/axiom-testutils/target/apidocs/org/apache/axiom/testutils/activation//package-frame.html...>
Generating <https://builds.apache.org/job/ws-axiom-trunk/ws/axiom/modules/axiom-testutils/target/apidocs/org/apache/axiom/testutils/activation//package-summary.html...>
Generating <https://builds.apache.org/job/ws-axiom-trunk/ws/axiom/modules/axiom-testutils/target/apidocs/org/apache/axiom/testutils/activation//package-tree.html...>
Generating <https://builds.apache.org/job/ws-axiom-trunk/ws/axiom/modules/axiom-testutils/target/apidocs/org/apache/axiom/testutils/concurrent//package-frame.html...>
Generating <https://builds.apache.org/job/ws-axiom-trunk/ws/axiom/modules/axiom-testutils/target/apidocs/org/apache/axiom/testutils/concurrent//package-summary.html...>
Generating <https://builds.apache.org/job/ws-axiom-trunk/ws/axiom/modules/axiom-testutils/target/apidocs/org/apache/axiom/testutils/concurrent//package-tree.html...>
Generating <https://builds.apache.org/job/ws-axiom-trunk/ws/axiom/modules/axiom-testutils/target/apidocs/org/apache/axiom/testutils/conformance//package-frame.html...>
Generating <https://builds.apache.org/job/ws-axiom-trunk/ws/axiom/modules/axiom-testutils/target/apidocs/org/apache/axiom/testutils/conformance//package-summary.html...>
Generating <https://builds.apache.org/job/ws-axiom-trunk/ws/axiom/modules/axiom-testutils/target/apidocs/org/apache/axiom/testutils/conformance//package-tree.html...>
Generating <https://builds.apache.org/job/ws-axiom-trunk/ws/axiom/modules/axiom-testutils/target/apidocs/org/apache/axiom/testutils/io//package-frame.html...>
Generating <https://builds.apache.org/job/ws-axiom-trunk/ws/axiom/modules/axiom-testutils/target/apidocs/org/apache/axiom/testutils/io//package-summary.html...>
Generating <https://builds.apache.org/job/ws-axiom-trunk/ws/axiom/modules/axiom-testutils/target/apidocs/org/apache/axiom/testutils/io//package-tree.html...>
Generating <https://builds.apache.org/job/ws-axiom-trunk/ws/axiom/modules/axiom-testutils/target/apidocs/org/apache/axiom/testutils/namespace//package-frame.html...>
Generating <https://builds.apache.org/job/ws-axiom-trunk/ws/axiom/modules/axiom-testutils/target/apidocs/org/apache/axiom/testutils/namespace//package-summary.html...>
Generating <https://builds.apache.org/job/ws-axiom-trunk/ws/axiom/modules/axiom-testutils/target/apidocs/org/apache/axiom/testutils/namespace//package-tree.html...>
Generating <https://builds.apache.org/job/ws-axiom-trunk/ws/axiom/modules/axiom-testutils/target/apidocs/org/apache/axiom/testutils/stax//package-frame.html...>
Generating <https://builds.apache.org/job/ws-axiom-trunk/ws/axiom/modules/axiom-testutils/target/apidocs/org/apache/axiom/testutils/stax//package-summary.html...>
Generating <https://builds.apache.org/job/ws-axiom-trunk/ws/axiom/modules/axiom-testutils/target/apidocs/org/apache/axiom/testutils/stax//package-tree.html...>
Generating <https://builds.apache.org/job/ws-axiom-trunk/ws/axiom/modules/axiom-testutils/target/apidocs/org/apache/axiom/testutils/suite//package-frame.html...>
Generating <https://builds.apache.org/job/ws-axiom-trunk/ws/axiom/modules/axiom-testutils/target/apidocs/org/apache/axiom/testutils/suite//package-summary.html...>
Generating <https://builds.apache.org/job/ws-axiom-trunk/ws/axiom/modules/axiom-testutils/target/apidocs/org/apache/axiom/testutils/suite//package-tree.html...>
Generating <https://builds.apache.org/job/ws-axiom-trunk/ws/axiom/modules/axiom-testutils/target/apidocs/constant-values.html...>
Generating <https://builds.apache.org/job/ws-axiom-trunk/ws/axiom/modules/axiom-testutils/target/apidocs/org/apache/axiom/testutils/class-use//RandomUtils.html...>
Generating <https://builds.apache.org/job/ws-axiom-trunk/ws/axiom/modules/axiom-testutils/target/apidocs/org/apache/axiom/testutils/class-use//DigestUtils.html...>
Generating <https://builds.apache.org/job/ws-axiom-trunk/ws/axiom/modules/axiom-testutils/target/apidocs/org/apache/axiom/testutils/class-use//InvocationCounter.html...>
Generating <https://builds.apache.org/job/ws-axiom-trunk/ws/axiom/modules/axiom-testutils/target/apidocs/org/apache/axiom/testutils/class-use//PortAllocator.html...>
Generating <https://builds.apache.org/job/ws-axiom-trunk/ws/axiom/modules/axiom-testutils/target/apidocs/org/apache/axiom/testutils/concurrent/class-use//Action.html...>
Generating <https://builds.apache.org/job/ws-axiom-trunk/ws/axiom/modules/axiom-testutils/target/apidocs/org/apache/axiom/testutils/concurrent/class-use//ConcurrentTestUtils.html...>
Generating <https://builds.apache.org/job/ws-axiom-trunk/ws/axiom/modules/axiom-testutils/target/apidocs/org/apache/axiom/testutils/stax/class-use//XMLStreamReaderComparator.html...>
Generating <https://builds.apache.org/job/ws-axiom-trunk/ws/axiom/modules/axiom-testutils/target/apidocs/org/apache/axiom/testutils/io/class-use//CloseSensorReader.html...>
Generating <https://builds.apache.org/job/ws-axiom-trunk/ws/axiom/modules/axiom-testutils/target/apidocs/org/apache/axiom/testutils/io/class-use//CloseSensorWriter.html...>
Generating <https://builds.apache.org/job/ws-axiom-trunk/ws/axiom/modules/axiom-testutils/target/apidocs/org/apache/axiom/testutils/io/class-use//ExceptionInputStream.html...>
Generating <https://builds.apache.org/job/ws-axiom-trunk/ws/axiom/modules/axiom-testutils/target/apidocs/org/apache/axiom/testutils/io/class-use//CloseSensorInputStream.html...>
Generating <https://builds.apache.org/job/ws-axiom-trunk/ws/axiom/modules/axiom-testutils/target/apidocs/org/apache/axiom/testutils/io/class-use//IOTestUtils.html...>
Generating <https://builds.apache.org/job/ws-axiom-trunk/ws/axiom/modules/axiom-testutils/target/apidocs/org/apache/axiom/testutils/io/class-use//ByteStreamComparator.html...>
Generating <https://builds.apache.org/job/ws-axiom-trunk/ws/axiom/modules/axiom-testutils/target/apidocs/org/apache/axiom/testutils/io/class-use//CharacterStreamComparator.html...>
Generating <https://builds.apache.org/job/ws-axiom-trunk/ws/axiom/modules/axiom-testutils/target/apidocs/org/apache/axiom/testutils/suite/class-use//TestSuiteBuilder.html...>
Generating <https://builds.apache.org/job/ws-axiom-trunk/ws/axiom/modules/axiom-testutils/target/apidocs/org/apache/axiom/testutils/suite/class-use//TestCaseEx.html...>
Generating <https://builds.apache.org/job/ws-axiom-trunk/ws/axiom/modules/axiom-testutils/target/apidocs/org/apache/axiom/testutils/namespace/class-use//NamespaceContextTestUtils.html...>
Generating <https://builds.apache.org/job/ws-axiom-trunk/ws/axiom/modules/axiom-testutils/target/apidocs/org/apache/axiom/testutils/activation/class-use//TestDataSource.html...>
Generating <https://builds.apache.org/job/ws-axiom-trunk/ws/axiom/modules/axiom-testutils/target/apidocs/org/apache/axiom/testutils/activation/class-use//RandomDataSource.html...>
Generating <https://builds.apache.org/job/ws-axiom-trunk/ws/axiom/modules/axiom-testutils/target/apidocs/org/apache/axiom/testutils/conformance/class-use//Conformance.html...>
Generating <https://builds.apache.org/job/ws-axiom-trunk/ws/axiom/modules/axiom-testutils/target/apidocs/org/apache/axiom/testutils//package-use.html...>
Generating <https://builds.apache.org/job/ws-axiom-trunk/ws/axiom/modules/axiom-testutils/target/apidocs/org/apache/axiom/testutils/activation//package-use.html...>
Generating <https://builds.apache.org/job/ws-axiom-trunk/ws/axiom/modules/axiom-testutils/target/apidocs/org/apache/axiom/testutils/concurrent//package-use.html...>
Generating <https://builds.apache.org/job/ws-axiom-trunk/ws/axiom/modules/axiom-testutils/target/apidocs/org/apache/axiom/testutils/conformance//package-use.html...>
Generating <https://builds.apache.org/job/ws-axiom-trunk/ws/axiom/modules/axiom-testutils/target/apidocs/org/apache/axiom/testutils/io//package-use.html...>
Generating <https://builds.apache.org/job/ws-axiom-trunk/ws/axiom/modules/axiom-testutils/target/apidocs/org/apache/axiom/testutils/namespace//package-use.html...>
Generating <https://builds.apache.org/job/ws-axiom-trunk/ws/axiom/modules/axiom-testutils/target/apidocs/org/apache/axiom/testutils/stax//package-use.html...>
Generating <https://builds.apache.org/job/ws-axiom-trunk/ws/axiom/modules/axiom-testutils/target/apidocs/org/apache/axiom/testutils/suite//package-use.html...>
Building index for all the packages and classes...
Generating <https://builds.apache.org/job/ws-axiom-trunk/ws/axiom/modules/axiom-testutils/target/apidocs/overview-tree.html...>
Generating <https://builds.apache.org/job/ws-axiom-trunk/ws/axiom/modules/axiom-testutils/target/apidocs/index-all.html...>
Generating <https://builds.apache.org/job/ws-axiom-trunk/ws/axiom/modules/axiom-testutils/target/apidocs/deprecated-list.html...>
Building index for all classes...
Generating <https://builds.apache.org/job/ws-axiom-trunk/ws/axiom/modules/axiom-testutils/target/apidocs/allclasses-frame.html...>
Generating <https://builds.apache.org/job/ws-axiom-trunk/ws/axiom/modules/axiom-testutils/target/apidocs/allclasses-noframe.html...>
Generating <https://builds.apache.org/job/ws-axiom-trunk/ws/axiom/modules/axiom-testutils/target/apidocs/index.html...>
Generating <https://builds.apache.org/job/ws-axiom-trunk/ws/axiom/modules/axiom-testutils/target/apidocs/overview-summary.html...>
Generating <https://builds.apache.org/job/ws-axiom-trunk/ws/axiom/modules/axiom-testutils/target/apidocs/help-doc.html...>
Generating <https://builds.apache.org/job/ws-axiom-trunk/ws/axiom/modules/axiom-testutils/target/apidocs/stylesheet.css...>
[INFO] Building jar: <https://builds.apache.org/job/ws-axiom-trunk/ws/axiom/modules/axiom-testutils/target/axiom-testutils-1.2.14-SNAPSHOT-javadoc.jar>
mojoSucceeded org.apache.maven.plugins:maven-javadoc-plugin:2.5(attach-javadocs)
mojoStarted org.apache.maven.plugins:maven-gpg-plugin:1.1(default)
[INFO] 
[INFO] --- maven-gpg-plugin:1.1:sign (default) @ axiom-testutils ---
mojoSucceeded org.apache.maven.plugins:maven-gpg-plugin:1.1(default)
mojoStarted org.apache.rat:apache-rat-plugin:0.8(default)[INFO] Exclude: src/test/resources/**
[INFO] Exclude: dependency-reduced-pom.xml

[INFO] 
[INFO] --- apache-rat-plugin:0.8:check (default) @ axiom-testutils ---
mojoFailed org.apache.rat:apache-rat-plugin:0.8(default)
projectFailed org.apache.ws.commons.axiom:axiom-testutils:1.2.14-SNAPSHOT
sessionEnded
[INFO] ------------------------------------------------------------------------
[INFO] Reactor Summary:
[INFO] 
[INFO] Axiom Parent POM .................................. SUCCESS [23.837s]
[INFO] Axiom Build Utilities ............................. SUCCESS [12.463s]
[INFO] Axiom Test Utilities .............................. FAILURE [8.578s]
[INFO] Axiom Jaxen Test Suite ............................ SKIPPED
[INFO] Axiom DOM Test Suite .............................. SKIPPED
[INFO] Axiom API ......................................... SKIPPED
[INFO] Axiom Implementation Test Suite ................... SKIPPED
[INFO] Axiom Common Implementation Classes ............... SKIPPED
[INFO] Axiom Common Implementation Test Suite ............ SKIPPED
[INFO] Axiom Impl ........................................ SKIPPED
[INFO] Axiom DOM ......................................... SKIPPED
[INFO] Axiom Compatibility Classes ....................... SKIPPED
[INFO] Axiom C14N ........................................ SKIPPED
[INFO] Axiom Test Suite .................................. SKIPPED
[INFO] Axiom OSGi Tests .................................. SKIPPED
[INFO] Axiom Integration Test Suite ...................... SKIPPED
[INFO] Axiom Uber-JAR .................................... SKIPPED
[INFO] Axiom Samples ..................................... SKIPPED
[INFO] Axiom ............................................. SKIPPED
[INFO] ------------------------------------------------------------------------
[INFO] BUILD FAILURE
[INFO] ------------------------------------------------------------------------
[INFO] Total time: 49.285s
[INFO] Finished at: Thu Jun 07 01:14:41 UTC 2012
[INFO] Final Memory: 24M/132M
[INFO] ------------------------------------------------------------------------
Projects to build: [MavenProject: org.apache.ws.commons.axiom:axiom-parent:1.2.14-SNAPSHOT
@ <https://builds.apache.org/job/ws-axiom-trunk/ws/axiom/modules/axiom-parent/pom.xml,>
MavenProject: org.apache.ws.commons.axiom:axiom-buildutils:1.2.14-SNAPSHOT @ <https://builds.apache.org/job/ws-axiom-trunk/ws/axiom/modules/axiom-buildutils/pom.xml,>
MavenProject: org.apache.ws.commons.axiom:axiom-testutils:1.2.14-SNAPSHOT @ <https://builds.apache.org/job/ws-axiom-trunk/ws/axiom/modules/axiom-testutils/pom.xml,>
MavenProject: org.apache.ws.commons.axiom:axiom-jaxen-testsuite:1.2.14-SNAPSHOT @ <https://builds.apache.org/job/ws-axiom-trunk/ws/axiom/modules/axiom-jaxen-testsuite/pom.xml,>
MavenProject: org.apache.ws.commons.axiom:axiom-dom-testsuite:1.2.14-SNAPSHOT @ <https://builds.apache.org/job/ws-axiom-trunk/ws/axiom/modules/axiom-dom-testsuite/pom.xml,>
MavenProject: org.apache.ws.commons.axiom:axiom-api:1.2.14-SNAPSHOT @ <https://builds.apache.org/job/ws-axiom-trunk/ws/axiom/modules/axiom-api/pom.xml,>
MavenProject: org.apache.ws.commons.axiom:axiom-testsuite:1.2.14-SNAPSHOT @ <https://builds.apache.org/job/ws-axiom-trunk/ws/axiom/modules/axiom-testsuite/pom.xml,>
MavenProject: org.apache.ws.commons.axiom:axiom-common-impl:1.2.14-SNAPSHOT @ <https://builds.apache.org/job/ws-axiom-trunk/ws/axiom/modules/axiom-common-impl/pom.xml,>
MavenProject: org.apache.ws.commons.axiom:axiom-common-impl-testsuite:1.2.14-SNAPSHOT @ <https://builds.apache.org/job/ws-axiom-trunk/ws/axiom/modules/axiom-common-impl-testsuite/pom.xml,>
MavenProject: org.apache.ws.commons.axiom:axiom-impl:1.2.14-SNAPSHOT @ <https://builds.apache.org/job/ws-axiom-trunk/ws/axiom/modules/axiom-impl/pom.xml,>
MavenProject: org.apache.ws.commons.axiom:axiom-dom:1.2.14-SNAPSHOT @ <https://builds.apache.org/job/ws-axiom-trunk/ws/axiom/modules/axiom-dom/pom.xml,>
MavenProject: org.apache.ws.commons.axiom:axiom-compat:1.2.14-SNAPSHOT @ <https://builds.apache.org/job/ws-axiom-trunk/ws/axiom/modules/axiom-compat/pom.xml,>
MavenProject: org.apache.ws.commons.axiom:axiom-c14n:1.2.14-SNAPSHOT @ <https://builds.apache.org/job/ws-axiom-trunk/ws/axiom/modules/axiom-c14n/pom.xml,>
MavenProject: org.apache.ws.commons.axiom:axiom-tests:1.2.14-SNAPSHOT @ <https://builds.apache.org/job/ws-axiom-trunk/ws/axiom/modules/axiom-tests/pom.xml,>
MavenProject: org.apache.ws.commons.axiom:axiom-osgi-tests:1.2.14-SNAPSHOT @ <https://builds.apache.org/job/ws-axiom-trunk/ws/axiom/modules/axiom-osgi-tests/pom.xml,>
MavenProject: org.apache.ws.commons.axiom:axiom-integration:1.2.14-SNAPSHOT @ <https://builds.apache.org/job/ws-axiom-trunk/ws/axiom/modules/axiom-integration/pom.xml,>
MavenProject: org.apache.ws.commons.axiom:axiom-all:1.2.14-SNAPSHOT @ <https://builds.apache.org/job/ws-axiom-trunk/ws/axiom/modules/axiom-all/pom.xml,>
MavenProject: org.apache.ws.commons.axiom:axiom-samples:1.2.14-SNAPSHOT @ <https://builds.apache.org/job/ws-axiom-trunk/ws/axiom/modules/axiom-samples/pom.xml,>
MavenProject: org.apache.ws.commons.axiom:axiom:1.2.14-SNAPSHOT @ <https://builds.apache.org/job/ws-axiom-trunk/ws/axiom/pom.xml]>
[JENKINS] Archiving <https://builds.apache.org/job/ws-axiom-trunk/ws/axiom/modules/axiom-impl/pom.xml>
to /home/hudson/hudson/jobs/ws-axiom-trunk/modules/org.apache.ws.commons.axiom$axiom-impl/builds/2012-06-07_01-13-38/archive/org.apache.ws.commons.axiom/axiom-impl/1.2.14-SNAPSHOT/axiom-impl-1.2.14-SNAPSHOT.pom
[JENKINS] Archiving <https://builds.apache.org/job/ws-axiom-trunk/ws/axiom/modules/axiom-common-impl/pom.xml>
to /home/hudson/hudson/jobs/ws-axiom-trunk/modules/org.apache.ws.commons.axiom$axiom-common-impl/builds/2012-06-07_01-13-38/archive/org.apache.ws.commons.axiom/axiom-common-impl/1.2.14-SNAPSHOT/axiom-common-impl-1.2.14-SNAPSHOT.pom
[JENKINS] Archiving <https://builds.apache.org/job/ws-axiom-trunk/ws/axiom/modules/axiom-buildutils/pom.xml>
to /home/hudson/hudson/jobs/ws-axiom-trunk/modules/org.apache.ws.commons.axiom$axiom-buildutils/builds/2012-06-07_01-13-37/archive/org.apache.ws.commons.axiom/axiom-buildutils/1.2.14-SNAPSHOT/axiom-buildutils-1.2.14-SNAPSHOT.pom
[JENKINS] Archiving <https://builds.apache.org/job/ws-axiom-trunk/ws/axiom/modules/axiom-buildutils/target/axiom-buildutils-1.2.14-SNAPSHOT.jar>
to /home/hudson/hudson/jobs/ws-axiom-trunk/modules/org.apache.ws.commons.axiom$axiom-buildutils/builds/2012-06-07_01-13-37/archive/org.apache.ws.commons.axiom/axiom-buildutils/1.2.14-20120607.011428-171/axiom-buildutils-1.2.14-20120607.011428-171.jar
[JENKINS] Archiving <https://builds.apache.org/job/ws-axiom-trunk/ws/axiom/modules/axiom-buildutils/target/axiom-buildutils-1.2.14-SNAPSHOT-sources.jar>
to /home/hudson/hudson/jobs/ws-axiom-trunk/modules/org.apache.ws.commons.axiom$axiom-buildutils/builds/2012-06-07_01-13-37/archive/org.apache.ws.commons.axiom/axiom-buildutils/1.2.14-20120607.011428-171/axiom-buildutils-1.2.14-20120607.011428-171-sources.jar
[JENKINS] Archiving <https://builds.apache.org/job/ws-axiom-trunk/ws/axiom/modules/axiom-buildutils/target/axiom-buildutils-1.2.14-SNAPSHOT-javadoc.jar>
to /home/hudson/hudson/jobs/ws-axiom-trunk/modules/org.apache.ws.commons.axiom$axiom-buildutils/builds/2012-06-07_01-13-37/archive/org.apache.ws.commons.axiom/axiom-buildutils/1.2.14-20120607.011428-171/axiom-buildutils-1.2.14-20120607.011428-171-javadoc.jar
[JENKINS] Archiving <https://builds.apache.org/job/ws-axiom-trunk/ws/axiom/modules/axiom-tests/pom.xml>
to /home/hudson/hudson/jobs/ws-axiom-trunk/modules/org.apache.ws.commons.axiom$axiom-tests/builds/2012-06-07_01-13-39/archive/org.apache.ws.commons.axiom/axiom-tests/1.2.14-SNAPSHOT/axiom-tests-1.2.14-SNAPSHOT.pom
[JENKINS] Archiving <https://builds.apache.org/job/ws-axiom-trunk/ws/axiom/modules/axiom-jaxen-testsuite/pom.xml>
to /home/hudson/hudson/jobs/ws-axiom-trunk/modules/org.apache.ws.commons.axiom$axiom-jaxen-testsuite/builds/2012-06-07_01-13-37/archive/org.apache.ws.commons.axiom/axiom-jaxen-testsuite/1.2.14-SNAPSHOT/axiom-jaxen-testsuite-1.2.14-SNAPSHOT.pom
[JENKINS] Archiving <https://builds.apache.org/job/ws-axiom-trunk/ws/axiom/modules/axiom-testutils/pom.xml>
to /home/hudson/hudson/jobs/ws-axiom-trunk/modules/org.apache.ws.commons.axiom$axiom-testutils/builds/2012-06-07_01-13-37/archive/org.apache.ws.commons.axiom/axiom-testutils/1.2.14-SNAPSHOT/axiom-testutils-1.2.14-SNAPSHOT.pom
[JENKINS] Archiving <https://builds.apache.org/job/ws-axiom-trunk/ws/axiom/modules/axiom-testutils/target/axiom-testutils-1.2.14-SNAPSHOT.jar>
to /home/hudson/hudson/jobs/ws-axiom-trunk/modules/org.apache.ws.commons.axiom$axiom-testutils/builds/2012-06-07_01-13-37/archive/org.apache.ws.commons.axiom/axiom-testutils/1.2.14-SNAPSHOT/axiom-testutils-1.2.14-SNAPSHOT.jar
[JENKINS] Archiving <https://builds.apache.org/job/ws-axiom-trunk/ws/axiom/modules/axiom-testutils/target/axiom-testutils-1.2.14-SNAPSHOT-sources.jar>
to /home/hudson/hudson/jobs/ws-axiom-trunk/modules/org.apache.ws.commons.axiom$axiom-testutils/builds/2012-06-07_01-13-37/archive/org.apache.ws.commons.axiom/axiom-testutils/1.2.14-SNAPSHOT/axiom-testutils-1.2.14-SNAPSHOT-sources.jar
[JENKINS] Archiving <https://builds.apache.org/job/ws-axiom-trunk/ws/axiom/modules/axiom-testutils/target/axiom-testutils-1.2.14-SNAPSHOT-javadoc.jar>
to /home/hudson/hudson/jobs/ws-axiom-trunk/modules/org.apache.ws.commons.axiom$axiom-testutils/builds/2012-06-07_01-13-37/archive/org.apache.ws.commons.axiom/axiom-testutils/1.2.14-SNAPSHOT/axiom-testutils-1.2.14-SNAPSHOT-javadoc.jar
[JENKINS] Archiving <https://builds.apache.org/job/ws-axiom-trunk/ws/axiom/modules/axiom-api/pom.xml>
to /home/hudson/hudson/jobs/ws-axiom-trunk/modules/org.apache.ws.commons.axiom$axiom-api/builds/2012-06-07_01-13-38/archive/org.apache.ws.commons.axiom/axiom-api/1.2.14-SNAPSHOT/axiom-api-1.2.14-SNAPSHOT.pom
[JENKINS] Archiving <https://builds.apache.org/job/ws-axiom-trunk/ws/axiom/modules/axiom-samples/pom.xml>
to /home/hudson/hudson/jobs/ws-axiom-trunk/modules/org.apache.ws.commons.axiom$axiom-samples/builds/2012-06-07_01-13-39/archive/org.apache.ws.commons.axiom/axiom-samples/1.2.14-SNAPSHOT/axiom-samples-1.2.14-SNAPSHOT.pom
[JENKINS] Archiving <https://builds.apache.org/job/ws-axiom-trunk/ws/axiom/modules/axiom-all/pom.xml>
to /home/hudson/hudson/jobs/ws-axiom-trunk/modules/org.apache.ws.commons.axiom$axiom-all/builds/2012-06-07_01-13-39/archive/org.apache.ws.commons.axiom/axiom-all/1.2.14-SNAPSHOT/axiom-all-1.2.14-SNAPSHOT.pom
[JENKINS] Archiving <https://builds.apache.org/job/ws-axiom-trunk/ws/axiom/modules/axiom-dom/pom.xml>
to /home/hudson/hudson/jobs/ws-axiom-trunk/modules/org.apache.ws.commons.axiom$axiom-dom/builds/2012-06-07_01-13-38/archive/org.apache.ws.commons.axiom/axiom-dom/1.2.14-SNAPSHOT/axiom-dom-1.2.14-SNAPSHOT.pom
[JENKINS] Archiving <https://builds.apache.org/job/ws-axiom-trunk/ws/axiom/modules/axiom-dom-testsuite/pom.xml>
to /home/hudson/hudson/jobs/ws-axiom-trunk/modules/org.apache.ws.commons.axiom$axiom-dom-testsuite/builds/2012-06-07_01-13-38/archive/org.apache.ws.commons.axiom/axiom-dom-testsuite/1.2.14-SNAPSHOT/axiom-dom-testsuite-1.2.14-SNAPSHOT.pom
[JENKINS] Archiving <https://builds.apache.org/job/ws-axiom-trunk/ws/axiom/modules/axiom-testsuite/pom.xml>
to /home/hudson/hudson/jobs/ws-axiom-trunk/modules/org.apache.ws.commons.axiom$axiom-testsuite/builds/2012-06-07_01-13-38/archive/org.apache.ws.commons.axiom/axiom-testsuite/1.2.14-SNAPSHOT/axiom-testsuite-1.2.14-SNAPSHOT.pom
[JENKINS] Archiving <https://builds.apache.org/job/ws-axiom-trunk/ws/axiom/modules/axiom-c14n/pom.xml>
to /home/hudson/hudson/jobs/ws-axiom-trunk/modules/org.apache.ws.commons.axiom$axiom-c14n/builds/2012-06-07_01-13-39/archive/org.apache.ws.commons.axiom/axiom-c14n/1.2.14-SNAPSHOT/axiom-c14n-1.2.14-SNAPSHOT.pom
[JENKINS] Archiving <https://builds.apache.org/job/ws-axiom-trunk/ws/axiom/pom.xml>
to /home/hudson/hudson/jobs/ws-axiom-trunk/modules/org.apache.ws.commons.axiom$axiom/builds/2012-06-07_01-13-37/archive/org.apache.ws.commons.axiom/axiom/1.2.14-SNAPSHOT/axiom-1.2.14-SNAPSHOT.pom
[JENKINS] Archiving <https://builds.apache.org/job/ws-axiom-trunk/ws/axiom/modules/axiom-parent/pom.xml>
to /home/hudson/hudson/jobs/ws-axiom-trunk/modules/org.apache.ws.commons.axiom$axiom-parent/builds/2012-06-07_01-13-37/archive/org.apache.ws.commons.axiom/axiom-parent/1.2.14-SNAPSHOT/axiom-parent-1.2.14-SNAPSHOT.pom
[JENKINS] Archiving <https://builds.apache.org/job/ws-axiom-trunk/ws/axiom/modules/axiom-common-impl-testsuite/pom.xml>
to /home/hudson/hudson/jobs/ws-axiom-trunk/modules/org.apache.ws.commons.axiom$axiom-common-impl-testsuite/builds/2012-06-07_01-13-38/archive/org.apache.ws.commons.axiom/axiom-common-impl-testsuite/1.2.14-SNAPSHOT/axiom-common-impl-testsuite-1.2.14-SNAPSHOT.pom
[JENKINS] Archiving <https://builds.apache.org/job/ws-axiom-trunk/ws/axiom/modules/axiom-compat/pom.xml>
to /home/hudson/hudson/jobs/ws-axiom-trunk/modules/org.apache.ws.commons.axiom$axiom-compat/builds/2012-06-07_01-13-38/archive/org.apache.ws.commons.axiom/axiom-compat/1.2.14-SNAPSHOT/axiom-compat-1.2.14-SNAPSHOT.pom
[JENKINS] Archiving <https://builds.apache.org/job/ws-axiom-trunk/ws/axiom/modules/axiom-osgi-tests/pom.xml>
to /home/hudson/hudson/jobs/ws-axiom-trunk/modules/org.apache.ws.commons.axiom$axiom-osgi-tests/builds/2012-06-07_01-13-39/archive/org.apache.ws.commons.axiom/axiom-osgi-tests/1.2.14-SNAPSHOT/axiom-osgi-tests-1.2.14-SNAPSHOT.pom
[JENKINS] Archiving <https://builds.apache.org/job/ws-axiom-trunk/ws/axiom/modules/axiom-integration/pom.xml>
to /home/hudson/hudson/jobs/ws-axiom-trunk/modules/org.apache.ws.commons.axiom$axiom-integration/builds/2012-06-07_01-13-39/archive/org.apache.ws.commons.axiom/axiom-integration/1.2.14-SNAPSHOT/axiom-integration-1.2.14-SNAPSHOT.pom
Waiting for Jenkins to finish collecting data
mavenExecutionResult exceptions not empty
message : Failed to execute goal org.apache.rat:apache-rat-plugin:0.8:check (default) on project
axiom-testutils: Too many unapproved licenses: 13
cause : Too many unapproved licenses: 13
Stack trace : 
org.apache.maven.lifecycle.LifecycleExecutionException: Failed to execute goal org.apache.rat:apache-rat-plugin:0.8:check
(default) on project axiom-testutils: Too many unapproved licenses: 13
	at org.apache.maven.lifecycle.internal.MojoExecutor.execute(MojoExecutor.java:213)
	at org.apache.maven.lifecycle.internal.MojoExecutor.execute(MojoExecutor.java:153)
	at org.apache.maven.lifecycle.internal.MojoExecutor.execute(MojoExecutor.java:145)
	at org.apache.maven.lifecycle.internal.LifecycleModuleBuilder.buildProject(LifecycleModuleBuilder.java:84)
	at org.apache.maven.lifecycle.internal.LifecycleModuleBuilder.buildProject(LifecycleModuleBuilder.java:59)
	at org.apache.maven.lifecycle.internal.LifecycleStarter.singleThreadedBuild(LifecycleStarter.java:183)
	at org.apache.maven.lifecycle.internal.LifecycleStarter.execute(LifecycleStarter.java:161)
	at org.apache.maven.DefaultMaven.doExecute(DefaultMaven.java:320)
	at org.apache.maven.DefaultMaven.execute(DefaultMaven.java:156)
	at org.jvnet.hudson.maven3.launcher.Maven3Launcher.main(Maven3Launcher.java:79)
	at sun.reflect.NativeMethodAccessorImpl.invoke0(Native Method)
	at sun.reflect.NativeMethodAccessorImpl.invoke(NativeMethodAccessorImpl.java:39)
	at sun.reflect.DelegatingMethodAccessorImpl.invoke(DelegatingMethodAccessorImpl.java:25)
	at java.lang.reflect.Method.invoke(Method.java:592)
	at org.codehaus.plexus.classworlds.launcher.Launcher.launchStandard(Launcher.java:329)
	at org.codehaus.plexus.classworlds.launcher.Launcher.launch(Launcher.java:239)
	at org.jvnet.hudson.maven3.agent.Maven3Main.launch(Maven3Main.java:158)
	at hudson.maven.Maven3Builder.call(Maven3Builder.java:98)
	at hudson.maven.Maven3Builder.call(Maven3Builder.java:64)
	at hudson.remoting.UserRequest.perform(UserRequest.java:118)
	at hudson.remoting.UserRequest.perform(UserRequest.java:48)
	at hudson.remoting.Request$2.run(Request.java:287)
	at hudson.remoting.InterceptingExecutorService$1.call(InterceptingExecutorService.java:72)
	at java.util.concurrent.FutureTask$Sync.innerRun(FutureTask.java:269)
	at java.util.concurrent.FutureTask.run(FutureTask.java:123)
	at java.util.concurrent.ThreadPoolExecutor$Worker.runTask(ThreadPoolExecutor.java:651)
	at java.util.concurrent.ThreadPoolExecutor$Worker.run(ThreadPoolExecutor.java:676)
	at java.lang.Thread.run(Thread.java:595)
Caused by: org.apache.rat.mp.RatCheckException: Too many unapproved licenses: 13
	at org.apache.rat.mp.RatCheckMojo.check(RatCheckMojo.java:167)
	at org.apache.rat.mp.RatCheckMojo.execute(RatCheckMojo.java:159)
	at org.apache.maven.plugin.DefaultBuildPluginManager.executeMojo(DefaultBuildPluginManager.java:101)
	at org.apache.maven.lifecycle.internal.MojoExecutor.execute(MojoExecutor.java:209)
	... 27 more
Sending e-mails to: dev@ws.apache.org
channel stopped

---------------------------------------------------------------------
To unsubscribe, e-mail: dev-unsubscribe@ws.apache.org
For additional commands, e-mail: dev-help@ws.apache.org


Mime
View raw message