ws-dev mailing list archives

Site index · List index
Message view « Date » · « Thread »
Top « Date » · « Thread »
From Apache Jenkins Server <jenk...@builds.apache.org>
Subject Build failed in Jenkins: woden-trunk #620
Date Wed, 27 Jun 2012 12:12:07 GMT
See <https://builds.apache.org/job/woden-trunk/620/changes>

Changes:

[sagara] Start adding proper OSGi meta data.

------------------------------------------
[...truncated 916 lines...]
mojoStarted org.apache.maven.plugins:maven-compiler-plugin:2.0.2(default-compile)
[INFO] 
[INFO] --- maven-compiler-plugin:2.0.2:compile (default-compile) @ woden-tool ---
[INFO] Compiling 2 source files to <https://builds.apache.org/job/woden-trunk/ws/woden/woden-tool/target/classes>
mojoSucceeded org.apache.maven.plugins:maven-compiler-plugin:2.0.2(default-compile)
mojoStarted org.apache.felix:maven-bundle-plugin:2.3.7(bundle-manifest)
[INFO] 
[INFO] --- maven-bundle-plugin:2.3.7:manifest (bundle-manifest) @ woden-tool ---
mojoSucceeded org.apache.felix:maven-bundle-plugin:2.3.7(bundle-manifest)
mojoStarted org.apache.maven.plugins:maven-resources-plugin:2.4(default-testResources)[INFO]
Using 'UTF-8' encoding to copy filtered resources.
[INFO] skip non existing resourceDirectory <https://builds.apache.org/job/woden-trunk/ws/woden/woden-tool/src/test/resources>
[INFO] Copying 3 resources

[INFO] 
[INFO] --- maven-resources-plugin:2.4:testResources (default-testResources) @ woden-tool ---
mojoSucceeded org.apache.maven.plugins:maven-resources-plugin:2.4(default-testResources)
mojoStarted org.apache.maven.plugins:maven-compiler-plugin:2.0.2(default-testCompile)[INFO]
No sources to compile

[INFO] 
[INFO] --- maven-compiler-plugin:2.0.2:testCompile (default-testCompile) @ woden-tool ---
mojoSucceeded org.apache.maven.plugins:maven-compiler-plugin:2.0.2(default-testCompile)
mojoStarted org.apache.maven.plugins:maven-surefire-plugin:2.4.3(default-test)[INFO] Surefire
report directory: <https://builds.apache.org/job/woden-trunk/ws/woden/woden-tool/target/surefire-reports>

[INFO] 
[INFO] --- maven-surefire-plugin:2.4.3:test (default-test) @ woden-tool ---

-------------------------------------------------------
 T E S T S
-------------------------------------------------------
There are no tests to run.

Results :

Tests run: 0, Failures: 0, Errors: 0, Skipped: 0

mojoSucceeded org.apache.maven.plugins:maven-surefire-plugin:2.4.3(default-test)
[JENKINS] Recording test results
mojoStarted org.apache.maven.plugins:maven-jar-plugin:2.3(default-jar)
[INFO] 
[INFO] --- maven-jar-plugin:2.3:jar (default-jar) @ woden-tool ---
[INFO] Building jar: <https://builds.apache.org/job/woden-trunk/ws/woden/woden-tool/target/woden-tool-1.0-SNAPSHOT.jar>
mojoSucceeded org.apache.maven.plugins:maven-jar-plugin:2.3(default-jar)
mojoStarted org.apache.maven.plugins:maven-install-plugin:2.3(default-install)[INFO] Installing
<https://builds.apache.org/job/woden-trunk/ws/woden/woden-tool/target/woden-tool-1.0-SNAPSHOT.jar>
to <https://builds.apache.org/job/woden-trunk/ws/.repository/org/apache/woden/woden-tool/1.0-SNAPSHOT/woden-tool-1.0-SNAPSHOT.jar>
[INFO] Installing <https://builds.apache.org/job/woden-trunk/ws/woden/woden-tool/pom.xml>
to <https://builds.apache.org/job/woden-trunk/ws/.repository/org/apache/woden/woden-tool/1.0-SNAPSHOT/woden-tool-1.0-SNAPSHOT.pom>

[INFO] 
[INFO] --- maven-install-plugin:2.3:install (default-install) @ woden-tool ---
mojoSucceeded org.apache.maven.plugins:maven-install-plugin:2.3(default-install)
projectSucceeded org.apache.woden:woden-tool:1.0-SNAPSHOT
projectStarted org.apache.woden:woden-converter-maven-plugin:1.0-SNAPSHOT
[INFO]                                                                         
[INFO] ------------------------------------------------------------------------
[INFO] Building Woden - converter Maven plugin 1.0-SNAPSHOT
[INFO] ------------------------------------------------------------------------
mojoStarted org.apache.maven.plugins:maven-clean-plugin:2.3(default-clean)[INFO] Deleting
file set: <https://builds.apache.org/job/woden-trunk/ws/woden/woden-converter-maven-plugin/target>
(included: [**], excluded: [])

[INFO] 
[INFO] --- maven-clean-plugin:2.3:clean (default-clean) @ woden-converter-maven-plugin ---
mojoSucceeded org.apache.maven.plugins:maven-clean-plugin:2.3(default-clean)
mojoStarted org.apache.maven.plugins:maven-plugin-plugin:2.5(default-descriptor)
[INFO] 
[INFO] --- maven-plugin-plugin:2.5:descriptor (default-descriptor) @ woden-converter-maven-plugin
---
[WARNING] 

Goal prefix is specified as: 'woden'. Maven currently expects it to be 'woden-converter'.

[INFO] Using 'UTF-8' encoding to read mojo metadata.
[INFO] Applying mojo extractor for language: java
[INFO] Mojo extractor for language: java found 1 mojo descriptors.
[INFO] Applying mojo extractor for language: bsh
[INFO] Mojo extractor for language: bsh found 0 mojo descriptors.
mojoSucceeded org.apache.maven.plugins:maven-plugin-plugin:2.5(default-descriptor)
mojoStarted org.apache.maven.plugins:maven-remote-resources-plugin:1.1(default)
[INFO] 
[INFO] --- maven-remote-resources-plugin:1.1:process (default) @ woden-converter-maven-plugin
---
mojoSucceeded org.apache.maven.plugins:maven-remote-resources-plugin:1.1(default)
mojoStarted org.apache.maven.plugins:maven-resources-plugin:2.4(default-resources)[INFO] Using
'UTF-8' encoding to copy filtered resources.
[INFO] Copying 0 resource
[INFO] Copying 3 resources
[INFO] Copying 3 resources

[INFO] 
[INFO] --- maven-resources-plugin:2.4:resources (default-resources) @ woden-converter-maven-plugin
---
mojoSucceeded org.apache.maven.plugins:maven-resources-plugin:2.4(default-resources)
mojoStarted org.apache.maven.plugins:maven-compiler-plugin:2.0.2(default-compile)[INFO] Compiling
1 source file to <https://builds.apache.org/job/woden-trunk/ws/woden/woden-converter-maven-plugin/target/classes>

[INFO] 
[INFO] --- maven-compiler-plugin:2.0.2:compile (default-compile) @ woden-converter-maven-plugin
---
mojoSucceeded org.apache.maven.plugins:maven-compiler-plugin:2.0.2(default-compile)
mojoStarted org.codehaus.plexus:plexus-maven-plugin:1.3.8(default)
[INFO] 
[INFO] --- plexus-maven-plugin:1.3.8:descriptor (default) @ woden-converter-maven-plugin ---
mojoSucceeded org.codehaus.plexus:plexus-maven-plugin:1.3.8(default)
mojoStarted org.apache.maven.plugins:maven-resources-plugin:2.4(default-testResources)[INFO]
Using 'UTF-8' encoding to copy filtered resources.
[INFO] skip non existing resourceDirectory <https://builds.apache.org/job/woden-trunk/ws/woden/woden-converter-maven-plugin/src/test/resources>
[INFO] Copying 3 resources

[INFO] 
[INFO] --- maven-resources-plugin:2.4:testResources (default-testResources) @ woden-converter-maven-plugin
---
mojoSucceeded org.apache.maven.plugins:maven-resources-plugin:2.4(default-testResources)
mojoStarted org.apache.maven.plugins:maven-compiler-plugin:2.0.2(default-testCompile)[INFO]
No sources to compile

[INFO] 
[INFO] --- maven-compiler-plugin:2.0.2:testCompile (default-testCompile) @ woden-converter-maven-plugin
---
mojoSucceeded org.apache.maven.plugins:maven-compiler-plugin:2.0.2(default-testCompile)
mojoStarted org.apache.maven.plugins:maven-surefire-plugin:2.4.3(default-test)[INFO] Surefire
report directory: <https://builds.apache.org/job/woden-trunk/ws/woden/woden-converter-maven-plugin/target/surefire-reports>

[INFO] 
[INFO] --- maven-surefire-plugin:2.4.3:test (default-test) @ woden-converter-maven-plugin
---

-------------------------------------------------------
 T E S T S
-------------------------------------------------------
There are no tests to run.

Results :

Tests run: 0, Failures: 0, Errors: 0, Skipped: 0

mojoSucceeded org.apache.maven.plugins:maven-surefire-plugin:2.4.3(default-test)
[JENKINS] Recording test results
mojoStarted org.apache.maven.plugins:maven-jar-plugin:2.3(default-jar)
[INFO] 
[INFO] --- maven-jar-plugin:2.3:jar (default-jar) @ woden-converter-maven-plugin ---
[INFO] Building jar: <https://builds.apache.org/job/woden-trunk/ws/woden/woden-converter-maven-plugin/target/woden-converter-maven-plugin-1.0-SNAPSHOT.jar>
mojoSucceeded org.apache.maven.plugins:maven-jar-plugin:2.3(default-jar)
mojoStarted org.apache.maven.plugins:maven-plugin-plugin:2.5(default-addPluginArtifactMetadata)
[INFO] 
[INFO] --- maven-plugin-plugin:2.5:addPluginArtifactMetadata (default-addPluginArtifactMetadata)
@ woden-converter-maven-plugin ---
mojoSucceeded org.apache.maven.plugins:maven-plugin-plugin:2.5(default-addPluginArtifactMetadata)
mojoStarted org.apache.maven.plugins:maven-install-plugin:2.3(default-install)[INFO] Installing
<https://builds.apache.org/job/woden-trunk/ws/woden/woden-converter-maven-plugin/target/woden-converter-maven-plugin-1.0-SNAPSHOT.jar>
to <https://builds.apache.org/job/woden-trunk/ws/.repository/org/apache/woden/woden-converter-maven-plugin/1.0-SNAPSHOT/woden-converter-maven-plugin-1.0-SNAPSHOT.jar>
[INFO] Installing <https://builds.apache.org/job/woden-trunk/ws/woden/woden-converter-maven-plugin/pom.xml>
to <https://builds.apache.org/job/woden-trunk/ws/.repository/org/apache/woden/woden-converter-maven-plugin/1.0-SNAPSHOT/woden-converter-maven-plugin-1.0-SNAPSHOT.pom>

[INFO] 
[INFO] --- maven-install-plugin:2.3:install (default-install) @ woden-converter-maven-plugin
---
mojoSucceeded org.apache.maven.plugins:maven-install-plugin:2.3(default-install)
projectSucceeded org.apache.woden:woden-converter-maven-plugin:1.0-SNAPSHOT
projectStarted org.apache.woden:woden-ant:1.0-SNAPSHOT
[INFO]                                                                         
[INFO] ------------------------------------------------------------------------
[INFO] [INFO] Deleting file set: <https://builds.apache.org/job/woden-trunk/ws/woden/woden-ant/target>
(included: [**], excluded: [])
Building Woden - Ant 1.0-SNAPSHOT
[INFO] ------------------------------------------------------------------------
mojoStarted org.apache.maven.plugins:maven-clean-plugin:2.3(default-clean)
[INFO] 
[INFO] --- maven-clean-plugin:2.3:clean (default-clean) @ woden-ant ---
mojoSucceeded org.apache.maven.plugins:maven-clean-plugin:2.3(default-clean)
mojoStarted org.apache.maven.plugins:maven-remote-resources-plugin:1.1(default)
[INFO] 
[INFO] --- maven-remote-resources-plugin:1.1:process (default) @ woden-ant ---
mojoSucceeded org.apache.maven.plugins:maven-remote-resources-plugin:1.1(default)
mojoStarted org.apache.maven.plugins:maven-resources-plugin:2.4(default-resources)[INFO] Using
'UTF-8' encoding to copy filtered resources.
[INFO] Copying 3 resources to META-INF

[INFO] 
[INFO] --- maven-resources-plugin:2.4:resources (default-resources) @ woden-ant ---
[INFO] Copying 1 resource
[INFO] Copying 3 resources
mojoSucceeded org.apache.maven.plugins:maven-resources-plugin:2.4(default-resources)
mojoStarted org.apache.maven.plugins:maven-compiler-plugin:2.0.2(default-compile)
[INFO] 
[INFO] --- maven-compiler-plugin:2.0.2:compile (default-compile) @ woden-ant ---
[INFO] Compiling 13 source files to <https://builds.apache.org/job/woden-trunk/ws/woden/woden-ant/target/classes>
mojoSucceeded org.apache.maven.plugins:maven-compiler-plugin:2.0.2(default-compile)
mojoStarted org.apache.felix:maven-bundle-plugin:2.3.7(bundle-manifest)
[INFO] 
[INFO] --- maven-bundle-plugin:2.3.7:manifest (bundle-manifest) @ woden-ant ---
[WARNING] Manifest org.apache.woden:woden-ant:jar:1.0-SNAPSHOT : No translation found for
macro: range;[==,+)
[ERROR] Manifest org.apache.woden:woden-ant:jar:1.0-SNAPSHOT : No value after '=' sign for
attribute version
[ERROR] Manifest org.apache.woden:woden-ant:jar:1.0-SNAPSHOT : null, for cmd: range, arguments;
[range, [==,+)]
[ERROR] Manifest org.apache.woden:woden-ant:jar:1.0-SNAPSHOT : No version specified for ${version}
or ${range} and no implicit version ${@} either, mask===
[ERROR] Manifest org.apache.woden:woden-ant:jar:1.0-SNAPSHOT : No version specified for ${version}
or ${range} and no implicit version ${@} either, mask=+
[ERROR] Error(s) found in manifest configuration
mojoFailed org.apache.felix:maven-bundle-plugin:2.3.7(bundle-manifest)
projectFailed org.apache.woden:woden-ant:1.0-SNAPSHOT
sessionEnded
[INFO] ------------------------------------------------------------------------
[INFO] Reactor Summary:
[INFO] 
[INFO] Woden ............................................. SUCCESS [15.964s]
[INFO] Woden - Core ...................................... SUCCESS [16.626s]
[INFO] Woden - Tests ..................................... SUCCESS [23.420s]
[INFO] Woden - Tool ...................................... SUCCESS [3.046s]
[INFO] Woden - converter Maven plugin .................... SUCCESS [3.211s]
[INFO] Woden - Ant ....................................... FAILURE [1.702s]
[INFO] ------------------------------------------------------------------------
[INFO] BUILD FAILURE
[INFO] ------------------------------------------------------------------------
[INFO] Total time: 1:07.090s
[INFO] Finished at: Wed Jun 27 12:11:56 UTC 2012
[INFO] Final Memory: 25M/171M
[INFO] ------------------------------------------------------------------------
Projects to build: [MavenProject: org.apache.woden:woden:1.0-SNAPSHOT @ <https://builds.apache.org/job/woden-trunk/ws/woden/pom.xml,>
MavenProject: org.apache.woden:woden-core:1.0-SNAPSHOT @ <https://builds.apache.org/job/woden-trunk/ws/woden/woden-core/pom.xml,>
MavenProject: org.apache.woden:woden-tests:1.0-SNAPSHOT @ <https://builds.apache.org/job/woden-trunk/ws/woden/woden-tests/pom.xml,>
MavenProject: org.apache.woden:woden-tool:1.0-SNAPSHOT @ <https://builds.apache.org/job/woden-trunk/ws/woden/woden-tool/pom.xml,>
MavenProject: org.apache.woden:woden-converter-maven-plugin:1.0-SNAPSHOT @ <https://builds.apache.org/job/woden-trunk/ws/woden/woden-converter-maven-plugin/pom.xml,>
MavenProject: org.apache.woden:woden-ant:1.0-SNAPSHOT @ <https://builds.apache.org/job/woden-trunk/ws/woden/woden-ant/pom.xml]>
[JENKINS] Archiving <https://builds.apache.org/job/woden-trunk/ws/woden/woden-tests/pom.xml>
to /home/hudson/hudson/jobs/woden-trunk/modules/org.apache.woden$woden-tests/builds/2012-06-27_12-10-37/archive/org.apache.woden/woden-tests/1.0-SNAPSHOT/woden-tests-1.0-SNAPSHOT.pom
[JENKINS] Archiving <https://builds.apache.org/job/woden-trunk/ws/woden/woden-tests/target/dom/woden-tests-1.0-SNAPSHOT.jar>
to /home/hudson/hudson/jobs/woden-trunk/modules/org.apache.woden$woden-tests/builds/2012-06-27_12-10-37/archive/org.apache.woden/woden-tests/1.0-SNAPSHOT/woden-tests-1.0-SNAPSHOT.jar
[JENKINS] Archiving <https://builds.apache.org/job/woden-trunk/ws/woden/woden-ant/pom.xml>
to /home/hudson/hudson/jobs/woden-trunk/modules/org.apache.woden$woden-ant/builds/2012-06-27_12-10-37/archive/org.apache.woden/woden-ant/1.0-SNAPSHOT/woden-ant-1.0-SNAPSHOT.pom
[JENKINS] Archiving <https://builds.apache.org/job/woden-trunk/ws/woden/pom.xml> to
/home/hudson/hudson/jobs/woden-trunk/modules/org.apache.woden$woden/builds/2012-06-27_12-10-37/archive/org.apache.woden/woden/1.0-SNAPSHOT/woden-1.0-SNAPSHOT.pom
[JENKINS] Archiving <https://builds.apache.org/job/woden-trunk/ws/woden/woden-converter-maven-plugin/pom.xml>
to /home/hudson/hudson/jobs/woden-trunk/modules/org.apache.woden$woden-converter-maven-plugin/builds/2012-06-27_12-10-37/archive/org.apache.woden/woden-converter-maven-plugin/1.0-SNAPSHOT/woden-converter-maven-plugin-1.0-SNAPSHOT.pom
[JENKINS] Archiving <https://builds.apache.org/job/woden-trunk/ws/woden/woden-converter-maven-plugin/target/woden-converter-maven-plugin-1.0-SNAPSHOT.jar>
to /home/hudson/hudson/jobs/woden-trunk/modules/org.apache.woden$woden-converter-maven-plugin/builds/2012-06-27_12-10-37/archive/org.apache.woden/woden-converter-maven-plugin/1.0-SNAPSHOT/woden-converter-maven-plugin-1.0-SNAPSHOT.jar
[JENKINS] Archiving <https://builds.apache.org/job/woden-trunk/ws/woden/woden-core/pom.xml>
to /home/hudson/hudson/jobs/woden-trunk/modules/org.apache.woden$woden-core/builds/2012-06-27_12-10-37/archive/org.apache.woden/woden-core/1.0-SNAPSHOT/woden-core-1.0-SNAPSHOT.pom
[JENKINS] Archiving <https://builds.apache.org/job/woden-trunk/ws/woden/woden-core/target/woden-core-1.0-SNAPSHOT.jar>
to /home/hudson/hudson/jobs/woden-trunk/modules/org.apache.woden$woden-core/builds/2012-06-27_12-10-37/archive/org.apache.woden/woden-core/1.0-SNAPSHOT/woden-core-1.0-SNAPSHOT.jar
[JENKINS] Archiving <https://builds.apache.org/job/woden-trunk/ws/woden/woden-tool/pom.xml>
to /home/hudson/hudson/jobs/woden-trunk/modules/org.apache.woden$woden-tool/builds/2012-06-27_12-10-37/archive/org.apache.woden/woden-tool/1.0-SNAPSHOT/woden-tool-1.0-SNAPSHOT.pom
[JENKINS] Archiving <https://builds.apache.org/job/woden-trunk/ws/woden/woden-tool/target/woden-tool-1.0-SNAPSHOT.jar>
to /home/hudson/hudson/jobs/woden-trunk/modules/org.apache.woden$woden-tool/builds/2012-06-27_12-10-37/archive/org.apache.woden/woden-tool/1.0-SNAPSHOT/woden-tool-1.0-SNAPSHOT.jar
Waiting for Jenkins to finish collecting data
mavenExecutionResult exceptions not empty
message : Failed to execute goal org.apache.felix:maven-bundle-plugin:2.3.7:manifest (bundle-manifest)
on project woden-ant: Error(s) found in manifest configuration
cause : Error(s) found in manifest configuration
Stack trace : 
org.apache.maven.lifecycle.LifecycleExecutionException: Failed to execute goal org.apache.felix:maven-bundle-plugin:2.3.7:manifest
(bundle-manifest) on project woden-ant: Error(s) found in manifest configuration
	at org.apache.maven.lifecycle.internal.MojoExecutor.execute(MojoExecutor.java:217)
	at org.apache.maven.lifecycle.internal.MojoExecutor.execute(MojoExecutor.java:153)
	at org.apache.maven.lifecycle.internal.MojoExecutor.execute(MojoExecutor.java:145)
	at org.apache.maven.lifecycle.internal.LifecycleModuleBuilder.buildProject(LifecycleModuleBuilder.java:84)
	at org.apache.maven.lifecycle.internal.LifecycleModuleBuilder.buildProject(LifecycleModuleBuilder.java:59)
	at org.apache.maven.lifecycle.internal.LifecycleStarter.singleThreadedBuild(LifecycleStarter.java:183)
	at org.apache.maven.lifecycle.internal.LifecycleStarter.execute(LifecycleStarter.java:161)
	at org.apache.maven.DefaultMaven.doExecute(DefaultMaven.java:319)
	at org.apache.maven.DefaultMaven.execute(DefaultMaven.java:156)
	at org.jvnet.hudson.maven3.launcher.Maven3Launcher.main(Maven3Launcher.java:79)
	at sun.reflect.NativeMethodAccessorImpl.invoke0(Native Method)
	at sun.reflect.NativeMethodAccessorImpl.invoke(NativeMethodAccessorImpl.java:39)
	at sun.reflect.DelegatingMethodAccessorImpl.invoke(DelegatingMethodAccessorImpl.java:25)
	at java.lang.reflect.Method.invoke(Method.java:592)
	at org.codehaus.plexus.classworlds.launcher.Launcher.launchStandard(Launcher.java:329)
	at org.codehaus.plexus.classworlds.launcher.Launcher.launch(Launcher.java:239)
	at org.jvnet.hudson.maven3.agent.Maven3Main.launch(Maven3Main.java:158)
	at hudson.maven.Maven3Builder.call(Maven3Builder.java:98)
	at hudson.maven.Maven3Builder.call(Maven3Builder.java:64)
	at hudson.remoting.UserRequest.perform(UserRequest.java:118)
	at hudson.remoting.UserRequest.perform(UserRequest.java:48)
	at hudson.remoting.Request$2.run(Request.java:326)
	at hudson.remoting.InterceptingExecutorService$1.call(InterceptingExecutorService.java:72)
	at java.util.concurrent.FutureTask$Sync.innerRun(FutureTask.java:269)
	at java.util.concurrent.FutureTask.run(FutureTask.java:123)
	at java.util.concurrent.ThreadPoolExecutor$Worker.runTask(ThreadPoolExecutor.java:651)
	at java.util.concurrent.ThreadPoolExecutor$Worker.run(ThreadPoolExecutor.java:676)
	at java.lang.Thread.run(Thread.java:595)
Caused by: org.apache.maven.plugin.MojoExecutionException: Error(s) found in manifest configuration
	at org.apache.felix.bundleplugin.ManifestPlugin.execute(ManifestPlugin.java:83)
	at org.apache.felix.bundleplugin.BundlePlugin.execute(BundlePlugin.java:264)
	at org.apache.felix.bundleplugin.BundlePlugin.execute(BundlePlugin.java:255)
	at org.apache.maven.plugin.DefaultBuildPluginManager.executeMojo(DefaultBuildPluginManager.java:101)
	at org.apache.maven.lifecycle.internal.MojoExecutor.execute(MojoExecutor.java:209)
	... 27 more
Caused by: org.apache.maven.plugin.MojoFailureException: Error(s) found in manifest configuration
	at org.apache.felix.bundleplugin.ManifestPlugin.getManifest(ManifestPlugin.java:121)
	at org.apache.felix.bundleplugin.ManifestPlugin.execute(ManifestPlugin.java:69)
	... 31 more
channel stopped

---------------------------------------------------------------------
To unsubscribe, e-mail: dev-unsubscribe@ws.apache.org
For additional commands, e-mail: dev-help@ws.apache.org


Mime
View raw message