ws-dev mailing list archives

Site index · List index
Message view « Date » · « Thread »
Top « Date » · « Thread »
From Apache Jenkins Server <jenk...@builds.apache.org>
Subject Build failed in Jenkins: woden-trunk #623
Date Wed, 04 Jul 2012 23:25:41 GMT
See <https://builds.apache.org/job/woden-trunk/623/>

------------------------------------------
[...truncated 440 lines...]
[INFO] Scanning for projects...
Downloading: http://repo1.maven.org/maven2/org/apache/felix/maven-bundle-plugin/2.3.7/maven-bundle-plugin-2.3.7.pom
Downloaded: http://repo1.maven.org/maven2/org/apache/felix/maven-bundle-plugin/2.3.7/maven-bundle-plugin-2.3.7.pom
(4 KB at 32.3 KB/sec)
Downloading: http://repo1.maven.org/maven2/org/apache/felix/felix-parent/2.1/felix-parent-2.1.pom
Downloaded: http://repo1.maven.org/maven2/org/apache/felix/felix-parent/2.1/felix-parent-2.1.pom
(10 KB at 269.5 KB/sec)
Downloading: http://repo1.maven.org/maven2/biz/aQute/bndlib/1.50.0/bndlib-1.50.0.pom
Downloaded: http://repo1.maven.org/maven2/biz/aQute/bndlib/1.50.0/bndlib-1.50.0.pom (2 KB
at 22.3 KB/sec)
Downloading: http://repo1.maven.org/maven2/org/apache/felix/org.apache.felix.bundlerepository/1.6.6/org.apache.felix.bundlerepository-1.6.6.pom
Downloaded: http://repo1.maven.org/maven2/org/apache/felix/org.apache.felix.bundlerepository/1.6.6/org.apache.felix.bundlerepository-1.6.6.pom
(6 KB at 79.8 KB/sec)
Downloading: http://repo1.maven.org/maven2/org/osgi/org.osgi.core/4.1.0/org.osgi.core-4.1.0.pom
Downloaded: http://repo1.maven.org/maven2/org/osgi/org.osgi.core/4.1.0/org.osgi.core-4.1.0.pom
(193 B at 26.9 KB/sec)
Downloading: http://repo1.maven.org/maven2/org/easymock/easymock/2.4/easymock-2.4.pom
Downloaded: http://repo1.maven.org/maven2/org/easymock/easymock/2.4/easymock-2.4.pom (6 KB
at 650.4 KB/sec)
Downloading: http://repo1.maven.org/maven2/org/apache/maven/maven-core/2.0.7/maven-core-2.0.7.pom
Downloaded: http://repo1.maven.org/maven2/org/apache/maven/maven-core/2.0.7/maven-core-2.0.7.pom
(7 KB at 185.7 KB/sec)
Downloading: http://repo1.maven.org/maven2/org/apache/maven/maven-plugin-parameter-documenter/2.0.7/maven-plugin-parameter-documenter-2.0.7.pom
Downloaded: http://repo1.maven.org/maven2/org/apache/maven/maven-plugin-parameter-documenter/2.0.7/maven-plugin-parameter-documenter-2.0.7.pom
(2 KB at 116.6 KB/sec)
Downloading: http://repo1.maven.org/maven2/org/apache/maven/reporting/maven-reporting-api/2.0.7/maven-reporting-api-2.0.7.pom
Downloaded: http://repo1.maven.org/maven2/org/apache/maven/reporting/maven-reporting-api/2.0.7/maven-reporting-api-2.0.7.pom
(2 KB at 36.4 KB/sec)
Downloading: http://repo1.maven.org/maven2/org/apache/maven/reporting/maven-reporting/2.0.7/maven-reporting-2.0.7.pom
Downloaded: http://repo1.maven.org/maven2/org/apache/maven/reporting/maven-reporting/2.0.7/maven-reporting-2.0.7.pom
(2 KB at 21.6 KB/sec)
Downloading: http://repo1.maven.org/maven2/org/apache/maven/maven-error-diagnostics/2.0.7/maven-error-diagnostics-2.0.7.pom
Downloaded: http://repo1.maven.org/maven2/org/apache/maven/maven-error-diagnostics/2.0.7/maven-error-diagnostics-2.0.7.pom
(2 KB at 33.3 KB/sec)
Downloading: http://repo1.maven.org/maven2/org/apache/maven/maven-plugin-descriptor/2.0.7/maven-plugin-descriptor-2.0.7.pom
Downloaded: http://repo1.maven.org/maven2/org/apache/maven/maven-plugin-descriptor/2.0.7/maven-plugin-descriptor-2.0.7.pom
(2 KB at 23.5 KB/sec)
Downloading: http://repo1.maven.org/maven2/org/apache/maven/maven-monitor/2.0.7/maven-monitor-2.0.7.pom
Downloaded: http://repo1.maven.org/maven2/org/apache/maven/maven-monitor/2.0.7/maven-monitor-2.0.7.pom
(2 KB at 28.5 KB/sec)
Downloading: http://repo1.maven.org/maven2/org/apache/maven/maven-archiver/2.4.1/maven-archiver-2.4.1.pom
Downloaded: http://repo1.maven.org/maven2/org/apache/maven/maven-archiver/2.4.1/maven-archiver-2.4.1.pom
(4 KB at 551.5 KB/sec)
Downloading: http://repo1.maven.org/maven2/org/apache/maven/shared/maven-shared-components/15/maven-shared-components-15.pom
Downloaded: http://repo1.maven.org/maven2/org/apache/maven/shared/maven-shared-components/15/maven-shared-components-15.pom
(10 KB at 1302.6 KB/sec)
Downloading: http://repo1.maven.org/maven2/org/apache/maven/maven-parent/16/maven-parent-16.pom
Downloaded: http://repo1.maven.org/maven2/org/apache/maven/maven-parent/16/maven-parent-16.pom
(23 KB at 2525.2 KB/sec)
Downloading: http://repo1.maven.org/maven2/org/codehaus/plexus/plexus-archiver/1.0/plexus-archiver-1.0.pom
Downloaded: http://repo1.maven.org/maven2/org/codehaus/plexus/plexus-archiver/1.0/plexus-archiver-1.0.pom
(2 KB at 196.5 KB/sec)
Downloading: http://repo1.maven.org/maven2/org/codehaus/plexus/plexus-components/1.1.17/plexus-components-1.1.17.pom
Downloaded: http://repo1.maven.org/maven2/org/codehaus/plexus/plexus-components/1.1.17/plexus-components-1.1.17.pom
(6 KB at 565.3 KB/sec)
Downloading: http://repo1.maven.org/maven2/org/codehaus/plexus/plexus/2.0.5/plexus-2.0.5.pom
Downloaded: http://repo1.maven.org/maven2/org/codehaus/plexus/plexus/2.0.5/plexus-2.0.5.pom
(17 KB at 941.2 KB/sec)
Downloading: http://repo1.maven.org/maven2/org/codehaus/plexus/plexus-utils/2.0.5/plexus-utils-2.0.5.pom
Downloaded: http://repo1.maven.org/maven2/org/codehaus/plexus/plexus-utils/2.0.5/plexus-utils-2.0.5.pom
(4 KB at 361.8 KB/sec)
Downloading: http://repo1.maven.org/maven2/org/codehaus/plexus/plexus/2.0.6/plexus-2.0.6.pom
Downloaded: http://repo1.maven.org/maven2/org/codehaus/plexus/plexus/2.0.6/plexus-2.0.6.pom
(17 KB at 1091.3 KB/sec)
Downloading: http://repo1.maven.org/maven2/org/codehaus/plexus/plexus-io/1.0/plexus-io-1.0.pom
Downloaded: http://repo1.maven.org/maven2/org/codehaus/plexus/plexus-io/1.0/plexus-io-1.0.pom
(2 KB at 149.9 KB/sec)
Downloading: http://repo1.maven.org/maven2/org/codehaus/plexus/plexus-interpolation/1.13/plexus-interpolation-1.13.pom
Downloaded: http://repo1.maven.org/maven2/org/codehaus/plexus/plexus-interpolation/1.13/plexus-interpolation-1.13.pom
(890 B at 48.3 KB/sec)
Downloading: http://repo1.maven.org/maven2/org/codehaus/plexus/plexus-components/1.1.15/plexus-components-1.1.15.pom
Downloaded: http://repo1.maven.org/maven2/org/codehaus/plexus/plexus-components/1.1.15/plexus-components-1.1.15.pom
(3 KB at 309.0 KB/sec)
Downloading: http://repo1.maven.org/maven2/org/codehaus/plexus/plexus/2.0.3/plexus-2.0.3.pom
Downloaded: http://repo1.maven.org/maven2/org/codehaus/plexus/plexus/2.0.3/plexus-2.0.3.pom
(16 KB at 559.2 KB/sec)
Downloading: http://repo1.maven.org/maven2/org/apache/maven/shared/maven-dependency-tree/1.2/maven-dependency-tree-1.2.pom
Downloaded: http://repo1.maven.org/maven2/org/apache/maven/shared/maven-dependency-tree/1.2/maven-dependency-tree-1.2.pom
(4 KB at 440.8 KB/sec)
Downloading: http://repo1.maven.org/maven2/org/codehaus/plexus/plexus-utils/2.1/plexus-utils-2.1.pom
Downloaded: http://repo1.maven.org/maven2/org/codehaus/plexus/plexus-utils/2.1/plexus-utils-2.1.pom
(4 KB at 492.4 KB/sec)
Downloading: http://repo1.maven.org/maven2/org/sonatype/spice/spice-parent/16/spice-parent-16.pom
Downloaded: http://repo1.maven.org/maven2/org/sonatype/spice/spice-parent/16/spice-parent-16.pom
(9 KB at 1166.0 KB/sec)
Downloading: http://repo1.maven.org/maven2/org/sonatype/forge/forge-parent/5/forge-parent-5.pom
Downloaded: http://repo1.maven.org/maven2/org/sonatype/forge/forge-parent/5/forge-parent-5.pom
(9 KB at 1361.2 KB/sec)
Downloading: http://repo1.maven.org/maven2/org/apache/felix/maven-bundle-plugin/2.3.7/maven-bundle-plugin-2.3.7.jar
Downloading: http://repo1.maven.org/maven2/biz/aQute/bndlib/1.50.0/bndlib-1.50.0.jar
Downloading: http://repo1.maven.org/maven2/org/osgi/org.osgi.core/4.1.0/org.osgi.core-4.1.0.jar
Downloading: http://repo1.maven.org/maven2/org/easymock/easymock/2.4/easymock-2.4.jar
Downloading: http://repo1.maven.org/maven2/org/apache/felix/org.apache.felix.bundlerepository/1.6.6/org.apache.felix.bundlerepository-1.6.6.jar
Downloaded: http://repo1.maven.org/maven2/org/easymock/easymock/2.4/easymock-2.4.jar (80 KB
at 4660.7 KB/sec)
Downloading: http://repo1.maven.org/maven2/org/apache/maven/reporting/maven-reporting-api/2.0.7/maven-reporting-api-2.0.7.jar
Downloaded: http://repo1.maven.org/maven2/org/osgi/org.osgi.core/4.1.0/org.osgi.core-4.1.0.jar
(160 KB at 7256.0 KB/sec)
Downloading: http://repo1.maven.org/maven2/org/apache/maven/maven-archiver/2.4.1/maven-archiver-2.4.1.jar
Downloaded: http://repo1.maven.org/maven2/org/apache/maven/maven-archiver/2.4.1/maven-archiver-2.4.1.jar
(20 KB at 2453.2 KB/sec)
Downloading: http://repo1.maven.org/maven2/org/codehaus/plexus/plexus-archiver/1.0/plexus-archiver-1.0.jar
Downloaded: http://repo1.maven.org/maven2/org/apache/felix/maven-bundle-plugin/2.3.7/maven-bundle-plugin-2.3.7.jar
(122 KB at 3793.5 KB/sec)
Downloading: http://repo1.maven.org/maven2/org/codehaus/plexus/plexus-io/1.0/plexus-io-1.0.jar
Downloaded: http://repo1.maven.org/maven2/org/codehaus/plexus/plexus-io/1.0/plexus-io-1.0.jar
(50 KB at 3543.8 KB/sec)
Downloading: http://repo1.maven.org/maven2/org/codehaus/plexus/plexus-interpolation/1.13/plexus-interpolation-1.13.jar
Downloaded: http://repo1.maven.org/maven2/org/codehaus/plexus/plexus-archiver/1.0/plexus-archiver-1.0.jar
(174 KB at 9105.8 KB/sec)
Downloading: http://repo1.maven.org/maven2/org/apache/maven/shared/maven-dependency-tree/1.2/maven-dependency-tree-1.2.jar
Downloaded: http://repo1.maven.org/maven2/org/codehaus/plexus/plexus-interpolation/1.13/plexus-interpolation-1.13.jar
(60 KB at 4968.8 KB/sec)
Downloading: http://repo1.maven.org/maven2/org/codehaus/plexus/plexus-utils/2.1/plexus-utils-2.1.jar
Downloaded: http://repo1.maven.org/maven2/org/apache/maven/shared/maven-dependency-tree/1.2/maven-dependency-tree-1.2.jar
(34 KB at 2812.4 KB/sec)
Downloaded: http://repo1.maven.org/maven2/org/codehaus/plexus/plexus-utils/2.1/plexus-utils-2.1.jar
(220 KB at 16864.6 KB/sec)
Downloaded: http://repo1.maven.org/maven2/org/apache/felix/org.apache.felix.bundlerepository/1.6.6/org.apache.felix.bundlerepository-1.6.6.jar
(165 KB at 2004.1 KB/sec)
Downloaded: http://repo1.maven.org/maven2/org/apache/maven/reporting/maven-reporting-api/2.0.7/maven-reporting-api-2.0.7.jar
(10 KB at 144.9 KB/sec)
Downloaded: http://repo1.maven.org/maven2/biz/aQute/bndlib/1.50.0/bndlib-1.50.0.jar (899 KB
at 9868.4 KB/sec)
[WARNING] 
[WARNING] Some problems were encountered while building the effective model for org.apache.woden:woden-core:bundle:1.0-SNAPSHOT
[WARNING] 'reporting.plugins.plugin.version' for org.apache.maven.plugins:maven-surefire-plugin
is missing. @ org.apache.woden:woden:1.0-SNAPSHOT, <https://builds.apache.org/job/woden-trunk/ws/woden/pom.xml,>
line 50, column 15
[WARNING] 'reporting.plugins.plugin.version' for org.apache.maven.plugins:maven-surefire-report-plugin
is missing. @ org.apache.woden:woden:1.0-SNAPSHOT, <https://builds.apache.org/job/woden-trunk/ws/woden/pom.xml,>
line 62, column 15
[WARNING] 
[WARNING] Some problems were encountered while building the effective model for org.apache.woden:woden-tests:jar:1.0-SNAPSHOT
[WARNING] 'reporting.plugins.plugin.version' for org.apache.maven.plugins:maven-surefire-plugin
is missing. @ org.apache.woden:woden:1.0-SNAPSHOT, <https://builds.apache.org/job/woden-trunk/ws/woden/pom.xml,>
line 50, column 15
[WARNING] 'reporting.plugins.plugin.version' for org.apache.maven.plugins:maven-surefire-report-plugin
is missing. @ org.apache.woden:woden:1.0-SNAPSHOT, <https://builds.apache.org/job/woden-trunk/ws/woden/pom.xml,>
line 62, column 15
[WARNING] 
[WARNING] Some problems were encountered while building the effective model for org.apache.woden:woden-tool:jar:1.0-SNAPSHOT
[WARNING] 'build.plugins.plugin.version' for org.codehaus.mojo:xslt-maven-plugin is missing.
@ line 75, column 20
[WARNING] 'reporting.plugins.plugin.version' for org.apache.maven.plugins:maven-surefire-plugin
is missing. @ org.apache.woden:woden:1.0-SNAPSHOT, <https://builds.apache.org/job/woden-trunk/ws/woden/pom.xml,>
line 50, column 15
[INFO] [WARNING] 'reporting.plugins.plugin.version' for org.apache.maven.plugins:maven-surefire-report-plugin
is missing. @ org.apache.woden:woden:1.0-SNAPSHOT, <https://builds.apache.org/job/woden-trunk/ws/woden/pom.xml,>
line 62, column 15
[WARNING] 
[WARNING] Some problems were encountered while building the effective model for org.apache.woden:woden-converter-maven-plugin:maven-plugin:1.0-SNAPSHOT
[WARNING] 'reporting.plugins.plugin.version' for org.apache.maven.plugins:maven-surefire-plugin
is missing. @ org.apache.woden:woden:1.0-SNAPSHOT, <https://builds.apache.org/job/woden-trunk/ws/woden/pom.xml,>
line 50, column 15
[WARNING] 'reporting.plugins.plugin.version' for org.apache.maven.plugins:maven-surefire-report-plugin
is missing. @ org.apache.woden:woden:1.0-SNAPSHOT, <https://builds.apache.org/job/woden-trunk/ws/woden/pom.xml,>
line 62, column 15
[WARNING] 
[WARNING] Some problems were encountered while building the effective model for org.apache.woden:woden-ant:jar:1.0-SNAPSHOT
[WARNING] 'reporting.plugins.plugin.version' for org.apache.maven.plugins:maven-surefire-plugin
is missing. @ org.apache.woden:woden:1.0-SNAPSHOT, <https://builds.apache.org/job/woden-trunk/ws/woden/pom.xml,>
line 50, column 15
[WARNING] 'reporting.plugins.plugin.version' for org.apache.maven.plugins:maven-surefire-report-plugin
is missing. @ org.apache.woden:woden:1.0-SNAPSHOT, <https://builds.apache.org/job/woden-trunk/ws/woden/pom.xml,>
line 62, column 15
[WARNING] 
[WARNING] Some problems were encountered while building the effective model for org.apache.woden:woden:pom:1.0-SNAPSHOT
[WARNING] 'reporting.plugins.plugin.version' for org.apache.maven.plugins:maven-surefire-plugin
is missing. @ line 50, column 15
[WARNING] 'reporting.plugins.plugin.version' for org.apache.maven.plugins:maven-surefire-report-plugin
is missing. @ line 62, column 15
[WARNING] 
[WARNING] It is highly recommended to fix these problems because they threaten the stability
of your build.
[WARNING] 
[WARNING] For this reason, future Maven versions might no longer support building such malformed
projects.
[WARNING] 
------------------------------------------------------------------------
[INFO] Reactor Build Order:
[INFO] 
[INFO] Woden
[INFO] Woden - Core
[INFO] Woden - Tests
[INFO] Woden - Tool
[INFO] Woden - converter Maven plugin
[INFO] Woden - Ant
Projects to build: [MavenProject: org.apache.woden:woden:1.0-SNAPSHOT @ <https://builds.apache.org/job/woden-trunk/ws/woden/pom.xml,>
MavenProject: org.apache.woden:woden-core:1.0-SNAPSHOT @ <https://builds.apache.org/job/woden-trunk/ws/woden/woden-core/pom.xml,>
MavenProject: org.apache.woden:woden-tests:1.0-SNAPSHOT @ <https://builds.apache.org/job/woden-trunk/ws/woden/woden-tests/pom.xml,>
MavenProject: org.apache.woden:woden-tool:1.0-SNAPSHOT @ <https://builds.apache.org/job/woden-trunk/ws/woden/woden-tool/pom.xml,>
MavenProject: org.apache.woden:woden-converter-maven-plugin:1.0-SNAPSHOT @ <https://builds.apache.org/job/woden-trunk/ws/woden/woden-converter-maven-plugin/pom.xml,>
MavenProject: org.apache.woden:woden-ant:1.0-SNAPSHOT @ <https://builds.apache.org/job/woden-trunk/ws/woden/woden-ant/pom.xml]>
projectStarted org.apache.woden:woden:1.0-SNAPSHOT
[INFO]                                                                         
[INFO] ------------------------------------------------------------------------
[INFO] Building Woden 1.0-SNAPSHOT
[INFO] ------------------------------------------------------------------------
mojoStarted org.apache.maven.plugins:maven-clean-plugin:2.3(default-clean)
[INFO] 
[INFO] --- maven-clean-plugin:2.3:clean (default-clean) @ woden ---
[INFO] Deleting file set: <https://builds.apache.org/job/woden-trunk/ws/woden/target>
(included: [**], excluded: [])
mojoSucceeded org.apache.maven.plugins:maven-clean-plugin:2.3(default-clean)
mojoStarted org.apache.maven.plugins:maven-remote-resources-plugin:1.1(default)
[INFO] 
[INFO] --- maven-remote-resources-plugin:1.1:process (default) @ woden ---
[INFO] Setting property: classpath.resource.loader.class => 'org.codehaus.plexus.velocity.ContextClassLoaderResourceLoader'.
[INFO] Setting property: velocimacro.messages.on => 'false'.
[INFO] Setting property: resource.loader => 'classpath'.
[INFO] Setting property: resource.manager.logwhenfound => 'false'.
mojoSucceeded org.apache.maven.plugins:maven-remote-resources-plugin:1.1(default)
mojoStarted org.apache.maven.plugins:maven-install-plugin:2.3(default-install)
[INFO] 
[INFO] Installing <https://builds.apache.org/job/woden-trunk/ws/woden/pom.xml> to <https://builds.apache.org/job/woden-trunk/ws/.repository/org/apache/woden/woden/1.0-SNAPSHOT/woden-1.0-SNAPSHOT.pom>
[INFO] --- maven-install-plugin:2.3:install (default-install) @ woden ---
mojoSucceeded org.apache.maven.plugins:maven-install-plugin:2.3(default-install)
projectSucceeded org.apache.woden:woden:1.0-SNAPSHOT
projectStarted org.apache.woden:woden-core:1.0-SNAPSHOT
[INFO]                                                                         
[INFO] ------------------------------------------------------------------------
[INFO] Building Woden - Core 1.0-SNAPSHOT
[INFO] ------------------------------------------------------------------------
Downloading: http://repository.apache.org/snapshots/org/apache/ws/commons/schema/XmlSchema/1.4.8-SNAPSHOT/maven-metadata.xml
Downloaded: http://repository.apache.org/snapshots/org/apache/ws/commons/schema/XmlSchema/1.4.8-SNAPSHOT/maven-metadata.xml
(283 B at 2.1 KB/sec)
Downloading: http://repository.apache.org/snapshots/org/apache/ws/commons/schema/XmlSchema/1.4.8-SNAPSHOT/XmlSchema-1.4.8-SNAPSHOT.pom
Downloaded: http://repository.apache.org/snapshots/org/apache/ws/commons/schema/XmlSchema/1.4.8-SNAPSHOT/XmlSchema-1.4.8-SNAPSHOT.pom
(18 KB at 109.7 KB/sec)
Downloading: http://repository.apache.org/snapshots/org/apache/ws/commons/schema/XmlSchema/1.4.8-SNAPSHOT/XmlSchema-1.4.8-SNAPSHOT.jar
Downloaded: http://repository.apache.org/snapshots/org/apache/ws/commons/schema/XmlSchema/1.4.8-SNAPSHOT/XmlSchema-1.4.8-SNAPSHOT.jar
(146 KB at 546.8 KB/sec)
mojoStarted org.apache.maven.plugins:maven-clean-plugin:2.3(default-clean)
[INFO] 
[INFO] --- maven-clean-plugin:2.3:clean (default-clean) @ woden-core ---
mojoSucceeded org.apache.maven.plugins:maven-clean-plugin:2.3(default-clean)
mojoStarted org.apache.maven.plugins:maven-remote-resources-plugin:1.1(default)
[INFO] 
[INFO] --- maven-remote-resources-plugin:1.1:process (default) @ woden-core ---
[INFO] Setting property: classpath.resource.loader.class => 'org.codehaus.plexus.velocity.ContextClassLoaderResourceLoader'.
[INFO] Setting property: velocimacro.messages.on => 'false'.
[INFO] Setting property: resource.loader => 'classpath'.
[INFO] Setting property: resource.manager.logwhenfound => 'false'.
mojoSucceeded org.apache.maven.plugins:maven-remote-resources-plugin:1.1(default)
mojoStarted org.apache.maven.plugins:maven-resources-plugin:2.4(default-resources)
[INFO] 
[INFO] --- maven-resources-plugin:2.4:resources (default-resources) @ woden-core ---
[INFO] Using 'UTF-8' encoding to copy filtered resources.
[INFO] Copying 3 resources to META-INF
[INFO] Copying 17 resources
[INFO] Copying 3 resources
mojoSucceeded org.apache.maven.plugins:maven-resources-plugin:2.4(default-resources)
mojoStarted org.apache.maven.plugins:maven-compiler-plugin:2.0.2(default-compile)
[INFO] 
[INFO] --- maven-compiler-plugin:2.0.2:compile (default-compile) @ woden-core ---
[INFO] Compiling 265 source files to <https://builds.apache.org/job/woden-trunk/ws/woden/woden-core/target/classes>
mojoFailed org.apache.maven.plugins:maven-compiler-plugin:2.0.2(default-compile)
projectFailed org.apache.woden:woden-core:1.0-SNAPSHOT
sessionEnded
[INFO] ------------------------------------------------------------------------
[INFO] Reactor Summary:
[INFO] 
[INFO] Woden ............................................. SUCCESS [16.235s]
[INFO] Woden - Core ...................................... FAILURE [2.697s]
[INFO] Woden - Tests ..................................... SKIPPED
[INFO] Woden - Tool ...................................... SKIPPED
[INFO] Woden - converter Maven plugin .................... SKIPPED
[INFO] Woden - Ant ....................................... SKIPPED
[INFO] ------------------------------------------------------------------------
[INFO] BUILD FAILURE
[INFO] ------------------------------------------------------------------------
[INFO] Total time: 22.244s
[INFO] Finished at: Wed Jul 04 23:25:32 UTC 2012
[INFO] Final Memory: 13M/180M
[INFO] ------------------------------------------------------------------------
Projects to build: [MavenProject: org.apache.woden:woden:1.0-SNAPSHOT @ <https://builds.apache.org/job/woden-trunk/ws/woden/pom.xml,>
MavenProject: org.apache.woden:woden-core:1.0-SNAPSHOT @ <https://builds.apache.org/job/woden-trunk/ws/woden/woden-core/pom.xml,>
MavenProject: org.apache.woden:woden-tests:1.0-SNAPSHOT @ <https://builds.apache.org/job/woden-trunk/ws/woden/woden-tests/pom.xml,>
MavenProject: org.apache.woden:woden-tool:1.0-SNAPSHOT @ <https://builds.apache.org/job/woden-trunk/ws/woden/woden-tool/pom.xml,>
MavenProject: org.apache.woden:woden-converter-maven-plugin:1.0-SNAPSHOT @ <https://builds.apache.org/job/woden-trunk/ws/woden/woden-converter-maven-plugin/pom.xml,>
MavenProject: org.apache.woden:woden-ant:1.0-SNAPSHOT @ <https://builds.apache.org/job/woden-trunk/ws/woden/woden-ant/pom.xml]>
[JENKINS] Archiving <https://builds.apache.org/job/woden-trunk/ws/woden/woden-tests/pom.xml>
to /home/hudson/hudson/jobs/woden-trunk/modules/org.apache.woden$woden-tests/builds/2012-07-04_23-24-57/archive/org.apache.woden/woden-tests/1.0-SNAPSHOT/woden-tests-1.0-SNAPSHOT.pom
[JENKINS] Archiving <https://builds.apache.org/job/woden-trunk/ws/woden/woden-ant/pom.xml>
to /home/hudson/hudson/jobs/woden-trunk/modules/org.apache.woden$woden-ant/builds/2012-07-04_23-24-58/archive/org.apache.woden/woden-ant/1.0-SNAPSHOT/woden-ant-1.0-SNAPSHOT.pom
[JENKINS] Archiving <https://builds.apache.org/job/woden-trunk/ws/woden/pom.xml> to
/home/hudson/hudson/jobs/woden-trunk/modules/org.apache.woden$woden/builds/2012-07-04_23-24-57/archive/org.apache.woden/woden/1.0-SNAPSHOT/woden-1.0-SNAPSHOT.pom
[JENKINS] Archiving <https://builds.apache.org/job/woden-trunk/ws/woden/woden-converter-maven-plugin/pom.xml>
to /home/hudson/hudson/jobs/woden-trunk/modules/org.apache.woden$woden-converter-maven-plugin/builds/2012-07-04_23-24-58/archive/org.apache.woden/woden-converter-maven-plugin/1.0-SNAPSHOT/woden-converter-maven-plugin-1.0-SNAPSHOT.pom
[JENKINS] Archiving <https://builds.apache.org/job/woden-trunk/ws/woden/woden-core/pom.xml>
to /home/hudson/hudson/jobs/woden-trunk/modules/org.apache.woden$woden-core/builds/2012-07-04_23-24-57/archive/org.apache.woden/woden-core/1.0-SNAPSHOT/woden-core-1.0-SNAPSHOT.pom
[JENKINS] Archiving <https://builds.apache.org/job/woden-trunk/ws/woden/woden-tool/pom.xml>
to /home/hudson/hudson/jobs/woden-trunk/modules/org.apache.woden$woden-tool/builds/2012-07-04_23-24-58/archive/org.apache.woden/woden-tool/1.0-SNAPSHOT/woden-tool-1.0-SNAPSHOT.pom
Waiting for Jenkins to finish collecting data
mavenExecutionResult exceptions not empty
message : Failed to execute goal org.apache.maven.plugins:maven-compiler-plugin:2.0.2:compile
(default-compile) on project woden-core: Compilation failure
cause : Compilation failure
Stack trace : 
org.apache.maven.lifecycle.LifecycleExecutionException: Failed to execute goal org.apache.maven.plugins:maven-compiler-plugin:2.0.2:compile
(default-compile) on project woden-core: Compilation failure
	at org.apache.maven.lifecycle.internal.MojoExecutor.execute(MojoExecutor.java:213)
	at org.apache.maven.lifecycle.internal.MojoExecutor.execute(MojoExecutor.java:153)
	at org.apache.maven.lifecycle.internal.MojoExecutor.execute(MojoExecutor.java:145)
	at org.apache.maven.lifecycle.internal.LifecycleModuleBuilder.buildProject(LifecycleModuleBuilder.java:84)
	at org.apache.maven.lifecycle.internal.LifecycleModuleBuilder.buildProject(LifecycleModuleBuilder.java:59)
	at org.apache.maven.lifecycle.internal.LifecycleStarter.singleThreadedBuild(LifecycleStarter.java:183)
	at org.apache.maven.lifecycle.internal.LifecycleStarter.execute(LifecycleStarter.java:161)
	at org.apache.maven.DefaultMaven.doExecute(DefaultMaven.java:319)
	at org.apache.maven.DefaultMaven.execute(DefaultMaven.java:156)
	at org.jvnet.hudson.maven3.launcher.Maven3Launcher.main(Maven3Launcher.java:79)
	at sun.reflect.NativeMethodAccessorImpl.invoke0(Native Method)
	at sun.reflect.NativeMethodAccessorImpl.invoke(NativeMethodAccessorImpl.java:39)
	at sun.reflect.DelegatingMethodAccessorImpl.invoke(DelegatingMethodAccessorImpl.java:25)
	at java.lang.reflect.Method.invoke(Method.java:592)
	at org.codehaus.plexus.classworlds.launcher.Launcher.launchStandard(Launcher.java:329)
	at org.codehaus.plexus.classworlds.launcher.Launcher.launch(Launcher.java:239)
	at org.jvnet.hudson.maven3.agent.Maven3Main.launch(Maven3Main.java:158)
	at hudson.maven.Maven3Builder.call(Maven3Builder.java:98)
	at hudson.maven.Maven3Builder.call(Maven3Builder.java:64)
	at hudson.remoting.UserRequest.perform(UserRequest.java:118)
	at hudson.remoting.UserRequest.perform(UserRequest.java:48)
	at hudson.remoting.Request$2.run(Request.java:326)
	at hudson.remoting.InterceptingExecutorService$1.call(InterceptingExecutorService.java:72)
	at java.util.concurrent.FutureTask$Sync.innerRun(FutureTask.java:269)
	at java.util.concurrent.FutureTask.run(FutureTask.java:123)
	at java.util.concurrent.ThreadPoolExecutor$Worker.runTask(ThreadPoolExecutor.java:651)
	at java.util.concurrent.ThreadPoolExecutor$Worker.run(ThreadPoolExecutor.java:676)
	at java.lang.Thread.run(Thread.java:595)
Caused by: org.apache.maven.plugin.CompilationFailureException: Compilation failure
	at org.apache.maven.plugin.AbstractCompilerMojo.execute(AbstractCompilerMojo.java:516)
	at org.apache.maven.plugin.CompilerMojo.execute(CompilerMojo.java:114)
	at org.apache.maven.plugin.DefaultBuildPluginManager.executeMojo(DefaultBuildPluginManager.java:101)
	at org.apache.maven.lifecycle.internal.MojoExecutor.execute(MojoExecutor.java:209)
	... 27 more
channel stopped

---------------------------------------------------------------------
To unsubscribe, e-mail: dev-unsubscribe@ws.apache.org
For additional commands, e-mail: dev-help@ws.apache.org


Mime
View raw message