ws-dev mailing list archives

Site index · List index
Message view « Date » · « Thread »
Top « Date » · « Thread »
From Apache Jenkins Server <jenk...@builds.apache.org>
Subject Build failed in Jenkins: ws-axiom-trunk #1134
Date Tue, 31 Jul 2012 20:39:58 GMT
See <https://builds.apache.org/job/ws-axiom-trunk/1134/changes>

Changes:

[veithen] * Some documentation updates relevant for AXIOM-420.
* Added an OMDataSource implementation for JAXB. This also serves as a proof of completeness
of the push-style OMDataSource feature introduced by AXIOM-420.

------------------------------------------
[...truncated 4944 lines...]
Downloaded: http://repo.maven.apache.org/maven2/junit/junit/4.8.1/junit-4.8.1.pom (949 B at
71.3 KB/sec)
Downloading: http://repo.maven.apache.org/maven2/org/jfrog/maven/annomojo/maven-plugin-anno/1.3.1/maven-plugin-anno-1.3.1.pom
Downloaded: http://repo.maven.apache.org/maven2/org/jfrog/maven/annomojo/maven-plugin-anno/1.3.1/maven-plugin-anno-1.3.1.pom
(820 B at 12.0 KB/sec)
Downloading: http://repo.maven.apache.org/maven2/org/jfrog/maven/annomojo/maven-plugin-anno-parent/1.3.1/maven-plugin-anno-parent-1.3.1.pom
Downloaded: http://repo.maven.apache.org/maven2/org/jfrog/maven/annomojo/maven-plugin-anno-parent/1.3.1/maven-plugin-anno-parent-1.3.1.pom
(6 KB at 114.1 KB/sec)
Downloading: http://repo.maven.apache.org/maven2/org/jvnet/jaxb2/maven2/maven-jaxb22-plugin/0.8.0/maven-jaxb22-plugin-0.8.0.pom
Downloaded: http://repo.maven.apache.org/maven2/org/jvnet/jaxb2/maven2/maven-jaxb22-plugin/0.8.0/maven-jaxb22-plugin-0.8.0.pom
(3 KB at 17.3 KB/sec)
Downloading: http://repo.maven.apache.org/maven2/org/jvnet/jaxb2/maven2/maven-jaxb2-plugin-core/0.8.0/maven-jaxb2-plugin-core-0.8.0.jar
Downloading: http://repo.maven.apache.org/maven2/com/sun/org/apache/xml/internal/resolver/20050927/resolver-20050927.jar
Downloading: http://repo.maven.apache.org/maven2/org/codehaus/plexus/plexus-interpolation/1.11/plexus-interpolation-1.11.jar
Downloading: http://repo.maven.apache.org/maven2/org/codehaus/plexus/plexus-utils/1.5.15/plexus-utils-1.5.15.jar
Downloading: http://repo.maven.apache.org/maven2/junit/junit/4.8.1/junit-4.8.1.jar
Downloaded: http://repo.maven.apache.org/maven2/junit/junit/4.8.1/junit-4.8.1.jar (232 KB
at 7014.9 KB/sec)
Downloading: http://repo.maven.apache.org/maven2/org/jfrog/maven/annomojo/maven-plugin-anno/1.3.1/maven-plugin-anno-1.3.1.jar
Downloaded: http://repo.maven.apache.org/maven2/com/sun/org/apache/xml/internal/resolver/20050927/resolver-20050927.jar
(67 KB at 1902.3 KB/sec)
Downloading: http://repo.maven.apache.org/maven2/org/jvnet/jaxb2/maven2/maven-jaxb22-plugin/0.8.0/maven-jaxb22-plugin-0.8.0.jar
Downloaded: http://repo.maven.apache.org/maven2/org/codehaus/plexus/plexus-utils/1.5.15/plexus-utils-1.5.15.jar
(223 KB at 6020.6 KB/sec)
Downloaded: http://repo.maven.apache.org/maven2/org/codehaus/plexus/plexus-interpolation/1.11/plexus-interpolation-1.11.jar
(50 KB at 1344.4 KB/sec)
Downloading: http://repo.maven.apache.org/maven2/com/sun/xml/bind/jaxb-xjc/2.2.4-1/jaxb-xjc-2.2.4-1.jar
Downloaded: http://repo.maven.apache.org/maven2/org/jfrog/maven/annomojo/maven-plugin-anno/1.3.1/maven-plugin-anno-1.3.1.jar
(10 KB at 159.6 KB/sec)
Downloaded: http://repo.maven.apache.org/maven2/org/jvnet/jaxb2/maven2/maven-jaxb2-plugin-core/0.8.0/maven-jaxb2-plugin-core-0.8.0.jar
(37 KB at 366.2 KB/sec)
Downloaded: http://repo.maven.apache.org/maven2/org/jvnet/jaxb2/maven2/maven-jaxb22-plugin/0.8.0/maven-jaxb22-plugin-0.8.0.jar
(13 KB at 129.3 KB/sec)
Downloaded: http://repo.maven.apache.org/maven2/com/sun/xml/bind/jaxb-xjc/2.2.4-1/jaxb-xjc-2.2.4-1.jar
(3100 KB at 16662.7 KB/sec)
mojoSucceeded org.jvnet.jaxb2.maven2:maven-jaxb2-plugin:0.8.0(default)
[INFO] Using 'UTF-8' encoding to copy filtered resources.
[INFO] skip non existing resourceDirectory <https://builds.apache.org/job/ws-axiom-trunk/ws/axiom/modules/axiom-jaxb/src/test/resources>
[INFO] Copying 3 resources
[INFO] Copying 1 resource
mojoStarted org.apache.maven.plugins:maven-resources-plugin:2.4.3(default-testResources)
[INFO] 
[INFO] --- maven-resources-plugin:2.4.3:testResources (default-testResources) @ axiom-jaxb
---
mojoSucceeded org.apache.maven.plugins:maven-resources-plugin:2.4.3(default-testResources)
mojoStarted org.apache.maven.plugins:maven-compiler-plugin:2.3.2(default-testCompile)[INFO]
Compiling 14 source files to <https://builds.apache.org/job/ws-axiom-trunk/ws/axiom/modules/axiom-jaxb/target/test-classes>

[INFO] 
[INFO] --- maven-compiler-plugin:2.3.2:testCompile (default-testCompile) @ axiom-jaxb ---
mojoSucceeded org.apache.maven.plugins:maven-compiler-plugin:2.3.2(default-testCompile)
mojoStarted org.apache.maven.plugins:maven-surefire-plugin:2.10(default-test)[INFO] Surefire
report directory: <https://builds.apache.org/job/ws-axiom-trunk/ws/axiom/modules/axiom-jaxb/target/surefire-reports>

-------------------------------------------------------
 T E S T S
-------------------------------------------------------

[INFO] 
[INFO] --- maven-surefire-plugin:2.10:test (default-test) @ axiom-jaxb ---
Running org.apache.axiom.om.ds.jaxb.JAXBOMDataSourceTest
Tests run: 6, Failures: 0, Errors: 0, Skipped: 0, Time elapsed: 0.738 sec

Results :

Tests run: 6, Failures: 0, Errors: 0, Skipped: 0

mojoSucceeded org.apache.maven.plugins:maven-surefire-plugin:2.10(default-test)
[JENKINS] Recording test results
mojoStarted org.apache.felix:maven-bundle-plugin:1.4.0(default-bundle)
[INFO] 
[INFO] --- maven-bundle-plugin:1.4.0:bundle (default-bundle) @ axiom-jaxb ---
mojoSucceeded org.apache.felix:maven-bundle-plugin:1.4.0(default-bundle)
mojoStarted org.apache.maven.plugins:maven-assembly-plugin:2.2(source-release-assembly)[INFO]
Skipping the assembly in this project because it's not the Execution Root

[INFO] 
[INFO] --- maven-assembly-plugin:2.2:single (source-release-assembly) @ axiom-jaxb ---
mojoSucceeded org.apache.maven.plugins:maven-assembly-plugin:2.2(source-release-assembly)
Jul 31, 2012 8:38:18 PM hudson.maven.ExecutedMojo <init>
WARNING: Failed to getClass for org.apache.maven.plugin.source.SourceJarMojo
mojoStarted org.apache.maven.plugins:maven-source-plugin:2.1.2(attach-sources)
[INFO] 
[INFO] --- maven-source-plugin:2.1.2:jar (attach-sources) @ axiom-jaxb ---
[INFO] META-INF already added, skipping
[INFO] META-INF/LICENSE already added, skipping
[INFO] META-INF/NOTICE already added, skipping
[INFO] META-INF/DEPENDENCIES already added, skipping
[INFO] Building jar: <https://builds.apache.org/job/ws-axiom-trunk/ws/axiom/modules/axiom-jaxb/target/axiom-jaxb-1.2.14-SNAPSHOT-sources.jar>
[INFO] META-INF already added, skipping
[INFO] META-INF/LICENSE already added, skipping
[INFO] META-INF/NOTICE already added, skipping
[INFO] META-INF/DEPENDENCIES already added, skipping
mojoSucceeded org.apache.maven.plugins:maven-source-plugin:2.1.2(attach-sources)
mojoStarted org.apache.maven.plugins:maven-javadoc-plugin:2.5(attach-javadocs)
[INFO] 
[INFO] --- maven-javadoc-plugin:2.5:jar (attach-javadocs) @ axiom-jaxb ---
Loading source files for package org.apache.axiom.om.ds.jaxb...
Constructing Javadoc information...
Standard Doclet version 1.5.0_22
Building tree for all the packages and classes...
Generating <https://builds.apache.org/job/ws-axiom-trunk/ws/axiom/modules/axiom-jaxb/target/apidocs/org/apache/axiom/om/ds/jaxb//JAXBOMDataSource.html...>
Generating <https://builds.apache.org/job/ws-axiom-trunk/ws/axiom/modules/axiom-jaxb/target/apidocs/org/apache/axiom/om/ds/jaxb//package-frame.html...>
Generating <https://builds.apache.org/job/ws-axiom-trunk/ws/axiom/modules/axiom-jaxb/target/apidocs/org/apache/axiom/om/ds/jaxb//package-summary.html...>
Generating <https://builds.apache.org/job/ws-axiom-trunk/ws/axiom/modules/axiom-jaxb/target/apidocs/org/apache/axiom/om/ds/jaxb//package-tree.html...>
Generating <https://builds.apache.org/job/ws-axiom-trunk/ws/axiom/modules/axiom-jaxb/target/apidocs/constant-values.html...>
Generating <https://builds.apache.org/job/ws-axiom-trunk/ws/axiom/modules/axiom-jaxb/target/apidocs/org/apache/axiom/om/ds/jaxb/class-use//JAXBOMDataSource.html...>
Generating <https://builds.apache.org/job/ws-axiom-trunk/ws/axiom/modules/axiom-jaxb/target/apidocs/org/apache/axiom/om/ds/jaxb//package-use.html...>
Building index for all the packages and classes...
Generating <https://builds.apache.org/job/ws-axiom-trunk/ws/axiom/modules/axiom-jaxb/target/apidocs/overview-tree.html...>
Generating <https://builds.apache.org/job/ws-axiom-trunk/ws/axiom/modules/axiom-jaxb/target/apidocs/index-all.html...>
Generating <https://builds.apache.org/job/ws-axiom-trunk/ws/axiom/modules/axiom-jaxb/target/apidocs/deprecated-list.html...>
Building index for all classes...
Generating <https://builds.apache.org/job/ws-axiom-trunk/ws/axiom/modules/axiom-jaxb/target/apidocs/allclasses-frame.html...>
Generating <https://builds.apache.org/job/ws-axiom-trunk/ws/axiom/modules/axiom-jaxb/target/apidocs/allclasses-noframe.html...>
Generating <https://builds.apache.org/job/ws-axiom-trunk/ws/axiom/modules/axiom-jaxb/target/apidocs/index.html...>
Generating <https://builds.apache.org/job/ws-axiom-trunk/ws/axiom/modules/axiom-jaxb/target/apidocs/help-doc.html...>
Generating <https://builds.apache.org/job/ws-axiom-trunk/ws/axiom/modules/axiom-jaxb/target/apidocs/stylesheet.css...>
[INFO] Building jar: <https://builds.apache.org/job/ws-axiom-trunk/ws/axiom/modules/axiom-jaxb/target/axiom-jaxb-1.2.14-SNAPSHOT-javadoc.jar>
mojoSucceeded org.apache.maven.plugins:maven-javadoc-plugin:2.5(attach-javadocs)
mojoStarted org.apache.maven.plugins:maven-gpg-plugin:1.1(default)
[INFO] 
[INFO] --- maven-gpg-plugin:1.1:sign (default) @ axiom-jaxb ---
mojoSucceeded org.apache.maven.plugins:maven-gpg-plugin:1.1(default)
mojoStarted org.apache.rat:apache-rat-plugin:0.8(default)[INFO] Exclude: src/test/resources/**
[INFO] Exclude: dependency-reduced-pom.xml

[INFO] 
[INFO] --- apache-rat-plugin:0.8:check (default) @ axiom-jaxb ---
mojoFailed org.apache.rat:apache-rat-plugin:0.8(default)
projectFailed org.apache.ws.commons.axiom:axiom-jaxb:1.2.14-SNAPSHOT
sessionEnded
[INFO] ------------------------------------------------------------------------
[INFO] Reactor Summary:
[INFO] 
[INFO] Axiom Parent POM .................................. SUCCESS [23.793s]
[INFO] Axiom Build Utilities ............................. SUCCESS [13.525s]
[INFO] Axiom Test Utilities .............................. SUCCESS [14.839s]
[INFO] Axiom Jaxen Test Suite ............................ SUCCESS [10.028s]
[INFO] Axiom DOM Test Suite .............................. SUCCESS [22.522s]
[INFO] Axiom API ......................................... SUCCESS [3:23.548s]
[INFO] Axiom Implementation Test Suite ................... SUCCESS [28.213s]
[INFO] Axiom Common Implementation Classes ............... SUCCESS [12.529s]
[INFO] Axiom Common Implementation Test Suite ............ SUCCESS [9.072s]
[INFO] Axiom Impl ........................................ SUCCESS [6:12.539s]
[INFO] Axiom DOM ......................................... SUCCESS [5:41.706s]
[INFO] Axiom Compatibility Classes ....................... SUCCESS [11.730s]
[INFO] Axiom JAXB Integration ............................ FAILURE [8.152s]
[INFO] Axiom C14N ........................................ SKIPPED
[INFO] Axiom Test Suite .................................. SKIPPED
[INFO] Axiom OSGi Tests .................................. SKIPPED
[INFO] Axiom Integration Test Suite ...................... SKIPPED
[INFO] Axiom Uber-JAR .................................... SKIPPED
[INFO] Axiom Samples ..................................... SKIPPED
[INFO] Axiom ............................................. SKIPPED
[INFO] ------------------------------------------------------------------------
[INFO] BUILD FAILURE
[INFO] ------------------------------------------------------------------------
[INFO] Total time: 17:58.455s
[INFO] Finished at: Tue Jul 31 20:38:21 UTC 2012
[INFO] Final Memory: 36M/132M
[INFO] ------------------------------------------------------------------------
Projects to build: [MavenProject: org.apache.ws.commons.axiom:axiom-parent:1.2.14-SNAPSHOT
@ <https://builds.apache.org/job/ws-axiom-trunk/ws/axiom/modules/axiom-parent/pom.xml,>
MavenProject: org.apache.ws.commons.axiom:axiom-buildutils:1.2.14-SNAPSHOT @ <https://builds.apache.org/job/ws-axiom-trunk/ws/axiom/modules/axiom-buildutils/pom.xml,>
MavenProject: org.apache.ws.commons.axiom:axiom-testutils:1.2.14-SNAPSHOT @ <https://builds.apache.org/job/ws-axiom-trunk/ws/axiom/modules/axiom-testutils/pom.xml,>
MavenProject: org.apache.ws.commons.axiom:axiom-jaxen-testsuite:1.2.14-SNAPSHOT @ <https://builds.apache.org/job/ws-axiom-trunk/ws/axiom/modules/axiom-jaxen-testsuite/pom.xml,>
MavenProject: org.apache.ws.commons.axiom:axiom-dom-testsuite:1.2.14-SNAPSHOT @ <https://builds.apache.org/job/ws-axiom-trunk/ws/axiom/modules/axiom-dom-testsuite/pom.xml,>
MavenProject: org.apache.ws.commons.axiom:axiom-api:1.2.14-SNAPSHOT @ <https://builds.apache.org/job/ws-axiom-trunk/ws/axiom/modules/axiom-api/pom.xml,>
MavenProject: org.apache.ws.commons.axiom:axiom-testsuite:1.2.14-SNAPSHOT @ <https://builds.apache.org/job/ws-axiom-trunk/ws/axiom/modules/axiom-testsuite/pom.xml,>
MavenProject: org.apache.ws.commons.axiom:axiom-common-impl:1.2.14-SNAPSHOT @ <https://builds.apache.org/job/ws-axiom-trunk/ws/axiom/modules/axiom-common-impl/pom.xml,>
MavenProject: org.apache.ws.commons.axiom:axiom-common-impl-testsuite:1.2.14-SNAPSHOT @ <https://builds.apache.org/job/ws-axiom-trunk/ws/axiom/modules/axiom-common-impl-testsuite/pom.xml,>
MavenProject: org.apache.ws.commons.axiom:axiom-impl:1.2.14-SNAPSHOT @ <https://builds.apache.org/job/ws-axiom-trunk/ws/axiom/modules/axiom-impl/dependency-reduced-pom.xml,>
MavenProject: org.apache.ws.commons.axiom:axiom-dom:1.2.14-SNAPSHOT @ <https://builds.apache.org/job/ws-axiom-trunk/ws/axiom/modules/axiom-dom/dependency-reduced-pom.xml,>
MavenProject: org.apache.ws.commons.axiom:axiom-compat:1.2.14-SNAPSHOT @ <https://builds.apache.org/job/ws-axiom-trunk/ws/axiom/modules/axiom-compat/pom.xml,>
MavenProject: org.apache.ws.commons.axiom:axiom-jaxb:1.2.14-SNAPSHOT @ <https://builds.apache.org/job/ws-axiom-trunk/ws/axiom/modules/axiom-jaxb/pom.xml,>
MavenProject: org.apache.ws.commons.axiom:axiom-c14n:1.2.14-SNAPSHOT @ <https://builds.apache.org/job/ws-axiom-trunk/ws/axiom/modules/axiom-c14n/pom.xml,>
MavenProject: org.apache.ws.commons.axiom:axiom-tests:1.2.14-SNAPSHOT @ <https://builds.apache.org/job/ws-axiom-trunk/ws/axiom/modules/axiom-tests/pom.xml,>
MavenProject: org.apache.ws.commons.axiom:axiom-osgi-tests:1.2.14-SNAPSHOT @ <https://builds.apache.org/job/ws-axiom-trunk/ws/axiom/modules/axiom-osgi-tests/pom.xml,>
MavenProject: org.apache.ws.commons.axiom:axiom-integration:1.2.14-SNAPSHOT @ <https://builds.apache.org/job/ws-axiom-trunk/ws/axiom/modules/axiom-integration/pom.xml,>
MavenProject: org.apache.ws.commons.axiom:axiom-all:1.2.14-SNAPSHOT @ <https://builds.apache.org/job/ws-axiom-trunk/ws/axiom/modules/axiom-all/pom.xml,>
MavenProject: org.apache.ws.commons.axiom:axiom-samples:1.2.14-SNAPSHOT @ <https://builds.apache.org/job/ws-axiom-trunk/ws/axiom/modules/axiom-samples/pom.xml,>
MavenProject: org.apache.ws.commons.axiom:axiom:1.2.14-SNAPSHOT @ <https://builds.apache.org/job/ws-axiom-trunk/ws/axiom/pom.xml]>
[JENKINS] Archiving <https://builds.apache.org/job/ws-axiom-trunk/ws/axiom/modules/axiom-impl/dependency-reduced-pom.xml>
to /home/hudson/hudson/jobs/ws-axiom-trunk/modules/org.apache.ws.commons.axiom$axiom-impl/builds/2012-07-31_20-20-07/archive/org.apache.ws.commons.axiom/axiom-impl/1.2.14-SNAPSHOT/axiom-impl-1.2.14-SNAPSHOT.pom
[JENKINS] Archiving <https://builds.apache.org/job/ws-axiom-trunk/ws/axiom/modules/axiom-impl/target/axiom-impl-1.2.14-SNAPSHOT.jar>
to /home/hudson/hudson/jobs/ws-axiom-trunk/modules/org.apache.ws.commons.axiom$axiom-impl/builds/2012-07-31_20-20-07/archive/org.apache.ws.commons.axiom/axiom-impl/1.2.14-20120731.203213-265/axiom-impl-1.2.14-20120731.203213-265.jar
[JENKINS] Archiving <https://builds.apache.org/job/ws-axiom-trunk/ws/axiom/modules/axiom-impl/target/axiom-impl-1.2.14-SNAPSHOT-sources.jar>
to /home/hudson/hudson/jobs/ws-axiom-trunk/modules/org.apache.ws.commons.axiom$axiom-impl/builds/2012-07-31_20-20-07/archive/org.apache.ws.commons.axiom/axiom-impl/1.2.14-20120731.203213-265/axiom-impl-1.2.14-20120731.203213-265-sources.jar
[JENKINS] Archiving <https://builds.apache.org/job/ws-axiom-trunk/ws/axiom/modules/axiom-impl/target/axiom-impl-1.2.14-SNAPSHOT-javadoc.jar>
to /home/hudson/hudson/jobs/ws-axiom-trunk/modules/org.apache.ws.commons.axiom$axiom-impl/builds/2012-07-31_20-20-07/archive/org.apache.ws.commons.axiom/axiom-impl/1.2.14-20120731.203213-265/axiom-impl-1.2.14-20120731.203213-265-javadoc.jar
[JENKINS] Archiving <https://builds.apache.org/job/ws-axiom-trunk/ws/axiom/modules/axiom-impl/target/axiom-impl-1.2.14-SNAPSHOT-tests.jar>
to /home/hudson/hudson/jobs/ws-axiom-trunk/modules/org.apache.ws.commons.axiom$axiom-impl/builds/2012-07-31_20-20-07/archive/org.apache.ws.commons.axiom/axiom-impl/1.2.14-20120731.203213-265/axiom-impl-1.2.14-20120731.203213-265-tests.jar
[JENKINS] Archiving <https://builds.apache.org/job/ws-axiom-trunk/ws/axiom/modules/axiom-common-impl/pom.xml>
to /home/hudson/hudson/jobs/ws-axiom-trunk/modules/org.apache.ws.commons.axiom$axiom-common-impl/builds/2012-07-31_20-20-07/archive/org.apache.ws.commons.axiom/axiom-common-impl/1.2.14-SNAPSHOT/axiom-common-impl-1.2.14-SNAPSHOT.pom
[JENKINS] Archiving <https://builds.apache.org/job/ws-axiom-trunk/ws/axiom/modules/axiom-common-impl/target/axiom-common-impl-1.2.14-SNAPSHOT.jar>
to /home/hudson/hudson/jobs/ws-axiom-trunk/modules/org.apache.ws.commons.axiom$axiom-common-impl/builds/2012-07-31_20-20-07/archive/org.apache.ws.commons.axiom/axiom-common-impl/1.2.14-20120731.202552-265/axiom-common-impl-1.2.14-20120731.202552-265.jar
[JENKINS] Archiving <https://builds.apache.org/job/ws-axiom-trunk/ws/axiom/modules/axiom-common-impl/target/axiom-common-impl-1.2.14-SNAPSHOT-sources.jar>
to /home/hudson/hudson/jobs/ws-axiom-trunk/modules/org.apache.ws.commons.axiom$axiom-common-impl/builds/2012-07-31_20-20-07/archive/org.apache.ws.commons.axiom/axiom-common-impl/1.2.14-20120731.202552-265/axiom-common-impl-1.2.14-20120731.202552-265-sources.jar
[JENKINS] Archiving <https://builds.apache.org/job/ws-axiom-trunk/ws/axiom/modules/axiom-common-impl/target/axiom-common-impl-1.2.14-SNAPSHOT-javadoc.jar>
to /home/hudson/hudson/jobs/ws-axiom-trunk/modules/org.apache.ws.commons.axiom$axiom-common-impl/builds/2012-07-31_20-20-07/archive/org.apache.ws.commons.axiom/axiom-common-impl/1.2.14-20120731.202552-265/axiom-common-impl-1.2.14-20120731.202552-265-javadoc.jar
[JENKINS] Archiving <https://builds.apache.org/job/ws-axiom-trunk/ws/axiom/modules/axiom-jaxb/pom.xml>
to /home/hudson/hudson/jobs/ws-axiom-trunk/modules/org.apache.ws.commons.axiom$axiom-jaxb/builds/2012-07-31_20-20-07/archive/org.apache.ws.commons.axiom/axiom-jaxb/1.2.14-SNAPSHOT/axiom-jaxb-1.2.14-SNAPSHOT.pom
[JENKINS] Archiving <https://builds.apache.org/job/ws-axiom-trunk/ws/axiom/modules/axiom-jaxb/target/axiom-jaxb-1.2.14-SNAPSHOT.jar>
to /home/hudson/hudson/jobs/ws-axiom-trunk/modules/org.apache.ws.commons.axiom$axiom-jaxb/builds/2012-07-31_20-20-07/archive/org.apache.ws.commons.axiom/axiom-jaxb/1.2.14-SNAPSHOT/axiom-jaxb-1.2.14-SNAPSHOT.jar
[JENKINS] Archiving <https://builds.apache.org/job/ws-axiom-trunk/ws/axiom/modules/axiom-jaxb/target/axiom-jaxb-1.2.14-SNAPSHOT-sources.jar>
to /home/hudson/hudson/jobs/ws-axiom-trunk/modules/org.apache.ws.commons.axiom$axiom-jaxb/builds/2012-07-31_20-20-07/archive/org.apache.ws.commons.axiom/axiom-jaxb/1.2.14-SNAPSHOT/axiom-jaxb-1.2.14-SNAPSHOT-sources.jar
[JENKINS] Archiving <https://builds.apache.org/job/ws-axiom-trunk/ws/axiom/modules/axiom-jaxb/target/axiom-jaxb-1.2.14-SNAPSHOT-javadoc.jar>
to /home/hudson/hudson/jobs/ws-axiom-trunk/modules/org.apache.ws.commons.axiom$axiom-jaxb/builds/2012-07-31_20-20-07/archive/org.apache.ws.commons.axiom/axiom-jaxb/1.2.14-SNAPSHOT/axiom-jaxb-1.2.14-SNAPSHOT-javadoc.jar
[JENKINS] Archiving <https://builds.apache.org/job/ws-axiom-trunk/ws/axiom/modules/axiom-buildutils/pom.xml>
to /home/hudson/hudson/jobs/ws-axiom-trunk/modules/org.apache.ws.commons.axiom$axiom-buildutils/builds/2012-07-31_20-20-06/archive/org.apache.ws.commons.axiom/axiom-buildutils/1.2.14-SNAPSHOT/axiom-buildutils-1.2.14-SNAPSHOT.pom
[JENKINS] Archiving <https://builds.apache.org/job/ws-axiom-trunk/ws/axiom/modules/axiom-buildutils/target/axiom-buildutils-1.2.14-SNAPSHOT.jar>
to /home/hudson/hudson/jobs/ws-axiom-trunk/modules/org.apache.ws.commons.axiom$axiom-buildutils/builds/2012-07-31_20-20-06/archive/org.apache.ws.commons.axiom/axiom-buildutils/1.2.14-20120731.202059-270/axiom-buildutils-1.2.14-20120731.202059-270.jar
[JENKINS] Archiving <https://builds.apache.org/job/ws-axiom-trunk/ws/axiom/modules/axiom-buildutils/target/axiom-buildutils-1.2.14-SNAPSHOT-sources.jar>
to /home/hudson/hudson/jobs/ws-axiom-trunk/modules/org.apache.ws.commons.axiom$axiom-buildutils/builds/2012-07-31_20-20-06/archive/org.apache.ws.commons.axiom/axiom-buildutils/1.2.14-20120731.202059-270/axiom-buildutils-1.2.14-20120731.202059-270-sources.jar
[JENKINS] Archiving <https://builds.apache.org/job/ws-axiom-trunk/ws/axiom/modules/axiom-buildutils/target/axiom-buildutils-1.2.14-SNAPSHOT-javadoc.jar>
to /home/hudson/hudson/jobs/ws-axiom-trunk/modules/org.apache.ws.commons.axiom$axiom-buildutils/builds/2012-07-31_20-20-06/archive/org.apache.ws.commons.axiom/axiom-buildutils/1.2.14-20120731.202059-270/axiom-buildutils-1.2.14-20120731.202059-270-javadoc.jar
[JENKINS] Archiving <https://builds.apache.org/job/ws-axiom-trunk/ws/axiom/modules/axiom-tests/pom.xml>
to /home/hudson/hudson/jobs/ws-axiom-trunk/modules/org.apache.ws.commons.axiom$axiom-tests/builds/2012-07-31_20-20-07/archive/org.apache.ws.commons.axiom/axiom-tests/1.2.14-SNAPSHOT/axiom-tests-1.2.14-SNAPSHOT.pom
[JENKINS] Archiving <https://builds.apache.org/job/ws-axiom-trunk/ws/axiom/modules/axiom-jaxen-testsuite/pom.xml>
to /home/hudson/hudson/jobs/ws-axiom-trunk/modules/org.apache.ws.commons.axiom$axiom-jaxen-testsuite/builds/2012-07-31_20-20-06/archive/org.apache.ws.commons.axiom/axiom-jaxen-testsuite/1.2.14-SNAPSHOT/axiom-jaxen-testsuite-1.2.14-SNAPSHOT.pom
[JENKINS] Archiving <https://builds.apache.org/job/ws-axiom-trunk/ws/axiom/modules/axiom-jaxen-testsuite/target/axiom-jaxen-testsuite-1.2.14-SNAPSHOT.jar>
to /home/hudson/hudson/jobs/ws-axiom-trunk/modules/org.apache.ws.commons.axiom$axiom-jaxen-testsuite/builds/2012-07-31_20-20-06/archive/org.apache.ws.commons.axiom/axiom-jaxen-testsuite/1.2.14-20120731.202124-266/axiom-jaxen-testsuite-1.2.14-20120731.202124-266.jar
[JENKINS] Archiving <https://builds.apache.org/job/ws-axiom-trunk/ws/axiom/modules/axiom-jaxen-testsuite/target/axiom-jaxen-testsuite-1.2.14-SNAPSHOT-sources.jar>
to /home/hudson/hudson/jobs/ws-axiom-trunk/modules/org.apache.ws.commons.axiom$axiom-jaxen-testsuite/builds/2012-07-31_20-20-06/archive/org.apache.ws.commons.axiom/axiom-jaxen-testsuite/1.2.14-20120731.202124-266/axiom-jaxen-testsuite-1.2.14-20120731.202124-266-sources.jar
[JENKINS] Archiving <https://builds.apache.org/job/ws-axiom-trunk/ws/axiom/modules/axiom-jaxen-testsuite/target/axiom-jaxen-testsuite-1.2.14-SNAPSHOT-javadoc.jar>
to /home/hudson/hudson/jobs/ws-axiom-trunk/modules/org.apache.ws.commons.axiom$axiom-jaxen-testsuite/builds/2012-07-31_20-20-06/archive/org.apache.ws.commons.axiom/axiom-jaxen-testsuite/1.2.14-20120731.202124-266/axiom-jaxen-testsuite-1.2.14-20120731.202124-266-javadoc.jar
[JENKINS] Archiving <https://builds.apache.org/job/ws-axiom-trunk/ws/axiom/modules/axiom-testutils/pom.xml>
to /home/hudson/hudson/jobs/ws-axiom-trunk/modules/org.apache.ws.commons.axiom$axiom-testutils/builds/2012-07-31_20-20-06/archive/org.apache.ws.commons.axiom/axiom-testutils/1.2.14-SNAPSHOT/axiom-testutils-1.2.14-SNAPSHOT.pom
[JENKINS] Archiving <https://builds.apache.org/job/ws-axiom-trunk/ws/axiom/modules/axiom-testutils/target/axiom-testutils-1.2.14-SNAPSHOT.jar>
to /home/hudson/hudson/jobs/ws-axiom-trunk/modules/org.apache.ws.commons.axiom$axiom-testutils/builds/2012-07-31_20-20-06/archive/org.apache.ws.commons.axiom/axiom-testutils/1.2.14-20120731.202113-267/axiom-testutils-1.2.14-20120731.202113-267.jar
[JENKINS] Archiving <https://builds.apache.org/job/ws-axiom-trunk/ws/axiom/modules/axiom-testutils/target/axiom-testutils-1.2.14-SNAPSHOT-sources.jar>
to /home/hudson/hudson/jobs/ws-axiom-trunk/modules/org.apache.ws.commons.axiom$axiom-testutils/builds/2012-07-31_20-20-06/archive/org.apache.ws.commons.axiom/axiom-testutils/1.2.14-20120731.202113-267/axiom-testutils-1.2.14-20120731.202113-267-sources.jar
[JENKINS] Archiving <https://builds.apache.org/job/ws-axiom-trunk/ws/axiom/modules/axiom-testutils/target/axiom-testutils-1.2.14-SNAPSHOT-javadoc.jar>
to /home/hudson/hudson/jobs/ws-axiom-trunk/modules/org.apache.ws.commons.axiom$axiom-testutils/builds/2012-07-31_20-20-06/archive/org.apache.ws.commons.axiom/axiom-testutils/1.2.14-20120731.202113-267/axiom-testutils-1.2.14-20120731.202113-267-javadoc.jar
[JENKINS] Archiving <https://builds.apache.org/job/ws-axiom-trunk/ws/axiom/modules/axiom-api/pom.xml>
to /home/hudson/hudson/jobs/ws-axiom-trunk/modules/org.apache.ws.commons.axiom$axiom-api/builds/2012-07-31_20-20-07/archive/org.apache.ws.commons.axiom/axiom-api/1.2.14-SNAPSHOT/axiom-api-1.2.14-SNAPSHOT.pom
[JENKINS] Archiving <https://builds.apache.org/job/ws-axiom-trunk/ws/axiom/modules/axiom-api/target/axiom-api-1.2.14-SNAPSHOT.jar>
to /home/hudson/hudson/jobs/ws-axiom-trunk/modules/org.apache.ws.commons.axiom$axiom-api/builds/2012-07-31_20-20-07/archive/org.apache.ws.commons.axiom/axiom-api/1.2.14-20120731.202507-265/axiom-api-1.2.14-20120731.202507-265.jar
[JENKINS] Archiving <https://builds.apache.org/job/ws-axiom-trunk/ws/axiom/modules/axiom-api/target/axiom-api-1.2.14-SNAPSHOT-sources.jar>
to /home/hudson/hudson/jobs/ws-axiom-trunk/modules/org.apache.ws.commons.axiom$axiom-api/builds/2012-07-31_20-20-07/archive/org.apache.ws.commons.axiom/axiom-api/1.2.14-20120731.202507-265/axiom-api-1.2.14-20120731.202507-265-sources.jar
[JENKINS] Archiving <https://builds.apache.org/job/ws-axiom-trunk/ws/axiom/modules/axiom-api/target/axiom-api-1.2.14-SNAPSHOT-javadoc.jar>
to /home/hudson/hudson/jobs/ws-axiom-trunk/modules/org.apache.ws.commons.axiom$axiom-api/builds/2012-07-31_20-20-07/archive/org.apache.ws.commons.axiom/axiom-api/1.2.14-20120731.202507-265/axiom-api-1.2.14-20120731.202507-265-javadoc.jar
[JENKINS] Archiving <https://builds.apache.org/job/ws-axiom-trunk/ws/axiom/modules/axiom-api/target/axiom-api-1.2.14-SNAPSHOT-tests.jar>
to /home/hudson/hudson/jobs/ws-axiom-trunk/modules/org.apache.ws.commons.axiom$axiom-api/builds/2012-07-31_20-20-07/archive/org.apache.ws.commons.axiom/axiom-api/1.2.14-20120731.202507-265/axiom-api-1.2.14-20120731.202507-265-tests.jar
[JENKINS] Archiving <https://builds.apache.org/job/ws-axiom-trunk/ws/axiom/modules/axiom-samples/pom.xml>
to /home/hudson/hudson/jobs/ws-axiom-trunk/modules/org.apache.ws.commons.axiom$axiom-samples/builds/2012-07-31_20-20-08/archive/org.apache.ws.commons.axiom/axiom-samples/1.2.14-SNAPSHOT/axiom-samples-1.2.14-SNAPSHOT.pom
[JENKINS] Archiving <https://builds.apache.org/job/ws-axiom-trunk/ws/axiom/modules/axiom-all/pom.xml>
to /home/hudson/hudson/jobs/ws-axiom-trunk/modules/org.apache.ws.commons.axiom$axiom-all/builds/2012-07-31_20-20-08/archive/org.apache.ws.commons.axiom/axiom-all/1.2.14-SNAPSHOT/axiom-all-1.2.14-SNAPSHOT.pom
[JENKINS] Archiving <https://builds.apache.org/job/ws-axiom-trunk/ws/axiom/modules/axiom-dom/dependency-reduced-pom.xml>
to /home/hudson/hudson/jobs/ws-axiom-trunk/modules/org.apache.ws.commons.axiom$axiom-dom/builds/2012-07-31_20-20-07/archive/org.apache.ws.commons.axiom/axiom-dom/1.2.14-SNAPSHOT/axiom-dom-1.2.14-SNAPSHOT.pom
[JENKINS] Archiving <https://builds.apache.org/job/ws-axiom-trunk/ws/axiom/modules/axiom-dom/target/axiom-dom-1.2.14-SNAPSHOT.jar>
to /home/hudson/hudson/jobs/ws-axiom-trunk/modules/org.apache.ws.commons.axiom$axiom-dom/builds/2012-07-31_20-20-07/archive/org.apache.ws.commons.axiom/axiom-dom/1.2.14-20120731.203753-265/axiom-dom-1.2.14-20120731.203753-265.jar
[JENKINS] Archiving <https://builds.apache.org/job/ws-axiom-trunk/ws/axiom/modules/axiom-dom/target/axiom-dom-1.2.14-SNAPSHOT-sources.jar>
to /home/hudson/hudson/jobs/ws-axiom-trunk/modules/org.apache.ws.commons.axiom$axiom-dom/builds/2012-07-31_20-20-07/archive/org.apache.ws.commons.axiom/axiom-dom/1.2.14-20120731.203753-265/axiom-dom-1.2.14-20120731.203753-265-sources.jar
[JENKINS] Archiving <https://builds.apache.org/job/ws-axiom-trunk/ws/axiom/modules/axiom-dom/target/axiom-dom-1.2.14-SNAPSHOT-javadoc.jar>
to /home/hudson/hudson/jobs/ws-axiom-trunk/modules/org.apache.ws.commons.axiom$axiom-dom/builds/2012-07-31_20-20-07/archive/org.apache.ws.commons.axiom/axiom-dom/1.2.14-20120731.203753-265/axiom-dom-1.2.14-20120731.203753-265-javadoc.jar
[JENKINS] Archiving <https://builds.apache.org/job/ws-axiom-trunk/ws/axiom/modules/axiom-dom/target/axiom-dom-1.2.14-SNAPSHOT-tests.jar>
to /home/hudson/hudson/jobs/ws-axiom-trunk/modules/org.apache.ws.commons.axiom$axiom-dom/builds/2012-07-31_20-20-07/archive/org.apache.ws.commons.axiom/axiom-dom/1.2.14-20120731.203753-265/axiom-dom-1.2.14-20120731.203753-265-tests.jar
[JENKINS] Archiving <https://builds.apache.org/job/ws-axiom-trunk/ws/axiom/modules/axiom-dom-testsuite/pom.xml>
to /home/hudson/hudson/jobs/ws-axiom-trunk/modules/org.apache.ws.commons.axiom$axiom-dom-testsuite/builds/2012-07-31_20-20-06/archive/org.apache.ws.commons.axiom/axiom-dom-testsuite/1.2.14-SNAPSHOT/axiom-dom-testsuite-1.2.14-SNAPSHOT.pom
[JENKINS] Archiving <https://builds.apache.org/job/ws-axiom-trunk/ws/axiom/modules/axiom-dom-testsuite/target/axiom-dom-testsuite-1.2.14-SNAPSHOT.jar>
to /home/hudson/hudson/jobs/ws-axiom-trunk/modules/org.apache.ws.commons.axiom$axiom-dom-testsuite/builds/2012-07-31_20-20-06/archive/org.apache.ws.commons.axiom/axiom-dom-testsuite/1.2.14-20120731.202147-266/axiom-dom-testsuite-1.2.14-20120731.202147-266.jar
[JENKINS] Archiving <https://builds.apache.org/job/ws-axiom-trunk/ws/axiom/modules/axiom-dom-testsuite/target/axiom-dom-testsuite-1.2.14-SNAPSHOT-sources.jar>
to /home/hudson/hudson/jobs/ws-axiom-trunk/modules/org.apache.ws.commons.axiom$axiom-dom-testsuite/builds/2012-07-31_20-20-06/archive/org.apache.ws.commons.axiom/axiom-dom-testsuite/1.2.14-20120731.202147-266/axiom-dom-testsuite-1.2.14-20120731.202147-266-sources.jar
[JENKINS] Archiving <https://builds.apache.org/job/ws-axiom-trunk/ws/axiom/modules/axiom-dom-testsuite/target/axiom-dom-testsuite-1.2.14-SNAPSHOT-javadoc.jar>
to /home/hudson/hudson/jobs/ws-axiom-trunk/modules/org.apache.ws.commons.axiom$axiom-dom-testsuite/builds/2012-07-31_20-20-06/archive/org.apache.ws.commons.axiom/axiom-dom-testsuite/1.2.14-20120731.202147-266/axiom-dom-testsuite-1.2.14-20120731.202147-266-javadoc.jar
[JENKINS] Archiving <https://builds.apache.org/job/ws-axiom-trunk/ws/axiom/modules/axiom-testsuite/pom.xml>
to /home/hudson/hudson/jobs/ws-axiom-trunk/modules/org.apache.ws.commons.axiom$axiom-testsuite/builds/2012-07-31_20-20-07/archive/org.apache.ws.commons.axiom/axiom-testsuite/1.2.14-SNAPSHOT/axiom-testsuite-1.2.14-SNAPSHOT.pom
[JENKINS] Archiving <https://builds.apache.org/job/ws-axiom-trunk/ws/axiom/modules/axiom-testsuite/target/axiom-testsuite-1.2.14-SNAPSHOT.jar>
to /home/hudson/hudson/jobs/ws-axiom-trunk/modules/org.apache.ws.commons.axiom$axiom-testsuite/builds/2012-07-31_20-20-07/archive/org.apache.ws.commons.axiom/axiom-testsuite/1.2.14-20120731.202536-265/axiom-testsuite-1.2.14-20120731.202536-265.jar
[JENKINS] Archiving <https://builds.apache.org/job/ws-axiom-trunk/ws/axiom/modules/axiom-testsuite/target/axiom-testsuite-1.2.14-SNAPSHOT-sources.jar>
to /home/hudson/hudson/jobs/ws-axiom-trunk/modules/org.apache.ws.commons.axiom$axiom-testsuite/builds/2012-07-31_20-20-07/archive/org.apache.ws.commons.axiom/axiom-testsuite/1.2.14-20120731.202536-265/axiom-testsuite-1.2.14-20120731.202536-265-sources.jar
[JENKINS] Archiving <https://builds.apache.org/job/ws-axiom-trunk/ws/axiom/modules/axiom-testsuite/target/axiom-testsuite-1.2.14-SNAPSHOT-javadoc.jar>
to /home/hudson/hudson/jobs/ws-axiom-trunk/modules/org.apache.ws.commons.axiom$axiom-testsuite/builds/2012-07-31_20-20-07/archive/org.apache.ws.commons.axiom/axiom-testsuite/1.2.14-20120731.202536-265/axiom-testsuite-1.2.14-20120731.202536-265-javadoc.jar
[JENKINS] Archiving <https://builds.apache.org/job/ws-axiom-trunk/ws/axiom/modules/axiom-c14n/pom.xml>
to /home/hudson/hudson/jobs/ws-axiom-trunk/modules/org.apache.ws.commons.axiom$axiom-c14n/builds/2012-07-31_20-20-07/archive/org.apache.ws.commons.axiom/axiom-c14n/1.2.14-SNAPSHOT/axiom-c14n-1.2.14-SNAPSHOT.pom
[JENKINS] Archiving <https://builds.apache.org/job/ws-axiom-trunk/ws/axiom/pom.xml>
to /home/hudson/hudson/jobs/ws-axiom-trunk/modules/org.apache.ws.commons.axiom$axiom/builds/2012-07-31_20-20-05/archive/org.apache.ws.commons.axiom/axiom/1.2.14-SNAPSHOT/axiom-1.2.14-SNAPSHOT.pom
[JENKINS] Archiving <https://builds.apache.org/job/ws-axiom-trunk/ws/axiom/modules/axiom-parent/pom.xml>
to /home/hudson/hudson/jobs/ws-axiom-trunk/modules/org.apache.ws.commons.axiom$axiom-parent/builds/2012-07-31_20-20-06/archive/org.apache.ws.commons.axiom/axiom-parent/1.2.14-SNAPSHOT/axiom-parent-1.2.14-SNAPSHOT.pom
[JENKINS] Archiving <https://builds.apache.org/job/ws-axiom-trunk/ws/axiom/modules/axiom-common-impl-testsuite/pom.xml>
to /home/hudson/hudson/jobs/ws-axiom-trunk/modules/org.apache.ws.commons.axiom$axiom-common-impl-testsuite/builds/2012-07-31_20-20-07/archive/org.apache.ws.commons.axiom/axiom-common-impl-testsuite/1.2.14-SNAPSHOT/axiom-common-impl-testsuite-1.2.14-SNAPSHOT.pom
[JENKINS] Archiving <https://builds.apache.org/job/ws-axiom-trunk/ws/axiom/modules/axiom-common-impl-testsuite/target/axiom-common-impl-testsuite-1.2.14-SNAPSHOT.jar>
to /home/hudson/hudson/jobs/ws-axiom-trunk/modules/org.apache.ws.commons.axiom$axiom-common-impl-testsuite/builds/2012-07-31_20-20-07/archive/org.apache.ws.commons.axiom/axiom-common-impl-testsuite/1.2.14-20120731.202602-265/axiom-common-impl-testsuite-1.2.14-20120731.202602-265.jar
[JENKINS] Archiving <https://builds.apache.org/job/ws-axiom-trunk/ws/axiom/modules/axiom-common-impl-testsuite/target/axiom-common-impl-testsuite-1.2.14-SNAPSHOT-sources.jar>
to /home/hudson/hudson/jobs/ws-axiom-trunk/modules/org.apache.ws.commons.axiom$axiom-common-impl-testsuite/builds/2012-07-31_20-20-07/archive/org.apache.ws.commons.axiom/axiom-common-impl-testsuite/1.2.14-20120731.202602-265/axiom-common-impl-testsuite-1.2.14-20120731.202602-265-sources.jar
[JENKINS] Archiving <https://builds.apache.org/job/ws-axiom-trunk/ws/axiom/modules/axiom-common-impl-testsuite/target/axiom-common-impl-testsuite-1.2.14-SNAPSHOT-javadoc.jar>
to /home/hudson/hudson/jobs/ws-axiom-trunk/modules/org.apache.ws.commons.axiom$axiom-common-impl-testsuite/builds/2012-07-31_20-20-07/archive/org.apache.ws.commons.axiom/axiom-common-impl-testsuite/1.2.14-20120731.202602-265/axiom-common-impl-testsuite-1.2.14-20120731.202602-265-javadoc.jar
[JENKINS] Archiving <https://builds.apache.org/job/ws-axiom-trunk/ws/axiom/modules/axiom-compat/pom.xml>
to /home/hudson/hudson/jobs/ws-axiom-trunk/modules/org.apache.ws.commons.axiom$axiom-compat/builds/2012-07-31_20-20-07/archive/org.apache.ws.commons.axiom/axiom-compat/1.2.14-SNAPSHOT/axiom-compat-1.2.14-SNAPSHOT.pom
[JENKINS] Archiving <https://builds.apache.org/job/ws-axiom-trunk/ws/axiom/modules/axiom-compat/target/axiom-compat-1.2.14-SNAPSHOT.jar>
to /home/hudson/hudson/jobs/ws-axiom-trunk/modules/org.apache.ws.commons.axiom$axiom-compat/builds/2012-07-31_20-20-07/archive/org.apache.ws.commons.axiom/axiom-compat/1.2.14-20120731.203808-216/axiom-compat-1.2.14-20120731.203808-216.jar
[JENKINS] Archiving <https://builds.apache.org/job/ws-axiom-trunk/ws/axiom/modules/axiom-compat/target/axiom-compat-1.2.14-SNAPSHOT-sources.jar>
to /home/hudson/hudson/jobs/ws-axiom-trunk/modules/org.apache.ws.commons.axiom$axiom-compat/builds/2012-07-31_20-20-07/archive/org.apache.ws.commons.axiom/axiom-compat/1.2.14-20120731.203808-216/axiom-compat-1.2.14-20120731.203808-216-sources.jar
[JENKINS] Archiving <https://builds.apache.org/job/ws-axiom-trunk/ws/axiom/modules/axiom-compat/target/axiom-compat-1.2.14-SNAPSHOT-javadoc.jar>
to /home/hudson/hudson/jobs/ws-axiom-trunk/modules/org.apache.ws.commons.axiom$axiom-compat/builds/2012-07-31_20-20-07/archive/org.apache.ws.commons.axiom/axiom-compat/1.2.14-20120731.203808-216/axiom-compat-1.2.14-20120731.203808-216-javadoc.jar
[JENKINS] Archiving <https://builds.apache.org/job/ws-axiom-trunk/ws/axiom/modules/axiom-osgi-tests/pom.xml>
to /home/hudson/hudson/jobs/ws-axiom-trunk/modules/org.apache.ws.commons.axiom$axiom-osgi-tests/builds/2012-07-31_20-20-08/archive/org.apache.ws.commons.axiom/axiom-osgi-tests/1.2.14-SNAPSHOT/axiom-osgi-tests-1.2.14-SNAPSHOT.pom
[JENKINS] Archiving <https://builds.apache.org/job/ws-axiom-trunk/ws/axiom/modules/axiom-integration/pom.xml>
to /home/hudson/hudson/jobs/ws-axiom-trunk/modules/org.apache.ws.commons.axiom$axiom-integration/builds/2012-07-31_20-20-08/archive/org.apache.ws.commons.axiom/axiom-integration/1.2.14-SNAPSHOT/axiom-integration-1.2.14-SNAPSHOT.pom
Waiting for Jenkins to finish collecting data
mavenExecutionResult exceptions not empty
message : Failed to execute goal org.apache.rat:apache-rat-plugin:0.8:check (default) on project
axiom-jaxb: Too many unapproved licenses: 1
cause : Too many unapproved licenses: 1
Stack trace : 
org.apache.maven.lifecycle.LifecycleExecutionException: Failed to execute goal org.apache.rat:apache-rat-plugin:0.8:check
(default) on project axiom-jaxb: Too many unapproved licenses: 1
	at org.apache.maven.lifecycle.internal.MojoExecutor.execute(MojoExecutor.java:213)
	at org.apache.maven.lifecycle.internal.MojoExecutor.execute(MojoExecutor.java:153)
	at org.apache.maven.lifecycle.internal.MojoExecutor.execute(MojoExecutor.java:145)
	at org.apache.maven.lifecycle.internal.LifecycleModuleBuilder.buildProject(LifecycleModuleBuilder.java:84)
	at org.apache.maven.lifecycle.internal.LifecycleModuleBuilder.buildProject(LifecycleModuleBuilder.java:59)
	at org.apache.maven.lifecycle.internal.LifecycleStarter.singleThreadedBuild(LifecycleStarter.java:183)
	at org.apache.maven.lifecycle.internal.LifecycleStarter.execute(LifecycleStarter.java:161)
	at org.apache.maven.DefaultMaven.doExecute(DefaultMaven.java:320)
	at org.apache.maven.DefaultMaven.execute(DefaultMaven.java:156)
	at org.jvnet.hudson.maven3.launcher.Maven3Launcher.main(Maven3Launcher.java:79)
	at sun.reflect.NativeMethodAccessorImpl.invoke0(Native Method)
	at sun.reflect.NativeMethodAccessorImpl.invoke(NativeMethodAccessorImpl.java:39)
	at sun.reflect.DelegatingMethodAccessorImpl.invoke(DelegatingMethodAccessorImpl.java:25)
	at java.lang.reflect.Method.invoke(Method.java:592)
	at org.codehaus.plexus.classworlds.launcher.Launcher.launchStandard(Launcher.java:329)
	at org.codehaus.plexus.classworlds.launcher.Launcher.launch(Launcher.java:239)
	at org.jvnet.hudson.maven3.agent.Maven3Main.launch(Maven3Main.java:158)
	at hudson.maven.Maven3Builder.call(Maven3Builder.java:98)
	at hudson.maven.Maven3Builder.call(Maven3Builder.java:64)
	at hudson.remoting.UserRequest.perform(UserRequest.java:118)
	at hudson.remoting.UserRequest.perform(UserRequest.java:48)
	at hudson.remoting.Request$2.run(Request.java:326)
	at hudson.remoting.InterceptingExecutorService$1.call(InterceptingExecutorService.java:72)
	at java.util.concurrent.FutureTask$Sync.innerRun(FutureTask.java:269)
	at java.util.concurrent.FutureTask.run(FutureTask.java:123)
	at java.util.concurrent.ThreadPoolExecutor$Worker.runTask(ThreadPoolExecutor.java:651)
	at java.util.concurrent.ThreadPoolExecutor$Worker.run(ThreadPoolExecutor.java:676)
	at java.lang.Thread.run(Thread.java:595)
Caused by: org.apache.rat.mp.RatCheckException: Too many unapproved licenses: 1
	at org.apache.rat.mp.RatCheckMojo.check(RatCheckMojo.java:167)
	at org.apache.rat.mp.RatCheckMojo.execute(RatCheckMojo.java:159)
	at org.apache.maven.plugin.DefaultBuildPluginManager.executeMojo(DefaultBuildPluginManager.java:101)
	at org.apache.maven.lifecycle.internal.MojoExecutor.execute(MojoExecutor.java:209)
	... 27 more
Sending e-mails to: dev@ws.apache.org andreas.veithen@gmail.com
channel stopped
Updating AXIOM-420

---------------------------------------------------------------------
To unsubscribe, e-mail: dev-unsubscribe@ws.apache.org
For additional commands, e-mail: dev-help@ws.apache.org


Mime
View raw message