ws-dev mailing list archives

Site index · List index
Message view « Date » · « Thread »
Top « Date » · « Thread »
From Apache Jenkins Server <jenk...@builds.apache.org>
Subject Build failed in Jenkins: ws-axiom-trunk #1060
Date Sun, 01 Jul 2012 02:00:31 GMT
See <https://builds.apache.org/job/ws-axiom-trunk/1060/>

------------------------------------------
Started by timer
Building remotely on ubuntu2 in workspace <https://builds.apache.org/job/ws-axiom-trunk/ws/>
Updating http://svn.apache.org/repos/asf/webservices/commons/trunk/modules/axiom
At revision 1355842
no change for http://svn.apache.org/repos/asf/webservices/commons/trunk/modules/axiom since
the previous build
[ws-axiom-trunk] $ /bin/bash -xe /tmp/hudson4448636230908261598.sh
+ '[' -d <https://builds.apache.org/job/ws-axiom-trunk/ws/.repository> ']'
++ find <https://builds.apache.org/job/ws-axiom-trunk/ws/.repository> -type d -and -name
'*-SNAPSHOT'
+ rm -rf <https://builds.apache.org/job/ws-axiom-trunk/ws/.repository/org/apache/james/apache-mime4j-project/0.8-SNAPSHOT>
<https://builds.apache.org/job/ws-axiom-trunk/ws/.repository/org/apache/james/apache-mime4j-core/0.8-SNAPSHOT>
<https://builds.apache.org/job/ws-axiom-trunk/ws/.repository/org/apache/ws/commons/axiom/axiom-buildutils/1.2.14-SNAPSHOT>
<https://builds.apache.org/job/ws-axiom-trunk/ws/.repository/org/apache/ws/commons/axiom/axiom-all/1.2.14-SNAPSHOT>
<https://builds.apache.org/job/ws-axiom-trunk/ws/.repository/org/apache/ws/commons/axiom/axiom-osgi-tests/1.2.14-SNAPSHOT>
<https://builds.apache.org/job/ws-axiom-trunk/ws/.repository/org/apache/ws/commons/axiom/axiom-jaxen-testsuite/1.2.14-SNAPSHOT>
<https://builds.apache.org/job/ws-axiom-trunk/ws/.repository/org/apache/ws/commons/axiom/axiom-testsuite/1.2.14-SNAPSHOT>
<https://builds.apache.org/job/ws-axiom-trunk/ws/.repository/org/apache/ws/commons/axiom/axiom-c14n/1.2.14-SNAPSHOT>
<https://builds.apache.org/job/ws-axiom-trunk/ws/.repository/org/apache/ws/commons/axiom/axiom-samples/1.2.14-SNAPSHOT>
<https://builds.apache.org/job/ws-axiom-trunk/ws/.repository/org/apache/ws/commons/axiom/axiom-dom-testsuite/1.2.14-SNAPSHOT>
<https://builds.apache.org/job/ws-axiom-trunk/ws/.repository/org/apache/ws/commons/axiom/axiom-impl/1.2.14-SNAPSHOT>
<https://builds.apache.org/job/ws-axiom-trunk/ws/.repository/org/apache/ws/commons/axiom/axiom/1.2.14-SNAPSHOT>
<https://builds.apache.org/job/ws-axiom-trunk/ws/.repository/org/apache/ws/commons/axiom/axiom-compat/1.2.14-SNAPSHOT>
<https://builds.apache.org/job/ws-axiom-trunk/ws/.repository/org/apache/ws/commons/axiom/axiom-parent/1.2.14-SNAPSHOT>
<https://builds.apache.org/job/ws-axiom-trunk/ws/.repository/org/apache/ws/commons/axiom/axiom-dom/1.2.14-SNAPSHOT>
<https://builds.apache.org/job/ws-axiom-trunk/ws/.repository/org/apache/ws/commons/axiom/axiom-integration/1.2.14-SNAPSHOT>
<https://builds.apache.org/job/ws-axiom-trunk/ws/.repository/org/apache/ws/commons/axiom/axiom-testutils/1.2.14-SNAPSHOT>
<https://builds.apache.org/job/ws-axiom-trunk/ws/.repository/org/apache/ws/commons/axiom/axiom-api/1.2.14-SNAPSHOT>
<https://builds.apache.org/job/ws-axiom-trunk/ws/.repository/org/apache/ws/commons/axiom/axiom-common-impl-testsuite/1.2.14-SNAPSHOT>
<https://builds.apache.org/job/ws-axiom-trunk/ws/.repository/org/apache/ws/commons/axiom/axiom-common-impl/1.2.14-SNAPSHOT>
<https://builds.apache.org/job/ws-axiom-trunk/ws/.repository/org/apache/ws/commons/axiom/axiom-tests/1.2.14-SNAPSHOT>
Parsing POMs
Modules changed, recalculating dependency graph
[axiom] $ /home/hudson/tools/java/latest1.5/bin/java -Xmx256m -Xms128m -XX:MaxPermSize=128m
-cp /home/hudson/hudson-slave/maven3-agent.jar:/home/hudson/hudson-slave/tools/Maven/maven-3.0.4/boot/plexus-classworlds-2.4.jar
org.jvnet.hudson.maven3.agent.Maven3Main /home/hudson/hudson-slave/tools/Maven/maven-3.0.4
/home/hudson/hudson-slave/slave.jar /home/hudson/hudson-slave/maven3-interceptor.jar 60139
<===[JENKINS REMOTING CAPACITY]===>channel started
   log4j:WARN No appenders could be found for logger (org.apache.commons.beanutils.converters.BooleanConverter).
log4j:WARN Please initialize the log4j system properly.
Executing Maven:  -B -f <https://builds.apache.org/job/ws-axiom-trunk/ws/axiom/pom.xml>
-Dmaven.repo.local=<https://builds.apache.org/job/ws-axiom-trunk/ws/.repository> clean
deploy -Papache-release -Dgpg.skip=true
[INFO] Scanning for projects...
[INFO] ------------------------------------------------------------------------
[INFO] Reactor Build Order:
[INFO] 
[INFO] Axiom Parent POM
[INFO] Axiom Build Utilities
[INFO] Axiom Test Utilities
[INFO] Axiom Jaxen Test Suite
[INFO] Axiom DOM Test Suite
[INFO] Axiom API
[INFO] Axiom Implementation Test Suite
[INFO] Axiom Common Implementation Classes
[INFO] Axiom Common Implementation Test Suite
[INFO] Axiom Impl
[INFO] Axiom DOM
[INFO] Axiom Compatibility Classes
[INFO] Axiom C14N
[INFO] Axiom Test Suite
[INFO] Axiom OSGi Tests
[INFO] Axiom Integration Test Suite
[INFO] Axiom Uber-JAR
[INFO] Axiom Samples
[INFO] Axiom
Projects to build: [MavenProject: org.apache.ws.commons.axiom:axiom-parent:1.2.14-SNAPSHOT
@ <https://builds.apache.org/job/ws-axiom-trunk/ws/axiom/modules/axiom-parent/pom.xml,>
MavenProject: org.apache.ws.commons.axiom:axiom-buildutils:1.2.14-SNAPSHOT @ <https://builds.apache.org/job/ws-axiom-trunk/ws/axiom/modules/axiom-buildutils/pom.xml,>
MavenProject: org.apache.ws.commons.axiom:axiom-testutils:1.2.14-SNAPSHOT @ <https://builds.apache.org/job/ws-axiom-trunk/ws/axiom/modules/axiom-testutils/pom.xml,>
MavenProject: org.apache.ws.commons.axiom:axiom-jaxen-testsuite:1.2.14-SNAPSHOT @ <https://builds.apache.org/job/ws-axiom-trunk/ws/axiom/modules/axiom-jaxen-testsuite/pom.xml,>
MavenProject: org.apache.ws.commons.axiom:axiom-dom-testsuite:1.2.14-SNAPSHOT @ <https://builds.apache.org/job/ws-axiom-trunk/ws/axiom/modules/axiom-dom-testsuite/pom.xml,>
MavenProject: org.apache.ws.commons.axiom:axiom-api:1.2.14-SNAPSHOT @ <https://builds.apache.org/job/ws-axiom-trunk/ws/axiom/modules/axiom-api/pom.xml,>
MavenProject: org.apache.ws.commons.axiom:axiom-testsuite:1.2.14-SNAPSHOT @ <https://builds.apache.org/job/ws-axiom-trunk/ws/axiom/modules/axiom-testsuite/pom.xml,>
MavenProject: org.apache.ws.commons.axiom:axiom-common-impl:1.2.14-SNAPSHOT @ <https://builds.apache.org/job/ws-axiom-trunk/ws/axiom/modules/axiom-common-impl/pom.xml,>
MavenProject: org.apache.ws.commons.axiom:axiom-common-impl-testsuite:1.2.14-SNAPSHOT @ <https://builds.apache.org/job/ws-axiom-trunk/ws/axiom/modules/axiom-common-impl-testsuite/pom.xml,>
MavenProject: org.apache.ws.commons.axiom:axiom-impl:1.2.14-SNAPSHOT @ <https://builds.apache.org/job/ws-axiom-trunk/ws/axiom/modules/axiom-impl/pom.xml,>
MavenProject: org.apache.ws.commons.axiom:axiom-dom:1.2.14-SNAPSHOT @ <https://builds.apache.org/job/ws-axiom-trunk/ws/axiom/modules/axiom-dom/pom.xml,>
MavenProject: org.apache.ws.commons.axiom:axiom-compat:1.2.14-SNAPSHOT @ <https://builds.apache.org/job/ws-axiom-trunk/ws/axiom/modules/axiom-compat/pom.xml,>
MavenProject: org.apache.ws.commons.axiom:axiom-c14n:1.2.14-SNAPSHOT @ <https://builds.apache.org/job/ws-axiom-trunk/ws/axiom/modules/axiom-c14n/pom.xml,>
MavenProject: org.apache.ws.commons.axiom:axiom-tests:1.2.14-SNAPSHOT @ <https://builds.apache.org/job/ws-axiom-trunk/ws/axiom/modules/axiom-tests/pom.xml,>
MavenProject: org.apache.ws.commons.axiom:axiom-osgi-tests:1.2.14-SNAPSHOT @ <https://builds.apache.org/job/ws-axiom-trunk/ws/axiom/modules/axiom-osgi-tests/pom.xml,>
MavenProject: org.apache.ws.commons.axiom:axiom-integration:1.2.14-SNAPSHOT @ <https://builds.apache.org/job/ws-axiom-trunk/ws/axiom/modules/axiom-integration/pom.xml,>
MavenProject: org.apache.ws.commons.axiom:axiom-all:1.2.14-SNAPSHOT @ <https://builds.apache.org/job/ws-axiom-trunk/ws/axiom/modules/axiom-all/pom.xml,>
MavenProject: org.apache.ws.commons.axiom:axiom-samples:1.2.14-SNAPSHOT @ <https://builds.apache.org/job/ws-axiom-trunk/ws/axiom/modules/axiom-samples/pom.xml,>
MavenProject: org.apache.ws.commons.axiom:axiom:1.2.14-SNAPSHOT @ <https://builds.apache.org/job/ws-axiom-trunk/ws/axiom/pom.xml]>
projectStarted org.apache.ws.commons.axiom:axiom-parent:1.2.14-SNAPSHOT
[INFO]                                                                         
[INFO] ------------------------------------------------------------------------
[INFO] Building Axiom Parent POM 1.2.14-SNAPSHOT
[INFO] ------------------------------------------------------------------------
mojoStarted org.apache.maven.plugins:maven-clean-plugin:2.4.1(default-clean)
[INFO] 
[INFO] --- maven-clean-plugin:2.4.1:clean (default-clean) @ axiom-parent ---
[INFO] Deleting <https://builds.apache.org/job/ws-axiom-trunk/ws/axiom/modules/axiom-parent/target>
mojoSucceeded org.apache.maven.plugins:maven-clean-plugin:2.4.1(default-clean)
mojoStarted org.apache.maven.plugins:maven-remote-resources-plugin:1.1(default)
[INFO] 
[INFO] --- maven-remote-resources-plugin:1.1:process (default) @ axiom-parent ---
[INFO] Setting property: classpath.resource.loader.class => 'org.codehaus.plexus.velocity.ContextClassLoaderResourceLoader'.
[INFO] Setting property: velocimacro.messages.on => 'false'.
[INFO] Setting property: resource.loader => 'classpath'.
[INFO] Setting property: resource.manager.logwhenfound => 'false'.
mojoSucceeded org.apache.maven.plugins:maven-remote-resources-plugin:1.1(default)
mojoStarted org.apache.maven.plugins:maven-assembly-plugin:2.2(source-release-assembly)
[INFO] 
[INFO] --- maven-assembly-plugin:2.2:single (source-release-assembly) @ axiom-parent ---
[INFO] Skipping the assembly in this project because it's not the Execution Root
mojoSucceeded org.apache.maven.plugins:maven-assembly-plugin:2.2(source-release-assembly)
Jul 1, 2012 2:00:16 AM hudson.maven.ExecutedMojo <init>
WARNING: Failed to getClass for org.apache.maven.plugin.source.SourceJarMojo
mojoStarted org.apache.maven.plugins:maven-source-plugin:2.1.2(attach-sources)
[INFO] 
[INFO] --- maven-source-plugin:2.1.2:jar (attach-sources) @ axiom-parent ---
mojoSucceeded org.apache.maven.plugins:maven-source-plugin:2.1.2(attach-sources)
mojoStarted org.apache.maven.plugins:maven-javadoc-plugin:2.5(attach-javadocs)
[INFO] 
[INFO] --- maven-javadoc-plugin:2.5:jar (attach-javadocs) @ axiom-parent ---
[INFO] Not executing Javadoc as the project is not a Java classpath-capable package
mojoSucceeded org.apache.maven.plugins:maven-javadoc-plugin:2.5(attach-javadocs)
mojoStarted org.apache.maven.plugins:maven-gpg-plugin:1.1(default)
[INFO] 
[INFO] --- maven-gpg-plugin:1.1:sign (default) @ axiom-parent ---
mojoSucceeded org.apache.maven.plugins:maven-gpg-plugin:1.1(default)
mojoStarted org.apache.rat:apache-rat-plugin:0.8(default)
[INFO] 
[INFO] --- apache-rat-plugin:0.8:check (default) @ axiom-parent ---
[INFO] Exclude: src/test/resources/**
[INFO] Exclude: dependency-reduced-pom.xml
mojoSucceeded org.apache.rat:apache-rat-plugin:0.8(default)
mojoStarted org.apache.maven.plugins:maven-install-plugin:2.3.1(default-install)
[INFO] 
[INFO] --- maven-install-plugin:2.3.1:install (default-install) @ axiom-parent ---
[INFO] Installing <https://builds.apache.org/job/ws-axiom-trunk/ws/axiom/modules/axiom-parent/pom.xml>
to <https://builds.apache.org/job/ws-axiom-trunk/ws/.repository/org/apache/ws/commons/axiom/axiom-parent/1.2.14-SNAPSHOT/axiom-parent-1.2.14-SNAPSHOT.pom>
mojoSucceeded org.apache.maven.plugins:maven-install-plugin:2.3.1(default-install)
mojoStarted org.apache.maven.plugins:maven-deploy-plugin:2.5(default-deploy)
[INFO] 
[INFO] --- maven-deploy-plugin:2.5:deploy (default-deploy) @ axiom-parent ---
Downloading: https://repository.apache.org/content/repositories/snapshots/org/apache/ws/commons/axiom/axiom-parent/1.2.14-SNAPSHOT/maven-metadata.xml
[WARNING] Could not transfer metadata org.apache.ws.commons.axiom:axiom-parent:1.2.14-SNAPSHOT/maven-metadata.xml
from/to apache.snapshots.https (https://repository.apache.org/content/repositories/snapshots):
Failed to transfer file: https://repository.apache.org/content/repositories/snapshots/org/apache/ws/commons/axiom/axiom-parent/1.2.14-SNAPSHOT/maven-metadata.xml.
Return code is: 503, ReasonPhrase:Service Temporarily Unavailable.
mojoFailed org.apache.maven.plugins:maven-deploy-plugin:2.5(default-deploy)
projectFailed org.apache.ws.commons.axiom:axiom-parent:1.2.14-SNAPSHOT
sessionEnded
[INFO] ------------------------------------------------------------------------
[INFO] Reactor Summary:
[INFO] 
[INFO] Axiom Parent POM .................................. FAILURE [29.262s]
[INFO] Axiom Build Utilities ............................. SKIPPED
[INFO] Axiom Test Utilities .............................. SKIPPED
[INFO] Axiom Jaxen Test Suite ............................ SKIPPED
[INFO] Axiom DOM Test Suite .............................. SKIPPED
[INFO] Axiom API ......................................... SKIPPED
[INFO] Axiom Implementation Test Suite ................... SKIPPED
[INFO] Axiom Common Implementation Classes ............... SKIPPED
[INFO] Axiom Common Implementation Test Suite ............ SKIPPED
[INFO] Axiom Impl ........................................ SKIPPED
[INFO] Axiom DOM ......................................... SKIPPED
[INFO] Axiom Compatibility Classes ....................... SKIPPED
[INFO] Axiom C14N ........................................ SKIPPED
[INFO] Axiom Test Suite .................................. SKIPPED
[INFO] Axiom OSGi Tests .................................. SKIPPED
[INFO] Axiom Integration Test Suite ...................... SKIPPED
[INFO] Axiom Uber-JAR .................................... SKIPPED
[INFO] Axiom Samples ..................................... SKIPPED
[INFO] Axiom ............................................. SKIPPED
[INFO] ------------------------------------------------------------------------
[INFO] BUILD FAILURE
[INFO] ------------------------------------------------------------------------
[INFO] Total time: 32.136s
[INFO] Finished at: Sun Jul 01 02:00:20 UTC 2012
[INFO] Final Memory: 17M/132M
[INFO] ------------------------------------------------------------------------
Projects to build: [MavenProject: org.apache.ws.commons.axiom:axiom-parent:1.2.14-SNAPSHOT
@ <https://builds.apache.org/job/ws-axiom-trunk/ws/axiom/modules/axiom-parent/pom.xml,>
MavenProject: org.apache.ws.commons.axiom:axiom-buildutils:1.2.14-SNAPSHOT @ <https://builds.apache.org/job/ws-axiom-trunk/ws/axiom/modules/axiom-buildutils/pom.xml,>
MavenProject: org.apache.ws.commons.axiom:axiom-testutils:1.2.14-SNAPSHOT @ <https://builds.apache.org/job/ws-axiom-trunk/ws/axiom/modules/axiom-testutils/pom.xml,>
MavenProject: org.apache.ws.commons.axiom:axiom-jaxen-testsuite:1.2.14-SNAPSHOT @ <https://builds.apache.org/job/ws-axiom-trunk/ws/axiom/modules/axiom-jaxen-testsuite/pom.xml,>
MavenProject: org.apache.ws.commons.axiom:axiom-dom-testsuite:1.2.14-SNAPSHOT @ <https://builds.apache.org/job/ws-axiom-trunk/ws/axiom/modules/axiom-dom-testsuite/pom.xml,>
MavenProject: org.apache.ws.commons.axiom:axiom-api:1.2.14-SNAPSHOT @ <https://builds.apache.org/job/ws-axiom-trunk/ws/axiom/modules/axiom-api/pom.xml,>
MavenProject: org.apache.ws.commons.axiom:axiom-testsuite:1.2.14-SNAPSHOT @ <https://builds.apache.org/job/ws-axiom-trunk/ws/axiom/modules/axiom-testsuite/pom.xml,>
MavenProject: org.apache.ws.commons.axiom:axiom-common-impl:1.2.14-SNAPSHOT @ <https://builds.apache.org/job/ws-axiom-trunk/ws/axiom/modules/axiom-common-impl/pom.xml,>
MavenProject: org.apache.ws.commons.axiom:axiom-common-impl-testsuite:1.2.14-SNAPSHOT @ <https://builds.apache.org/job/ws-axiom-trunk/ws/axiom/modules/axiom-common-impl-testsuite/pom.xml,>
MavenProject: org.apache.ws.commons.axiom:axiom-impl:1.2.14-SNAPSHOT @ <https://builds.apache.org/job/ws-axiom-trunk/ws/axiom/modules/axiom-impl/pom.xml,>
MavenProject: org.apache.ws.commons.axiom:axiom-dom:1.2.14-SNAPSHOT @ <https://builds.apache.org/job/ws-axiom-trunk/ws/axiom/modules/axiom-dom/pom.xml,>
MavenProject: org.apache.ws.commons.axiom:axiom-compat:1.2.14-SNAPSHOT @ <https://builds.apache.org/job/ws-axiom-trunk/ws/axiom/modules/axiom-compat/pom.xml,>
MavenProject: org.apache.ws.commons.axiom:axiom-c14n:1.2.14-SNAPSHOT @ <https://builds.apache.org/job/ws-axiom-trunk/ws/axiom/modules/axiom-c14n/pom.xml,>
MavenProject: org.apache.ws.commons.axiom:axiom-tests:1.2.14-SNAPSHOT @ <https://builds.apache.org/job/ws-axiom-trunk/ws/axiom/modules/axiom-tests/pom.xml,>
MavenProject: org.apache.ws.commons.axiom:axiom-osgi-tests:1.2.14-SNAPSHOT @ <https://builds.apache.org/job/ws-axiom-trunk/ws/axiom/modules/axiom-osgi-tests/pom.xml,>
MavenProject: org.apache.ws.commons.axiom:axiom-integration:1.2.14-SNAPSHOT @ <https://builds.apache.org/job/ws-axiom-trunk/ws/axiom/modules/axiom-integration/pom.xml,>
MavenProject: org.apache.ws.commons.axiom:axiom-all:1.2.14-SNAPSHOT @ <https://builds.apache.org/job/ws-axiom-trunk/ws/axiom/modules/axiom-all/pom.xml,>
MavenProject: org.apache.ws.commons.axiom:axiom-samples:1.2.14-SNAPSHOT @ <https://builds.apache.org/job/ws-axiom-trunk/ws/axiom/modules/axiom-samples/pom.xml,>
MavenProject: org.apache.ws.commons.axiom:axiom:1.2.14-SNAPSHOT @ <https://builds.apache.org/job/ws-axiom-trunk/ws/axiom/pom.xml]>
[JENKINS] Archiving <https://builds.apache.org/job/ws-axiom-trunk/ws/axiom/modules/axiom-impl/pom.xml>
to /home/hudson/hudson/jobs/ws-axiom-trunk/modules/org.apache.ws.commons.axiom$axiom-impl/builds/2012-07-01_01-59-34/archive/org.apache.ws.commons.axiom/axiom-impl/1.2.14-SNAPSHOT/axiom-impl-1.2.14-SNAPSHOT.pom
[JENKINS] Archiving <https://builds.apache.org/job/ws-axiom-trunk/ws/axiom/modules/axiom-common-impl/pom.xml>
to /home/hudson/hudson/jobs/ws-axiom-trunk/modules/org.apache.ws.commons.axiom$axiom-common-impl/builds/2012-07-01_01-59-34/archive/org.apache.ws.commons.axiom/axiom-common-impl/1.2.14-SNAPSHOT/axiom-common-impl-1.2.14-SNAPSHOT.pom
[JENKINS] Archiving <https://builds.apache.org/job/ws-axiom-trunk/ws/axiom/modules/axiom-buildutils/pom.xml>
to /home/hudson/hudson/jobs/ws-axiom-trunk/modules/org.apache.ws.commons.axiom$axiom-buildutils/builds/2012-07-01_01-59-33/archive/org.apache.ws.commons.axiom/axiom-buildutils/1.2.14-SNAPSHOT/axiom-buildutils-1.2.14-SNAPSHOT.pom
[JENKINS] Archiving <https://builds.apache.org/job/ws-axiom-trunk/ws/axiom/modules/axiom-tests/pom.xml>
to /home/hudson/hudson/jobs/ws-axiom-trunk/modules/org.apache.ws.commons.axiom$axiom-tests/builds/2012-07-01_01-59-35/archive/org.apache.ws.commons.axiom/axiom-tests/1.2.14-SNAPSHOT/axiom-tests-1.2.14-SNAPSHOT.pom
[JENKINS] Archiving <https://builds.apache.org/job/ws-axiom-trunk/ws/axiom/modules/axiom-jaxen-testsuite/pom.xml>
to /home/hudson/hudson/jobs/ws-axiom-trunk/modules/org.apache.ws.commons.axiom$axiom-jaxen-testsuite/builds/2012-07-01_01-59-34/archive/org.apache.ws.commons.axiom/axiom-jaxen-testsuite/1.2.14-SNAPSHOT/axiom-jaxen-testsuite-1.2.14-SNAPSHOT.pom
[JENKINS] Archiving <https://builds.apache.org/job/ws-axiom-trunk/ws/axiom/modules/axiom-testutils/pom.xml>
to /home/hudson/hudson/jobs/ws-axiom-trunk/modules/org.apache.ws.commons.axiom$axiom-testutils/builds/2012-07-01_01-59-33/archive/org.apache.ws.commons.axiom/axiom-testutils/1.2.14-SNAPSHOT/axiom-testutils-1.2.14-SNAPSHOT.pom
[JENKINS] Archiving <https://builds.apache.org/job/ws-axiom-trunk/ws/axiom/modules/axiom-api/pom.xml>
to /home/hudson/hudson/jobs/ws-axiom-trunk/modules/org.apache.ws.commons.axiom$axiom-api/builds/2012-07-01_01-59-34/archive/org.apache.ws.commons.axiom/axiom-api/1.2.14-SNAPSHOT/axiom-api-1.2.14-SNAPSHOT.pom
[JENKINS] Archiving <https://builds.apache.org/job/ws-axiom-trunk/ws/axiom/modules/axiom-samples/pom.xml>
to /home/hudson/hudson/jobs/ws-axiom-trunk/modules/org.apache.ws.commons.axiom$axiom-samples/builds/2012-07-01_01-59-35/archive/org.apache.ws.commons.axiom/axiom-samples/1.2.14-SNAPSHOT/axiom-samples-1.2.14-SNAPSHOT.pom
[JENKINS] Archiving <https://builds.apache.org/job/ws-axiom-trunk/ws/axiom/modules/axiom-all/pom.xml>
to /home/hudson/hudson/jobs/ws-axiom-trunk/modules/org.apache.ws.commons.axiom$axiom-all/builds/2012-07-01_01-59-35/archive/org.apache.ws.commons.axiom/axiom-all/1.2.14-SNAPSHOT/axiom-all-1.2.14-SNAPSHOT.pom
[JENKINS] Archiving <https://builds.apache.org/job/ws-axiom-trunk/ws/axiom/modules/axiom-dom/pom.xml>
to /home/hudson/hudson/jobs/ws-axiom-trunk/modules/org.apache.ws.commons.axiom$axiom-dom/builds/2012-07-01_01-59-34/archive/org.apache.ws.commons.axiom/axiom-dom/1.2.14-SNAPSHOT/axiom-dom-1.2.14-SNAPSHOT.pom
[JENKINS] Archiving <https://builds.apache.org/job/ws-axiom-trunk/ws/axiom/modules/axiom-dom-testsuite/pom.xml>
to /home/hudson/hudson/jobs/ws-axiom-trunk/modules/org.apache.ws.commons.axiom$axiom-dom-testsuite/builds/2012-07-01_01-59-34/archive/org.apache.ws.commons.axiom/axiom-dom-testsuite/1.2.14-SNAPSHOT/axiom-dom-testsuite-1.2.14-SNAPSHOT.pom
[JENKINS] Archiving <https://builds.apache.org/job/ws-axiom-trunk/ws/axiom/modules/axiom-testsuite/pom.xml>
to /home/hudson/hudson/jobs/ws-axiom-trunk/modules/org.apache.ws.commons.axiom$axiom-testsuite/builds/2012-07-01_01-59-34/archive/org.apache.ws.commons.axiom/axiom-testsuite/1.2.14-SNAPSHOT/axiom-testsuite-1.2.14-SNAPSHOT.pom
[JENKINS] Archiving <https://builds.apache.org/job/ws-axiom-trunk/ws/axiom/modules/axiom-c14n/pom.xml>
to /home/hudson/hudson/jobs/ws-axiom-trunk/modules/org.apache.ws.commons.axiom$axiom-c14n/builds/2012-07-01_01-59-34/archive/org.apache.ws.commons.axiom/axiom-c14n/1.2.14-SNAPSHOT/axiom-c14n-1.2.14-SNAPSHOT.pom
[JENKINS] Archiving <https://builds.apache.org/job/ws-axiom-trunk/ws/axiom/pom.xml>
to /home/hudson/hudson/jobs/ws-axiom-trunk/modules/org.apache.ws.commons.axiom$axiom/builds/2012-07-01_01-59-33/archive/org.apache.ws.commons.axiom/axiom/1.2.14-SNAPSHOT/axiom-1.2.14-SNAPSHOT.pom
[JENKINS] Archiving <https://builds.apache.org/job/ws-axiom-trunk/ws/axiom/modules/axiom-parent/pom.xml>
to /home/hudson/hudson/jobs/ws-axiom-trunk/modules/org.apache.ws.commons.axiom$axiom-parent/builds/2012-07-01_01-59-33/archive/org.apache.ws.commons.axiom/axiom-parent/1.2.14-SNAPSHOT/axiom-parent-1.2.14-SNAPSHOT.pom
[JENKINS] Archiving <https://builds.apache.org/job/ws-axiom-trunk/ws/axiom/modules/axiom-common-impl-testsuite/pom.xml>
to /home/hudson/hudson/jobs/ws-axiom-trunk/modules/org.apache.ws.commons.axiom$axiom-common-impl-testsuite/builds/2012-07-01_01-59-34/archive/org.apache.ws.commons.axiom/axiom-common-impl-testsuite/1.2.14-SNAPSHOT/axiom-common-impl-testsuite-1.2.14-SNAPSHOT.pom
[JENKINS] Archiving <https://builds.apache.org/job/ws-axiom-trunk/ws/axiom/modules/axiom-compat/pom.xml>
to /home/hudson/hudson/jobs/ws-axiom-trunk/modules/org.apache.ws.commons.axiom$axiom-compat/builds/2012-07-01_01-59-34/archive/org.apache.ws.commons.axiom/axiom-compat/1.2.14-SNAPSHOT/axiom-compat-1.2.14-SNAPSHOT.pom
[JENKINS] Archiving <https://builds.apache.org/job/ws-axiom-trunk/ws/axiom/modules/axiom-osgi-tests/pom.xml>
to /home/hudson/hudson/jobs/ws-axiom-trunk/modules/org.apache.ws.commons.axiom$axiom-osgi-tests/builds/2012-07-01_01-59-35/archive/org.apache.ws.commons.axiom/axiom-osgi-tests/1.2.14-SNAPSHOT/axiom-osgi-tests-1.2.14-SNAPSHOT.pom
[JENKINS] Archiving <https://builds.apache.org/job/ws-axiom-trunk/ws/axiom/modules/axiom-integration/pom.xml>
to /home/hudson/hudson/jobs/ws-axiom-trunk/modules/org.apache.ws.commons.axiom$axiom-integration/builds/2012-07-01_01-59-35/archive/org.apache.ws.commons.axiom/axiom-integration/1.2.14-SNAPSHOT/axiom-integration-1.2.14-SNAPSHOT.pom
Waiting for Jenkins to finish collecting data
mavenExecutionResult exceptions not empty
message : Failed to execute goal org.apache.maven.plugins:maven-deploy-plugin:2.5:deploy (default-deploy)
on project axiom-parent: Failed to retrieve remote metadata org.apache.ws.commons.axiom:axiom-parent:1.2.14-SNAPSHOT/maven-metadata.xml:
Could not transfer metadata org.apache.ws.commons.axiom:axiom-parent:1.2.14-SNAPSHOT/maven-metadata.xml
from/to apache.snapshots.https (https://repository.apache.org/content/repositories/snapshots):
Failed to transfer file: https://repository.apache.org/content/repositories/snapshots/org/apache/ws/commons/axiom/axiom-parent/1.2.14-SNAPSHOT/maven-metadata.xml.
Return code is: 503, ReasonPhrase:Service Temporarily Unavailable.
cause : Failed to retrieve remote metadata org.apache.ws.commons.axiom:axiom-parent:1.2.14-SNAPSHOT/maven-metadata.xml:
Could not transfer metadata org.apache.ws.commons.axiom:axiom-parent:1.2.14-SNAPSHOT/maven-metadata.xml
from/to apache.snapshots.https (https://repository.apache.org/content/repositories/snapshots):
Failed to transfer file: https://repository.apache.org/content/repositories/snapshots/org/apache/ws/commons/axiom/axiom-parent/1.2.14-SNAPSHOT/maven-metadata.xml.
Return code is: 503, ReasonPhrase:Service Temporarily Unavailable.
Stack trace : 
org.apache.maven.lifecycle.LifecycleExecutionException: Failed to execute goal org.apache.maven.plugins:maven-deploy-plugin:2.5:deploy
(default-deploy) on project axiom-parent: Failed to retrieve remote metadata org.apache.ws.commons.axiom:axiom-parent:1.2.14-SNAPSHOT/maven-metadata.xml:
Could not transfer metadata org.apache.ws.commons.axiom:axiom-parent:1.2.14-SNAPSHOT/maven-metadata.xml
from/to apache.snapshots.https (https://repository.apache.org/content/repositories/snapshots):
Failed to transfer file: https://repository.apache.org/content/repositories/snapshots/org/apache/ws/commons/axiom/axiom-parent/1.2.14-SNAPSHOT/maven-metadata.xml.
Return code is: 503, ReasonPhrase:Service Temporarily Unavailable.
	at org.apache.maven.lifecycle.internal.MojoExecutor.execute(MojoExecutor.java:217)
	at org.apache.maven.lifecycle.internal.MojoExecutor.execute(MojoExecutor.java:153)
	at org.apache.maven.lifecycle.internal.MojoExecutor.execute(MojoExecutor.java:145)
	at org.apache.maven.lifecycle.internal.LifecycleModuleBuilder.buildProject(LifecycleModuleBuilder.java:84)
	at org.apache.maven.lifecycle.internal.LifecycleModuleBuilder.buildProject(LifecycleModuleBuilder.java:59)
	at org.apache.maven.lifecycle.internal.LifecycleStarter.singleThreadedBuild(LifecycleStarter.java:183)
	at org.apache.maven.lifecycle.internal.LifecycleStarter.execute(LifecycleStarter.java:161)
	at org.apache.maven.DefaultMaven.doExecute(DefaultMaven.java:320)
	at org.apache.maven.DefaultMaven.execute(DefaultMaven.java:156)
	at org.jvnet.hudson.maven3.launcher.Maven3Launcher.main(Maven3Launcher.java:79)
	at sun.reflect.NativeMethodAccessorImpl.invoke0(Native Method)
	at sun.reflect.NativeMethodAccessorImpl.invoke(NativeMethodAccessorImpl.java:39)
	at sun.reflect.DelegatingMethodAccessorImpl.invoke(DelegatingMethodAccessorImpl.java:25)
	at java.lang.reflect.Method.invoke(Method.java:592)
	at org.codehaus.plexus.classworlds.launcher.Launcher.launchStandard(Launcher.java:329)
	at org.codehaus.plexus.classworlds.launcher.Launcher.launch(Launcher.java:239)
	at org.jvnet.hudson.maven3.agent.Maven3Main.launch(Maven3Main.java:158)
	at hudson.maven.Maven3Builder.call(Maven3Builder.java:98)
	at hudson.maven.Maven3Builder.call(Maven3Builder.java:64)
	at hudson.remoting.UserRequest.perform(UserRequest.java:118)
	at hudson.remoting.UserRequest.perform(UserRequest.java:48)
	at hudson.remoting.Request$2.run(Request.java:287)
	at hudson.remoting.InterceptingExecutorService$1.call(InterceptingExecutorService.java:72)
	at java.util.concurrent.FutureTask$Sync.innerRun(FutureTask.java:269)
	at java.util.concurrent.FutureTask.run(FutureTask.java:123)
	at java.util.concurrent.ThreadPoolExecutor$Worker.runTask(ThreadPoolExecutor.java:651)
	at java.util.concurrent.ThreadPoolExecutor$Worker.run(ThreadPoolExecutor.java:676)
	at java.lang.Thread.run(Thread.java:595)
Caused by: org.apache.maven.plugin.MojoExecutionException: Failed to retrieve remote metadata
org.apache.ws.commons.axiom:axiom-parent:1.2.14-SNAPSHOT/maven-metadata.xml: Could not transfer
metadata org.apache.ws.commons.axiom:axiom-parent:1.2.14-SNAPSHOT/maven-metadata.xml from/to
apache.snapshots.https (https://repository.apache.org/content/repositories/snapshots): Failed
to transfer file: https://repository.apache.org/content/repositories/snapshots/org/apache/ws/commons/axiom/axiom-parent/1.2.14-SNAPSHOT/maven-metadata.xml.
Return code is: 503, ReasonPhrase:Service Temporarily Unavailable.
	at org.apache.maven.plugin.deploy.DeployMojo.execute(DeployMojo.java:189)
	at org.apache.maven.plugin.DefaultBuildPluginManager.executeMojo(DefaultBuildPluginManager.java:101)
	at org.apache.maven.lifecycle.internal.MojoExecutor.execute(MojoExecutor.java:209)
	... 27 more
Caused by: org.apache.maven.artifact.deployer.ArtifactDeploymentException: Failed to retrieve
remote metadata org.apache.ws.commons.axiom:axiom-parent:1.2.14-SNAPSHOT/maven-metadata.xml:
Could not transfer metadata org.apache.ws.commons.axiom:axiom-parent:1.2.14-SNAPSHOT/maven-metadata.xml
from/to apache.snapshots.https (https://repository.apache.org/content/repositories/snapshots):
Failed to transfer file: https://repository.apache.org/content/repositories/snapshots/org/apache/ws/commons/axiom/axiom-parent/1.2.14-SNAPSHOT/maven-metadata.xml.
Return code is: 503, ReasonPhrase:Service Temporarily Unavailable.
	at org.apache.maven.artifact.deployer.DefaultArtifactDeployer.deploy(DefaultArtifactDeployer.java:141)
	at org.apache.maven.plugin.deploy.DeployMojo.execute(DeployMojo.java:148)
	... 29 more
Caused by: org.sonatype.aether.deployment.DeploymentException: Failed to retrieve remote metadata
org.apache.ws.commons.axiom:axiom-parent:1.2.14-SNAPSHOT/maven-metadata.xml: Could not transfer
metadata org.apache.ws.commons.axiom:axiom-parent:1.2.14-SNAPSHOT/maven-metadata.xml from/to
apache.snapshots.https (https://repository.apache.org/content/repositories/snapshots): Failed
to transfer file: https://repository.apache.org/content/repositories/snapshots/org/apache/ws/commons/axiom/axiom-parent/1.2.14-SNAPSHOT/maven-metadata.xml.
Return code is: 503, ReasonPhrase:Service Temporarily Unavailable.
	at org.sonatype.aether.impl.internal.DefaultDeployer.upload(DefaultDeployer.java:403)
	at org.sonatype.aether.impl.internal.DefaultDeployer.deploy(DefaultDeployer.java:256)
	at org.sonatype.aether.impl.internal.DefaultDeployer.deploy(DefaultDeployer.java:211)
	at org.sonatype.aether.impl.internal.DefaultRepositorySystem.deploy(DefaultRepositorySystem.java:443)
	at org.apache.maven.artifact.deployer.DefaultArtifactDeployer.deploy(DefaultArtifactDeployer.java:137)
	... 30 more
Caused by: org.sonatype.aether.transfer.MetadataTransferException: Could not transfer metadata
org.apache.ws.commons.axiom:axiom-parent:1.2.14-SNAPSHOT/maven-metadata.xml from/to apache.snapshots.https
(https://repository.apache.org/content/repositories/snapshots): Failed to transfer file: https://repository.apache.org/content/repositories/snapshots/org/apache/ws/commons/axiom/axiom-parent/1.2.14-SNAPSHOT/maven-metadata.xml.
Return code is: 503, ReasonPhrase:Service Temporarily Unavailable.
	at org.sonatype.aether.connector.wagon.WagonRepositoryConnector$3.wrap(WagonRepositoryConnector.java:930)
	at org.sonatype.aether.connector.wagon.WagonRepositoryConnector$3.wrap(WagonRepositoryConnector.java:920)
	at org.sonatype.aether.connector.wagon.WagonRepositoryConnector$GetTask.run(WagonRepositoryConnector.java:669)
	at org.sonatype.aether.util.concurrency.RunnableErrorForwarder$1.run(RunnableErrorForwarder.java:60)
	... 3 more
Caused by: org.apache.maven.wagon.TransferFailedException: Failed to transfer file: https://repository.apache.org/content/repositories/snapshots/org/apache/ws/commons/axiom/axiom-parent/1.2.14-SNAPSHOT/maven-metadata.xml.
Return code is: 503, ReasonPhrase:Service Temporarily Unavailable.
	at org.apache.maven.wagon.shared.http4.AbstractHttpClientWagon.fillInputData(AbstractHttpClientWagon.java:852)
	at org.apache.maven.wagon.StreamWagon.getInputStream(StreamWagon.java:116)
	at org.apache.maven.wagon.StreamWagon.getIfNewer(StreamWagon.java:88)
	at org.apache.maven.wagon.StreamWagon.get(StreamWagon.java:61)
	at org.sonatype.aether.connector.wagon.WagonRepositoryConnector$GetTask.run(WagonRepositoryConnector.java:601)
	... 4 more
Sending e-mails to: dev@ws.apache.org
channel stopped

---------------------------------------------------------------------
To unsubscribe, e-mail: dev-unsubscribe@ws.apache.org
For additional commands, e-mail: dev-help@ws.apache.org


Mime
View raw message