ws-dev mailing list archives

Site index · List index
Message view « Date » · « Thread »
Top « Date » · « Thread »
From Apache Jenkins Server <jenk...@builds.apache.org>
Subject Build failed in Jenkins: wss4j-trunk #341
Date Fri, 17 Aug 2012 12:13:23 GMT
See <https://builds.apache.org/job/wss4j-trunk/341/changes>

Changes:

[coheigea] More empty dirs

[coheigea] More empty dirs

[coheigea] Removing empty dirs

[coheigea] Undoing accidental delete

[coheigea] More empty dirs

[coheigea] Removing empty dirs

[coheigea] Moving Crypto + exception stuff to a common module

------------------------------------------
[...truncated 1697 lines...]
Tests run: 2, Failures: 0, Errors: 0, Skipped: 0, Time elapsed: 0 sec
Running org.apache.ws.security.components.crypto.SKITest
Tests run: 2, Failures: 0, Errors: 0, Skipped: 0, Time elapsed: 0.025 sec
Running org.apache.ws.security.components.crypto.CryptoTest
Tests run: 5, Failures: 0, Errors: 0, Skipped: 0, Time elapsed: 0 sec
Running org.apache.ws.security.components.crypto.CertificateStoreTest
Tests run: 6, Failures: 0, Errors: 0, Skipped: 0, Time elapsed: 0 sec
Running org.apache.ws.security.components.crypto.CryptoProviderTest
Tests run: 3, Failures: 0, Errors: 0, Skipped: 0, Time elapsed: 0 sec
Running org.apache.ws.security.handler.CustomActionProcessorTest
Tests run: 5, Failures: 0, Errors: 0, Skipped: 0, Time elapsed: 0.039 sec
Running org.apache.ws.security.handler.ResultsOrderTest
Tests run: 9, Failures: 0, Errors: 0, Skipped: 0, Time elapsed: 0.002 sec
Running org.apache.ws.security.handler.SignatureUTAliasTest
Tests run: 1, Failures: 0, Errors: 0, Skipped: 0, Time elapsed: 0.012 sec
Running org.apache.ws.security.handler.CallbackRefTest
Tests run: 2, Failures: 0, Errors: 0, Skipped: 0, Time elapsed: 0.002 sec
Running org.apache.ws.security.handler.WSHandlerGetPasswordTest
Tests run: 3, Failures: 0, Errors: 0, Skipped: 0, Time elapsed: 0.002 sec
Running org.apache.ws.security.handler.SignatureConfirmationTest
Tests run: 5, Failures: 0, Errors: 0, Skipped: 0, Time elapsed: 0.099 sec
Running org.apache.ws.security.processor.EncryptedKeyDataRefTest
Tests run: 1, Failures: 0, Errors: 0, Skipped: 0, Time elapsed: 0.01 sec
Running org.apache.ws.security.processor.ReferenceListDataRefTest
Tests run: 1, Failures: 0, Errors: 0, Skipped: 0, Time elapsed: 0.01 sec

Results :

Tests run: 351, Failures: 0, Errors: 0, Skipped: 9

mojoSucceeded org.apache.maven.plugins:maven-surefire-plugin:2.12(default-test)
[JENKINS] Recording test results
mojoStarted org.apache.felix:maven-bundle-plugin:2.3.4(default-bundle)
[INFO] 
[INFO] --- maven-bundle-plugin:2.3.4:bundle (default-bundle) @ wss4j-dom ---
mojoSucceeded org.apache.felix:maven-bundle-plugin:2.3.4(default-bundle)
mojoStarted org.apache.maven.plugins:maven-install-plugin:2.3.1(default-install)
[INFO] 
[INFO] --- maven-install-plugin:2.3.1:install (default-install) @ wss4j-dom ---
mojoSucceeded org.apache.maven.plugins:maven-install-plugin:2.3.1(default-install)
mojoStarted org.apache.felix:maven-bundle-plugin:2.3.4(default-install)
[INFO] 
[INFO] --- maven-bundle-plugin:2.3.4:install (default-install) @ wss4j-dom ---
[WARNING] Warning building bundle org.apache.ws.security:wss4j-dom:bundle:2.0-SNAPSHOT : Did
not find matching referal for !org.apache.ws.security.*
[WARNING] Warning building bundle org.apache.ws.security:wss4j-dom:bundle:2.0-SNAPSHOT : Did
not find matching referal for org.bouncycastle.*
[INFO] Installing <https://builds.apache.org/job/wss4j-trunk/ws/wss4j/wss4j-dom/target/wss4j-dom-2.0-SNAPSHOT.jar>
to /home/hudson/hudson-slave/maven-repositories/0/org/apache/ws/security/wss4j-dom/2.0-SNAPSHOT/wss4j-dom-2.0-SNAPSHOT.jar
[INFO] Installing <https://builds.apache.org/job/wss4j-trunk/ws/wss4j/wss4j-dom/pom.xml>
to /home/hudson/hudson-slave/maven-repositories/0/org/apache/ws/security/wss4j-dom/2.0-SNAPSHOT/wss4j-dom-2.0-SNAPSHOT.pom
[INFO] Installing org/apache/ws/security/wss4j-dom/2.0-SNAPSHOT/wss4j-dom-2.0-SNAPSHOT.jar
[INFO] Writing OBR metadata
mojoSucceeded org.apache.felix:maven-bundle-plugin:2.3.4(default-install)
[debug] execute contextualize
mojoStarted org.apache.maven.plugins:maven-resources-plugin:2.5(default-resources)[INFO] Using
'UTF-8' encoding to copy filtered resources.

[INFO] 
[INFO] --- maven-resources-plugin:2.5:resources (default-resources) @ wss4j-dom ---
mojoSucceeded org.apache.maven.plugins:maven-resources-plugin:2.5(default-resources)
[INFO] Copying 0 resource
[INFO] Copying 5 resources
mojoStarted org.apache.maven.plugins:maven-compiler-plugin:2.5.1(default-compile)
[INFO] 
[INFO] --- maven-compiler-plugin:2.5.1:compile (default-compile) @ wss4j-dom ---
mojoSucceeded org.apache.maven.plugins:maven-compiler-plugin:2.5.1(default-compile)
[INFO] Nothing to compile - all classes are up to date
mojoStarted org.apache.maven.plugins:maven-resources-plugin:2.5(default-testResources)[debug]
execute contextualize
[INFO] Using 'UTF-8' encoding to copy filtered resources.
[INFO] Copying 0 resource
[INFO] Copying 68 resources

[INFO] 
[INFO] --- maven-resources-plugin:2.5:testResources (default-testResources) @ wss4j-dom ---
mojoSucceeded org.apache.maven.plugins:maven-resources-plugin:2.5(default-testResources)
mojoStarted org.apache.maven.plugins:maven-compiler-plugin:2.5.1(default-testCompile)
[INFO] 
[INFO] --- maven-compiler-plugin:2.5.1:testCompile (default-testCompile) @ wss4j-dom ---
mojoSucceeded org.apache.maven.plugins:maven-compiler-plugin:2.5.1(default-testCompile)
mojoStarted org.apache.maven.plugins:maven-surefire-plugin:2.12(default-test)[INFO] Nothing
to compile - all classes are up to date
[INFO] Skipping execution of surefire because it has already been run for this configuration

[INFO] 
[INFO] --- maven-surefire-plugin:2.12:test (default-test) @ wss4j-dom ---
mojoSucceeded org.apache.maven.plugins:maven-surefire-plugin:2.12(default-test)
[JENKINS] Recording test results
mojoStarted org.apache.felix:maven-bundle-plugin:2.3.4(default-bundle)
[INFO] 
[INFO] --- maven-bundle-plugin:2.3.4:bundle (default-bundle) @ wss4j-dom ---
[WARNING] Warning building bundle org.apache.ws.security:wss4j-dom:bundle:2.0-SNAPSHOT : Did
not find matching referal for !org.apache.ws.security.*
[WARNING] Warning building bundle org.apache.ws.security:wss4j-dom:bundle:2.0-SNAPSHOT : Did
not find matching referal for org.bouncycastle.*
mojoSucceeded org.apache.felix:maven-bundle-plugin:2.3.4(default-bundle)
mojoStarted org.apache.maven.plugins:maven-install-plugin:2.3.1(default-install)
[INFO] [INFO] Installing <https://builds.apache.org/job/wss4j-trunk/ws/wss4j/wss4j-dom/target/wss4j-dom-2.0-SNAPSHOT.jar>
to /home/hudson/hudson-slave/maven-repositories/0/org/apache/ws/security/wss4j-dom/2.0-SNAPSHOT/wss4j-dom-2.0-SNAPSHOT.jar
[INFO] Installing <https://builds.apache.org/job/wss4j-trunk/ws/wss4j/wss4j-dom/pom.xml>
to /home/hudson/hudson-slave/maven-repositories/0/org/apache/ws/security/wss4j-dom/2.0-SNAPSHOT/wss4j-dom-2.0-SNAPSHOT.pom

[INFO] --- maven-install-plugin:2.3.1:install (default-install) @ wss4j-dom ---
mojoSucceeded org.apache.maven.plugins:maven-install-plugin:2.3.1(default-install)
mojoStarted org.apache.felix:maven-bundle-plugin:2.3.4(default-install)
[INFO] 
[INFO] --- maven-bundle-plugin:2.3.4:install (default-install) @ wss4j-dom ---
[INFO] Installing org/apache/ws/security/wss4j-dom/2.0-SNAPSHOT/wss4j-dom-2.0-SNAPSHOT.jar
[INFO] Writing OBR metadata
mojoSucceeded org.apache.felix:maven-bundle-plugin:2.3.4(default-install)
mojoStarted org.apache.maven.plugins:maven-deploy-plugin:2.7(default-deploy)Downloading: https://repository.apache.org/content/repositories/snapshots/org/apache/ws/security/wss4j-dom/2.0-SNAPSHOT/maven-metadata.xml

[INFO] 
[INFO] --- maven-deploy-plugin:2.7:deploy (default-deploy) @ wss4j-dom ---
Downloaded: https://repository.apache.org/content/repositories/snapshots/org/apache/ws/security/wss4j-dom/2.0-SNAPSHOT/maven-metadata.xml
(775 B at 2.4 KB/sec)
Uploading: https://repository.apache.org/content/repositories/snapshots/org/apache/ws/security/wss4j-dom/2.0-SNAPSHOT/wss4j-dom-2.0-20120817.121108-7.jar
Uploaded: https://repository.apache.org/content/repositories/snapshots/org/apache/ws/security/wss4j-dom/2.0-SNAPSHOT/wss4j-dom-2.0-20120817.121108-7.jar
(421 KB at 598.3 KB/sec)
Uploading: https://repository.apache.org/content/repositories/snapshots/org/apache/ws/security/wss4j-dom/2.0-SNAPSHOT/wss4j-dom-2.0-20120817.121108-7.pom
Uploaded: https://repository.apache.org/content/repositories/snapshots/org/apache/ws/security/wss4j-dom/2.0-SNAPSHOT/wss4j-dom-2.0-20120817.121108-7.pom
(11 KB at 41.0 KB/sec)
Downloading: https://repository.apache.org/content/repositories/snapshots/org/apache/ws/security/wss4j-dom/maven-metadata.xml
Downloaded: https://repository.apache.org/content/repositories/snapshots/org/apache/ws/security/wss4j-dom/maven-metadata.xml
(289 B at 1.1 KB/sec)
Uploading: https://repository.apache.org/content/repositories/snapshots/org/apache/ws/security/wss4j-dom/2.0-SNAPSHOT/maven-metadata.xml
Uploaded: https://repository.apache.org/content/repositories/snapshots/org/apache/ws/security/wss4j-dom/2.0-SNAPSHOT/maven-metadata.xml
(775 B at 3.5 KB/sec)
Uploading: https://repository.apache.org/content/repositories/snapshots/org/apache/ws/security/wss4j-dom/maven-metadata.xml
Uploaded: https://repository.apache.org/content/repositories/snapshots/org/apache/ws/security/wss4j-dom/maven-metadata.xml
(289 B at 1.4 KB/sec)
mojoSucceeded org.apache.maven.plugins:maven-deploy-plugin:2.7(default-deploy)
mojoStarted org.apache.felix:maven-bundle-plugin:2.3.4(default-deploy)[INFO] Remote OBR update
disabled (enable with -DremoteOBR)

[INFO] 
[INFO] --- maven-bundle-plugin:2.3.4:deploy (default-deploy) @ wss4j-dom ---
mojoSucceeded org.apache.felix:maven-bundle-plugin:2.3.4(default-deploy)
projectSucceeded org.apache.ws.security:wss4j-dom:2.0-SNAPSHOT
projectStarted org.apache.ws.security:wss4j-streaming-ws-security:2.0-SNAPSHOT
[INFO]                                                                         
[INFO] ------------------------------------------------------------------------
[INFO] Building Apache WSS4J Streaming WS-Security 2.0-SNAPSHOT
[INFO] ------------------------------------------------------------------------
Downloading: http://repository.apache.org/snapshots/org/apache/ws/security/wss4j-ws-security-common/2.0-SNAPSHOT/maven-metadata.xml
Downloading: http://repository.apache.org/snapshots/org/apache/ws/security/wss4j-ws-security-common/2.0-SNAPSHOT/wss4j-ws-security-common-2.0-SNAPSHOT.pom
projectFailed org.apache.ws.security:wss4j-streaming-ws-security:2.0-SNAPSHOT[WARNING] The
POM for org.apache.ws.security:wss4j-ws-security-common:jar:2.0-SNAPSHOT is missing, no dependency
information available
Downloading: http://repo1.maven.org/maven2/jcs/jcs/1.3/jcs-1.3.pom

Downloaded: http://repo1.maven.org/maven2/jcs/jcs/1.3/jcs-1.3.pom (8 KB at 105.5 KB/sec)
Downloading: http://repo1.maven.org/maven2/concurrent/concurrent/1.0/concurrent-1.0.pom
Downloaded: http://repo1.maven.org/maven2/concurrent/concurrent/1.0/concurrent-1.0.pom (152
B at 1.7 KB/sec)
Downloading: http://repo1.maven.org/maven2/org/testng/testng/6.5.2/testng-6.5.2.pom
Downloaded: http://repo1.maven.org/maven2/org/testng/testng/6.5.2/testng-6.5.2.pom (8 KB at
78.1 KB/sec)
Downloading: http://repository.apache.org/snapshots/org/apache/ws/security/wss4j-ws-security-common/2.0-SNAPSHOT/wss4j-ws-security-common-2.0-SNAPSHOT.jar
Downloading: http://repo1.maven.org/maven2/jcs/jcs/1.3/jcs-1.3.jar
Downloading: http://repo1.maven.org/maven2/concurrent/concurrent/1.0/concurrent-1.0.jar
Downloading: http://repo1.maven.org/maven2/org/owasp/esapi/esapi/2.0GA/esapi-2.0GA.jar
Downloading: http://repo1.maven.org/maven2/org/testng/testng/6.5.2/testng-6.5.2.jar
Downloaded: http://repo1.maven.org/maven2/jcs/jcs/1.3/jcs-1.3.jar (426 KB at 4382.9 KB/sec)
Downloaded: http://repo1.maven.org/maven2/org/owasp/esapi/esapi/2.0GA/esapi-2.0GA.jar (359
KB at 2716.6 KB/sec)
Downloaded: http://repo1.maven.org/maven2/org/testng/testng/6.5.2/testng-6.5.2.jar (701 KB
at 4731.6 KB/sec)
Downloaded: http://repo1.maven.org/maven2/concurrent/concurrent/1.0/concurrent-1.0.jar (248
KB at 1217.0 KB/sec)
sessionEnded
[INFO] ------------------------------------------------------------------------
[INFO] Reactor Summary:
[INFO] 
[INFO] Apache WSS4J ...................................... SUCCESS [18.547s]
[INFO] Apache WSS4J parent ............................... SUCCESS [2.472s]
[INFO] Apache WSS4J WSU 1.0 Binding ...................... SUCCESS [9.753s]
[INFO] Apache WSS4J WS-Security 1.0 Binding .............. SUCCESS [6.960s]
[INFO] Apache WSS4J WS-Security 1.1 Binding .............. SUCCESS [7.786s]
[INFO] Apache WSS4J WS-SecureConversation binding ........ SUCCESS [6.559s]
[INFO] Apache WSS4J Bindings ............................. SUCCESS [1.763s]
[INFO] Apache WSS4J WS-SecurityPolicy model .............. SUCCESS [18.091s]
[INFO] Apache WSS4J DOM WS-Security ...................... SUCCESS [29.120s]
[INFO] Apache WSS4J Streaming WS-Security ................ FAILURE [1.969s]
[INFO] Apache WSS4J Streaming WS-SecurityPolicy .......... SKIPPED
[INFO] Streaming WS Security CXF Integration ............. SKIPPED
[INFO] ------------------------------------------------------------------------
[INFO] BUILD FAILURE
[INFO] ------------------------------------------------------------------------
[INFO] Total time: 1:47.570s
[INFO] Finished at: Fri Aug 17 12:11:14 UTC 2012
[INFO] Final Memory: 24M/128M
[INFO] ------------------------------------------------------------------------
Projects to build: [MavenProject: org.apache.ws.security:wss4j:2.0-SNAPSHOT @ <https://builds.apache.org/job/wss4j-trunk/ws/wss4j/pom.xml,>
MavenProject: org.apache.ws.security:wss4j-parent:2.0-SNAPSHOT @ <https://builds.apache.org/job/wss4j-trunk/ws/wss4j/parent/pom.xml,>
MavenProject: org.apache.ws.security:wss4j-bindings-wsu10:2.0-SNAPSHOT @ <https://builds.apache.org/job/wss4j-trunk/ws/wss4j/bindings/wsu10-binding/pom.xml,>
MavenProject: org.apache.ws.security:wss4j-bindings-wss10:2.0-SNAPSHOT @ <https://builds.apache.org/job/wss4j-trunk/ws/wss4j/bindings/wss10-binding/pom.xml,>
MavenProject: org.apache.ws.security:wss4j-bindings-wss11:2.0-SNAPSHOT @ <https://builds.apache.org/job/wss4j-trunk/ws/wss4j/bindings/wss11-binding/pom.xml,>
MavenProject: org.apache.ws.security:wss4j-bindings-wssc:2.0-SNAPSHOT @ <https://builds.apache.org/job/wss4j-trunk/ws/wss4j/bindings/wssc-binding/pom.xml,>
MavenProject: org.apache.ws.security:wss4j-bindings:2.0-SNAPSHOT @ <https://builds.apache.org/job/wss4j-trunk/ws/wss4j/bindings/pom.xml,>
MavenProject: org.apache.ws.security:wss4j-policy:2.0-SNAPSHOT @ <https://builds.apache.org/job/wss4j-trunk/ws/wss4j/policy/pom.xml,>
MavenProject: org.apache.ws.security:wss4j-dom:2.0-SNAPSHOT @ <https://builds.apache.org/job/wss4j-trunk/ws/wss4j/wss4j-dom/pom.xml,>
MavenProject: org.apache.ws.security:wss4j-streaming-ws-security:2.0-SNAPSHOT @ <https://builds.apache.org/job/wss4j-trunk/ws/wss4j/streaming-ws-security/pom.xml,>
MavenProject: org.apache.ws.security:wss4j-streaming-ws-policy:2.0-SNAPSHOT @ <https://builds.apache.org/job/wss4j-trunk/ws/wss4j/streaming-ws-policy/pom.xml,>
MavenProject: org.swssf:cxf-integration:2.0-SNAPSHOT @ <https://builds.apache.org/job/wss4j-trunk/ws/wss4j/cxf-integration/pom.xml]>
[JENKINS] Archiving <https://builds.apache.org/job/wss4j-trunk/ws/wss4j/pom.xml> to
/home/hudson/hudson/jobs/wss4j-trunk/modules/org.apache.ws.security$wss4j/builds/2012-08-17_12-09-10/archive/org.apache.ws.security/wss4j/2.0-SNAPSHOT/wss4j-2.0-SNAPSHOT.pom
[JENKINS] Archiving <https://builds.apache.org/job/wss4j-trunk/ws/wss4j/bindings/wssc-binding/pom.xml>
to /home/hudson/hudson/jobs/wss4j-trunk/modules/org.apache.ws.security$wss4j-bindings-wssc/builds/2012-08-17_12-09-10/archive/org.apache.ws.security/wss4j-bindings-wssc/2.0-SNAPSHOT/wss4j-bindings-wssc-2.0-SNAPSHOT.pom
[JENKINS] Archiving <https://builds.apache.org/job/wss4j-trunk/ws/wss4j/bindings/wssc-binding/target/wss4j-bindings-wssc-2.0-SNAPSHOT.jar>
to /home/hudson/hudson/jobs/wss4j-trunk/modules/org.apache.ws.security$wss4j-bindings-wssc/builds/2012-08-17_12-09-10/archive/org.apache.ws.security/wss4j-bindings-wssc/2.0-20120817.121020-5/wss4j-bindings-wssc-2.0-20120817.121020-5.jar
[JENKINS] Archiving <https://builds.apache.org/job/wss4j-trunk/ws/wss4j/streaming-ws-security/pom.xml>
to /home/hudson/hudson/jobs/wss4j-trunk/modules/org.apache.ws.security$wss4j-streaming-ws-security/builds/2012-08-17_12-09-10/archive/org.apache.ws.security/wss4j-streaming-ws-security/2.0-SNAPSHOT/wss4j-streaming-ws-security-2.0-SNAPSHOT.pom
[JENKINS] Archiving <https://builds.apache.org/job/wss4j-trunk/ws/wss4j/bindings/wss11-binding/pom.xml>
to /home/hudson/hudson/jobs/wss4j-trunk/modules/org.apache.ws.security$wss4j-bindings-wss11/builds/2012-08-17_12-09-10/archive/org.apache.ws.security/wss4j-bindings-wss11/2.0-SNAPSHOT/wss4j-bindings-wss11-2.0-SNAPSHOT.pom
[JENKINS] Archiving <https://builds.apache.org/job/wss4j-trunk/ws/wss4j/bindings/wss11-binding/target/wss4j-bindings-wss11-2.0-SNAPSHOT.jar>
to /home/hudson/hudson/jobs/wss4j-trunk/modules/org.apache.ws.security$wss4j-bindings-wss11/builds/2012-08-17_12-09-10/archive/org.apache.ws.security/wss4j-bindings-wss11/2.0-20120817.121013-5/wss4j-bindings-wss11-2.0-20120817.121013-5.jar
[JENKINS] Archiving <https://builds.apache.org/job/wss4j-trunk/ws/wss4j/parent/pom.xml>
to /home/hudson/hudson/jobs/wss4j-trunk/modules/org.apache.ws.security$wss4j-parent/builds/2012-08-17_12-09-10/archive/org.apache.ws.security/wss4j-parent/2.0-SNAPSHOT/wss4j-parent-2.0-SNAPSHOT.pom
[JENKINS] Archiving <https://builds.apache.org/job/wss4j-trunk/ws/wss4j/bindings/pom.xml>
to /home/hudson/hudson/jobs/wss4j-trunk/modules/org.apache.ws.security$wss4j-bindings/builds/2012-08-17_12-09-10/archive/org.apache.ws.security/wss4j-bindings/2.0-SNAPSHOT/wss4j-bindings-2.0-SNAPSHOT.pom
[JENKINS] Archiving <https://builds.apache.org/job/wss4j-trunk/ws/wss4j/wss4j-dom/pom.xml>
to /home/hudson/hudson/jobs/wss4j-trunk/modules/org.apache.ws.security$wss4j-dom/builds/2012-08-17_12-09-10/archive/org.apache.ws.security/wss4j-dom/2.0-SNAPSHOT/wss4j-dom-2.0-SNAPSHOT.pom
[JENKINS] Archiving <https://builds.apache.org/job/wss4j-trunk/ws/wss4j/wss4j-dom/target/wss4j-dom-2.0-SNAPSHOT.jar>
to /home/hudson/hudson/jobs/wss4j-trunk/modules/org.apache.ws.security$wss4j-dom/builds/2012-08-17_12-09-10/archive/org.apache.ws.security/wss4j-dom/2.0-20120817.121108-7/wss4j-dom-2.0-20120817.121108-7.jar
[JENKINS] Archiving <https://builds.apache.org/job/wss4j-trunk/ws/wss4j/bindings/wsu10-binding/pom.xml>
to /home/hudson/hudson/jobs/wss4j-trunk/modules/org.apache.ws.security$wss4j-bindings-wsu10/builds/2012-08-17_12-09-10/archive/org.apache.ws.security/wss4j-bindings-wsu10/2.0-SNAPSHOT/wss4j-bindings-wsu10-2.0-SNAPSHOT.pom
[JENKINS] Archiving <https://builds.apache.org/job/wss4j-trunk/ws/wss4j/bindings/wsu10-binding/target/wss4j-bindings-wsu10-2.0-SNAPSHOT.jar>
to /home/hudson/hudson/jobs/wss4j-trunk/modules/org.apache.ws.security$wss4j-bindings-wsu10/builds/2012-08-17_12-09-10/archive/org.apache.ws.security/wss4j-bindings-wsu10/2.0-20120817.120958-5/wss4j-bindings-wsu10-2.0-20120817.120958-5.jar
[JENKINS] Archiving <https://builds.apache.org/job/wss4j-trunk/ws/wss4j/cxf-integration/pom.xml>
to /home/hudson/hudson/jobs/wss4j-trunk/modules/org.swssf$cxf-integration/builds/2012-08-17_12-09-10/archive/org.swssf/cxf-integration/2.0-SNAPSHOT/cxf-integration-2.0-SNAPSHOT.pom
[JENKINS] Archiving <https://builds.apache.org/job/wss4j-trunk/ws/wss4j/bindings/wss10-binding/pom.xml>
to /home/hudson/hudson/jobs/wss4j-trunk/modules/org.apache.ws.security$wss4j-bindings-wss10/builds/2012-08-17_12-09-10/archive/org.apache.ws.security/wss4j-bindings-wss10/2.0-SNAPSHOT/wss4j-bindings-wss10-2.0-SNAPSHOT.pom
[JENKINS] Archiving <https://builds.apache.org/job/wss4j-trunk/ws/wss4j/bindings/wss10-binding/target/wss4j-bindings-wss10-2.0-SNAPSHOT.jar>
to /home/hudson/hudson/jobs/wss4j-trunk/modules/org.apache.ws.security$wss4j-bindings-wss10/builds/2012-08-17_12-09-10/archive/org.apache.ws.security/wss4j-bindings-wss10/2.0-20120817.121005-5/wss4j-bindings-wss10-2.0-20120817.121005-5.jar
[JENKINS] Archiving <https://builds.apache.org/job/wss4j-trunk/ws/wss4j/streaming-ws-policy/pom.xml>
to /home/hudson/hudson/jobs/wss4j-trunk/modules/org.apache.ws.security$wss4j-streaming-ws-policy/builds/2012-08-17_12-09-10/archive/org.apache.ws.security/wss4j-streaming-ws-policy/2.0-SNAPSHOT/wss4j-streaming-ws-policy-2.0-SNAPSHOT.pom
[JENKINS] Archiving <https://builds.apache.org/job/wss4j-trunk/ws/wss4j/policy/pom.xml>
to /home/hudson/hudson/jobs/wss4j-trunk/modules/org.apache.ws.security$wss4j-policy/builds/2012-08-17_12-09-10/archive/org.apache.ws.security/wss4j-policy/2.0-SNAPSHOT/wss4j-policy-2.0-SNAPSHOT.pom
[JENKINS] Archiving <https://builds.apache.org/job/wss4j-trunk/ws/wss4j/policy/target/wss4j-policy-2.0-SNAPSHOT.jar>
to /home/hudson/hudson/jobs/wss4j-trunk/modules/org.apache.ws.security$wss4j-policy/builds/2012-08-17_12-09-10/archive/org.apache.ws.security/wss4j-policy/2.0-20120817.121040-4/wss4j-policy-2.0-20120817.121040-4.jar
Waiting for Jenkins to finish collecting data
mavenExecutionResult exceptions not empty
message : Failed to execute goal on project wss4j-streaming-ws-security: Could not resolve
dependencies for project org.apache.ws.security:wss4j-streaming-ws-security:jar:2.0-SNAPSHOT:
Could not find artifact org.apache.ws.security:wss4j-ws-security-common:jar:2.0-SNAPSHOT in
Nexus (http://repository.apache.org/snapshots)
cause : Could not resolve dependencies for project org.apache.ws.security:wss4j-streaming-ws-security:jar:2.0-SNAPSHOT:
Could not find artifact org.apache.ws.security:wss4j-ws-security-common:jar:2.0-SNAPSHOT in
Nexus (http://repository.apache.org/snapshots)
Stack trace : 
org.apache.maven.lifecycle.LifecycleExecutionException: Failed to execute goal on project
wss4j-streaming-ws-security: Could not resolve dependencies for project org.apache.ws.security:wss4j-streaming-ws-security:jar:2.0-SNAPSHOT:
Could not find artifact org.apache.ws.security:wss4j-ws-security-common:jar:2.0-SNAPSHOT in
Nexus (http://repository.apache.org/snapshots)
	at org.apache.maven.lifecycle.internal.LifecycleDependencyResolver.getDependencies(LifecycleDependencyResolver.java:196)
	at org.apache.maven.lifecycle.internal.LifecycleDependencyResolver.resolveProjectDependencies(LifecycleDependencyResolver.java:108)
	at org.apache.maven.lifecycle.internal.MojoExecutor.ensureDependenciesAreResolved(MojoExecutor.java:258)
	at org.apache.maven.lifecycle.internal.MojoExecutor.execute(MojoExecutor.java:201)
	at org.apache.maven.lifecycle.internal.MojoExecutor.execute(MojoExecutor.java:153)
	at org.apache.maven.lifecycle.internal.MojoExecutor.execute(MojoExecutor.java:145)
	at org.apache.maven.lifecycle.internal.LifecycleModuleBuilder.buildProject(LifecycleModuleBuilder.java:84)
	at org.apache.maven.lifecycle.internal.LifecycleModuleBuilder.buildProject(LifecycleModuleBuilder.java:59)
	at org.apache.maven.lifecycle.internal.LifecycleStarter.singleThreadedBuild(LifecycleStarter.java:183)
	at org.apache.maven.lifecycle.internal.LifecycleStarter.execute(LifecycleStarter.java:161)
	at org.apache.maven.DefaultMaven.doExecute(DefaultMaven.java:319)
	at org.apache.maven.DefaultMaven.execute(DefaultMaven.java:156)
	at org.jvnet.hudson.maven3.launcher.Maven3Launcher.main(Maven3Launcher.java:79)
	at sun.reflect.NativeMethodAccessorImpl.invoke0(Native Method)
	at sun.reflect.NativeMethodAccessorImpl.invoke(NativeMethodAccessorImpl.java:39)
	at sun.reflect.DelegatingMethodAccessorImpl.invoke(DelegatingMethodAccessorImpl.java:25)
	at java.lang.reflect.Method.invoke(Method.java:597)
	at org.codehaus.plexus.classworlds.launcher.Launcher.launchStandard(Launcher.java:329)
	at org.codehaus.plexus.classworlds.launcher.Launcher.launch(Launcher.java:239)
	at org.jvnet.hudson.maven3.agent.Maven3Main.launch(Maven3Main.java:158)
	at hudson.maven.Maven3Builder.call(Maven3Builder.java:98)
	at hudson.maven.Maven3Builder.call(Maven3Builder.java:64)
	at hudson.remoting.UserRequest.perform(UserRequest.java:118)
	at hudson.remoting.UserRequest.perform(UserRequest.java:48)
	at hudson.remoting.Request$2.run(Request.java:326)
	at hudson.remoting.InterceptingExecutorService$1.call(InterceptingExecutorService.java:72)
	at java.util.concurrent.FutureTask$Sync.innerRun(FutureTask.java:303)
	at java.util.concurrent.FutureTask.run(FutureTask.java:138)
	at java.util.concurrent.ThreadPoolExecutor$Worker.runTask(ThreadPoolExecutor.java:886)
	at java.util.concurrent.ThreadPoolExecutor$Worker.run(ThreadPoolExecutor.java:908)
	at java.lang.Thread.run(Thread.java:619)
Caused by: org.apache.maven.project.DependencyResolutionException: Could not resolve dependencies
for project org.apache.ws.security:wss4j-streaming-ws-security:jar:2.0-SNAPSHOT: Could not
find artifact org.apache.ws.security:wss4j-ws-security-common:jar:2.0-SNAPSHOT in Nexus (http://repository.apache.org/snapshots)
	at org.apache.maven.project.DefaultProjectDependenciesResolver.resolve(DefaultProjectDependenciesResolver.java:170)
	at org.apache.maven.lifecycle.internal.LifecycleDependencyResolver.getDependencies(LifecycleDependencyResolver.java:171)
	... 30 more
Caused by: org.sonatype.aether.resolution.DependencyResolutionException: Could not find artifact
org.apache.ws.security:wss4j-ws-security-common:jar:2.0-SNAPSHOT in Nexus (http://repository.apache.org/snapshots)
	at org.sonatype.aether.impl.internal.DefaultRepositorySystem.resolveDependencies(DefaultRepositorySystem.java:412)
	at org.apache.maven.project.DefaultProjectDependenciesResolver.resolve(DefaultProjectDependenciesResolver.java:164)
	... 31 more
Caused by: org.sonatype.aether.resolution.ArtifactResolutionException: Could not find artifact
org.apache.ws.security:wss4j-ws-security-common:jar:2.0-SNAPSHOT in Nexus (http://repository.apache.org/snapshots)
	at org.sonatype.aether.impl.internal.DefaultArtifactResolver.resolve(DefaultArtifactResolver.java:541)
	at org.sonatype.aether.impl.internal.DefaultArtifactResolver.resolveArtifacts(DefaultArtifactResolver.java:220)
	at org.sonatype.aether.impl.internal.DefaultRepositorySystem.resolveDependencies(DefaultRepositorySystem.java:395)
	... 32 more
Caused by: org.sonatype.aether.transfer.ArtifactNotFoundException: Could not find artifact
org.apache.ws.security:wss4j-ws-security-common:jar:2.0-SNAPSHOT in Nexus (http://repository.apache.org/snapshots)
	at org.sonatype.aether.connector.wagon.WagonRepositoryConnector$4.wrap(WagonRepositoryConnector.java:945)
	at org.sonatype.aether.connector.wagon.WagonRepositoryConnector$4.wrap(WagonRepositoryConnector.java:940)
	at org.sonatype.aether.connector.wagon.WagonRepositoryConnector$GetTask.flush(WagonRepositoryConnector.java:695)
	at org.sonatype.aether.connector.wagon.WagonRepositoryConnector$GetTask.flush(WagonRepositoryConnector.java:689)
	at org.sonatype.aether.connector.wagon.WagonRepositoryConnector.get(WagonRepositoryConnector.java:445)
	at org.sonatype.aether.impl.internal.DefaultArtifactResolver.resolve(DefaultArtifactResolver.java:460)
	... 34 more
Sending e-mails to: dev@ws.apache.org coheigea@apache.org
[WARNING] The requested profile "deploy" could not be activated because it does not exist.
channel stopped

---------------------------------------------------------------------
To unsubscribe, e-mail: dev-unsubscribe@ws.apache.org
For additional commands, e-mail: dev-help@ws.apache.org


Mime
View raw message