ws-dev mailing list archives

Site index · List index
Message view « Date » · « Thread »
Top « Date » · « Thread »
From Apache Jenkins Server <jenk...@builds.apache.org>
Subject Build failed in Jenkins: wss4j-trunk #335
Date Wed, 15 Aug 2012 16:10:44 GMT
See <https://builds.apache.org/job/wss4j-trunk/335/changes>

Changes:

[coheigea] Removed 1.5 configuration thing

[coheigea] Adding parent module

[coheigea] Fixing build

[coheigea] Removing README

------------------------------------------
[...truncated 2537 lines...]
mojoSucceeded org.apache.maven.plugins:maven-resources-plugin:2.4.3(default-testResources)
mojoStarted org.apache.maven.plugins:maven-compiler-plugin:2.4(default-testCompile)[WARNING]
File encoding has not been set, using platform encoding ANSI_X3.4-1968, i.e. build is platform
dependent!
[INFO] Compiling 32 source files to <https://builds.apache.org/job/wss4j-trunk/ws/wss4j/rampart-policy/target/test-classes>

[INFO] 
[INFO] --- maven-compiler-plugin:2.4:testCompile (default-testCompile) @ rampart-policy ---
mojoSucceeded org.apache.maven.plugins:maven-compiler-plugin:2.4(default-testCompile)
mojoStarted org.apache.maven.plugins:maven-surefire-plugin:2.7.2(default-test)
[INFO] 
[INFO] --- maven-surefire-plugin:2.7.2:test (default-test) @ rampart-policy ---
[INFO] Surefire report directory: <https://builds.apache.org/job/wss4j-trunk/ws/wss4j/rampart-policy/target/surefire-reports>

-------------------------------------------------------
 T E S T S
-------------------------------------------------------
Running org.apache.ws.secpolicy.tests.LayoutTest
Tests run: 1, Failures: 0, Errors: 0, Skipped: 0, Time elapsed: 0.211 sec
Running org.apache.ws.secpolicy.tests.SamlTokenTest
Tests run: 1, Failures: 0, Errors: 0, Skipped: 0, Time elapsed: 0.028 sec
Running org.apache.ws.secpolicy.tests.X509TokenTest
Tests run: 1, Failures: 0, Errors: 0, Skipped: 0, Time elapsed: 0.023 sec
Running org.apache.ws.secpolicy.tests.RecipientTokenTest
Tests run: 1, Failures: 0, Errors: 0, Skipped: 0, Time elapsed: 0.017 sec
Running org.apache.ws.secpolicy.tests.TransportBindingTest
Tests run: 1, Failures: 0, Errors: 0, Skipped: 0, Time elapsed: 0.025 sec
Running org.apache.ws.secpolicy.tests.RequiredPartsTest
Tests run: 1, Failures: 0, Errors: 0, Skipped: 0, Time elapsed: 0.013 sec
Running org.apache.ws.secpolicy.tests.SecurityContextTokenTest
Tests run: 1, Failures: 0, Errors: 0, Skipped: 0, Time elapsed: 0.014 sec
Running org.apache.ws.secpolicy.tests.EncryptedPartsTest
Tests run: 2, Failures: 0, Errors: 0, Skipped: 0, Time elapsed: 0.028 sec
Running org.apache.ws.secpolicy.tests.SupportingTokensTest
Tests run: 1, Failures: 0, Errors: 0, Skipped: 0, Time elapsed: 0.02 sec
Running org.apache.ws.secpolicy.tests.HttpsTokenTest
Tests run: 1, Failures: 0, Errors: 0, Skipped: 0, Time elapsed: 0.011 sec
Running org.apache.ws.secpolicy.tests.Trust13Test
Tests run: 2, Failures: 0, Errors: 0, Skipped: 0, Time elapsed: 0.027 sec
Running org.apache.ws.secpolicy.tests.SymmetricBindingTest
Tests run: 1, Failures: 0, Errors: 0, Skipped: 0, Time elapsed: 0.021 sec
Running org.apache.ws.secpolicy.tests.EncryptedElementsTest
Tests run: 1, Failures: 0, Errors: 0, Skipped: 0, Time elapsed: 0.01 sec
Running org.apache.ws.secpolicy.tests.SignedElementsTest
Tests run: 2, Failures: 0, Errors: 0, Skipped: 0, Time elapsed: 0.021 sec
Running org.apache.ws.secpolicy.tests.InitiatorTokenTest
Tests run: 1, Failures: 0, Errors: 0, Skipped: 0, Time elapsed: 0.01 sec
Running org.apache.ws.secpolicy.tests.SignedPartsTest
Tests run: 2, Failures: 0, Errors: 0, Skipped: 0, Time elapsed: 0.021 sec
Running org.apache.ws.secpolicy.tests.Wss11Test
Tests run: 1, Failures: 0, Errors: 0, Skipped: 0, Time elapsed: 0.012 sec
Running org.apache.ws.secpolicy.tests.ContentEncryptedElementsTest
Tests run: 1, Failures: 0, Errors: 0, Skipped: 0, Time elapsed: 0.009 sec
Running org.apache.ws.secpolicy.tests.PolicyNormalizationTest
Tests run: 1, Failures: 0, Errors: 0, Skipped: 0, Time elapsed: 0.306 sec
Running org.apache.ws.secpolicy.tests.SpnegoContextTokenTest
Tests run: 1, Failures: 0, Errors: 0, Skipped: 0, Time elapsed: 0.011 sec
Running org.apache.ws.secpolicy.tests.RelTokenTest
Tests run: 1, Failures: 0, Errors: 0, Skipped: 0, Time elapsed: 0.01 sec
Running org.apache.ws.secpolicy.tests.KeyValueTokenTest
Tests run: 1, Failures: 0, Errors: 0, Skipped: 0, Time elapsed: 0.009 sec
Running org.apache.ws.secpolicy.tests.RequiredElementsTest
Tests run: 1, Failures: 0, Errors: 0, Skipped: 0, Time elapsed: 0.009 sec
Running org.apache.ws.secpolicy.tests.UsernameTokenTest
Tests run: 2, Failures: 0, Errors: 0, Skipped: 0, Time elapsed: 0.019 sec
Running org.apache.ws.secpolicy.tests.SecureConversationTokenTest
Tests run: 1, Failures: 0, Errors: 0, Skipped: 0, Time elapsed: 0.016 sec
Running org.apache.ws.secpolicy.tests.IssuedTokenTest
Tests run: 1, Failures: 0, Errors: 0, Skipped: 0, Time elapsed: 0.01 sec
Running org.apache.ws.secpolicy.tests.AsymmetricBindingTest
Tests run: 1, Failures: 0, Errors: 0, Skipped: 0, Time elapsed: 0.02 sec
Running org.apache.ws.secpolicy.tests.KerberosTokenTest
Tests run: 1, Failures: 0, Errors: 0, Skipped: 0, Time elapsed: 0.01 sec
Running org.apache.ws.secpolicy.tests.Trust10Test
Tests run: 1, Failures: 0, Errors: 0, Skipped: 0, Time elapsed: 0.008 sec
Running org.apache.ws.secpolicy.tests.AlgorithmSuiteTest
Tests run: 1, Failures: 0, Errors: 0, Skipped: 0, Time elapsed: 0.009 sec
Running org.apache.ws.secpolicy.tests.Wss10Test
Tests run: 1, Failures: 0, Errors: 0, Skipped: 0, Time elapsed: 0.013 sec

Results :

Tests run: 36, Failures: 0, Errors: 0, Skipped: 0

mojoSucceeded org.apache.maven.plugins:maven-surefire-plugin:2.7.2(default-test)
[JENKINS] Recording test results
mojoStarted org.apache.maven.plugins:maven-jar-plugin:2.3.1(default-jar)
[INFO] 
[INFO] --- maven-jar-plugin:2.3.1:jar (default-jar) @ rampart-policy ---
[INFO] Building jar: <https://builds.apache.org/job/wss4j-trunk/ws/wss4j/rampart-policy/target/rampart-policy-2.0-SNAPSHOT.jar>
mojoSucceeded org.apache.maven.plugins:maven-jar-plugin:2.3.1(default-jar)
mojoStarted org.apache.rat:apache-rat-plugin:0.8(default)
[INFO] 
[INFO] --- apache-rat-plugin:0.8:check (default) @ rampart-policy ---
[INFO] Exclude: .gitignore
[INFO] Exclude: .git/**
[INFO] Exclude: .svn/**
[INFO] Exclude: .pmd/**
[INFO] Exclude: .checkstyle/**
[INFO] Exclude: src/main/resources/**
[INFO] Exclude: src/test/resources/**
[INFO] Exclude: **/*.patch
mojoSucceeded org.apache.rat:apache-rat-plugin:0.8(default)
mojoStarted org.apache.maven.plugins:maven-install-plugin:2.3.1(default-install)[INFO] Installing
<https://builds.apache.org/job/wss4j-trunk/ws/wss4j/rampart-policy/target/rampart-policy-2.0-SNAPSHOT.jar>
to /home/jenkins/jenkins-slave/maven-repositories/0/org/swssf/rampart-policy/2.0-SNAPSHOT/rampart-policy-2.0-SNAPSHOT.jar
[INFO] Installing <https://builds.apache.org/job/wss4j-trunk/ws/wss4j/rampart-policy/pom.xml>
to /home/jenkins/jenkins-slave/maven-repositories/0/org/swssf/rampart-policy/2.0-SNAPSHOT/rampart-policy-2.0-SNAPSHOT.pom

[INFO] 
[INFO] --- maven-install-plugin:2.3.1:install (default-install) @ rampart-policy ---
mojoSucceeded org.apache.maven.plugins:maven-install-plugin:2.3.1(default-install)
mojoStarted org.apache.maven.plugins:maven-resources-plugin:2.4.3(default-resources)[WARNING]
Using platform encoding (ANSI_X3.4-1968 actually) to copy filtered resources, i.e. build is
platform dependent!
[INFO] Copying 1 resource

[INFO] 
[INFO] --- maven-resources-plugin:2.4.3:resources (default-resources) @ rampart-policy ---
mojoSucceeded org.apache.maven.plugins:maven-resources-plugin:2.4.3(default-resources)
mojoStarted org.apache.maven.plugins:maven-compiler-plugin:2.4(default-compile)[INFO] Nothing
to compile - all classes are up to date

[INFO] 
[INFO] --- maven-compiler-plugin:2.4:compile (default-compile) @ rampart-policy ---
mojoSucceeded org.apache.maven.plugins:maven-compiler-plugin:2.4(default-compile)
mojoStarted org.apache.maven.plugins:maven-resources-plugin:2.4.3(default-testResources)[WARNING]
Using platform encoding (ANSI_X3.4-1968 actually) to copy filtered resources, i.e. build is
platform dependent!
[INFO] Copying 108 resources

[INFO] 
[INFO] --- maven-resources-plugin:2.4.3:testResources (default-testResources) @ rampart-policy
---
mojoSucceeded org.apache.maven.plugins:maven-resources-plugin:2.4.3(default-testResources)
mojoStarted org.apache.maven.plugins:maven-compiler-plugin:2.4(default-testCompile)[INFO]
Nothing to compile - all classes are up to date

[INFO] 
[INFO] --- maven-compiler-plugin:2.4:testCompile (default-testCompile) @ rampart-policy ---
mojoSucceeded org.apache.maven.plugins:maven-compiler-plugin:2.4(default-testCompile)
mojoStarted org.apache.maven.plugins:maven-surefire-plugin:2.7.2(default-test)[INFO] Skipping
execution of surefire because it has already been run for this configuration

[INFO] 
[INFO] --- maven-surefire-plugin:2.7.2:test (default-test) @ rampart-policy ---
mojoSucceeded org.apache.maven.plugins:maven-surefire-plugin:2.7.2(default-test)
[JENKINS] Recording test results
mojoStarted org.apache.maven.plugins:maven-jar-plugin:2.3.1(default-jar)
[INFO] 
[INFO] --- maven-jar-plugin:2.3.1:jar (default-jar) @ rampart-policy ---
mojoSucceeded org.apache.maven.plugins:maven-jar-plugin:2.3.1(default-jar)
mojoStarted org.apache.rat:apache-rat-plugin:0.8(default)[INFO] Exclude: .gitignore
[INFO] Exclude: .git/**
[INFO] Exclude: .svn/**
[INFO] Exclude: .pmd/**
[INFO] Exclude: .checkstyle/**
[INFO] Exclude: src/main/resources/**
[INFO] Exclude: src/test/resources/**
[INFO] Exclude: **/*.patch

[INFO] 
[INFO] --- apache-rat-plugin:0.8:check (default) @ rampart-policy ---
mojoSucceeded org.apache.rat:apache-rat-plugin:0.8(default)
mojoStarted org.apache.maven.plugins:maven-install-plugin:2.3.1(default-install)[INFO] Installing
<https://builds.apache.org/job/wss4j-trunk/ws/wss4j/rampart-policy/target/rampart-policy-2.0-SNAPSHOT.jar>
to /home/jenkins/jenkins-slave/maven-repositories/0/org/swssf/rampart-policy/2.0-SNAPSHOT/rampart-policy-2.0-SNAPSHOT.jar
[INFO] Installing <https://builds.apache.org/job/wss4j-trunk/ws/wss4j/rampart-policy/pom.xml>
to /home/jenkins/jenkins-slave/maven-repositories/0/org/swssf/rampart-policy/2.0-SNAPSHOT/rampart-policy-2.0-SNAPSHOT.pom

[INFO] 
[INFO] --- maven-install-plugin:2.3.1:install (default-install) @ rampart-policy ---
mojoSucceeded org.apache.maven.plugins:maven-install-plugin:2.3.1(default-install)
mojoStarted org.apache.maven.plugins:maven-deploy-plugin:2.5(default-deploy)
[INFO] 
[INFO] --- maven-deploy-plugin:2.5:deploy (default-deploy) @ rampart-policy ---
mojoFailed org.apache.maven.plugins:maven-deploy-plugin:2.5(default-deploy)
projectFailed org.swssf:rampart-policy:2.0-SNAPSHOT
sessionEnded
[INFO] ------------------------------------------------------------------------
[INFO] Reactor Summary:
[INFO] 
[INFO] Apache WSS4J ...................................... SUCCESS [18.343s]
[INFO] Apache WSS4J parent ............................... SUCCESS [1.741s]
[INFO] WebService Security Utility 1.0 Binding ........... SUCCESS [10.203s]
[INFO] WebService Security 1.0 Binding ................... SUCCESS [6.641s]
[INFO] WebService Security 1.1 Binding ................... SUCCESS [8.153s]
[INFO] WS-Secure-Conversation binding .................... SUCCESS [7.151s]
[INFO] Bindings .......................................... SUCCESS [1.289s]
[INFO] WSS4J DOM Implementation .......................... SUCCESS [39.538s]
[INFO] Streaming WebService Security ..................... SUCCESS [49.387s]
[INFO] Rampart - Policy .................................. FAILURE [10.356s]
[INFO] Streaming WebService Policy ....................... SKIPPED
[INFO] Streaming WS Security CXF Integration ............. SKIPPED
[INFO] ------------------------------------------------------------------------
[INFO] BUILD FAILURE
[INFO] ------------------------------------------------------------------------
[INFO] Total time: 2:36.885s
[INFO] Finished at: Wed Aug 15 16:10:22 UTC 2012
[INFO] Final Memory: 32M/224M
[INFO] ------------------------------------------------------------------------
Projects to build: [MavenProject: org.apache.ws.security:wss4j:2.0-SNAPSHOT @ <https://builds.apache.org/job/wss4j-trunk/ws/wss4j/pom.xml,>
MavenProject: org.apache.ws.security:wss4j-parent:2.0-SNAPSHOT @ <https://builds.apache.org/job/wss4j-trunk/ws/wss4j/parent/pom.xml,>
MavenProject: org.swssf:wsu10-binding:2.0-SNAPSHOT @ <https://builds.apache.org/job/wss4j-trunk/ws/wss4j/bindings/wsu10-binding/pom.xml,>
MavenProject: org.swssf:wss10-binding:2.0-SNAPSHOT @ <https://builds.apache.org/job/wss4j-trunk/ws/wss4j/bindings/wss10-binding/pom.xml,>
MavenProject: org.swssf:wss11-binding:2.0-SNAPSHOT @ <https://builds.apache.org/job/wss4j-trunk/ws/wss4j/bindings/wss11-binding/pom.xml,>
MavenProject: org.swssf:ws-secureconversation-binding:2.0-SNAPSHOT @ <https://builds.apache.org/job/wss4j-trunk/ws/wss4j/bindings/ws-secureconversation-binding/pom.xml,>
MavenProject: org.swssf:bindings:2.0-SNAPSHOT @ <https://builds.apache.org/job/wss4j-trunk/ws/wss4j/bindings/pom.xml,>
MavenProject: org.apache.ws.security:wss4j-dom:2.0-SNAPSHOT @ <https://builds.apache.org/job/wss4j-trunk/ws/wss4j/wss4j-dom/pom.xml,>
MavenProject: org.swssf:streaming-ws-security:2.0-SNAPSHOT @ <https://builds.apache.org/job/wss4j-trunk/ws/wss4j/streaming-ws-security/pom.xml,>
MavenProject: org.swssf:rampart-policy:2.0-SNAPSHOT @ <https://builds.apache.org/job/wss4j-trunk/ws/wss4j/rampart-policy/pom.xml,>
MavenProject: org.swssf:streaming-ws-policy:2.0-SNAPSHOT @ <https://builds.apache.org/job/wss4j-trunk/ws/wss4j/streaming-ws-policy/pom.xml,>
MavenProject: org.swssf:cxf-integration:2.0-SNAPSHOT @ <https://builds.apache.org/job/wss4j-trunk/ws/wss4j/cxf-integration/pom.xml]>
[JENKINS] Archiving <https://builds.apache.org/job/wss4j-trunk/ws/wss4j/pom.xml> to
/home/hudson/hudson/jobs/wss4j-trunk/modules/org.apache.ws.security$wss4j/builds/2012-08-15_16-07-29/archive/org.apache.ws.security/wss4j/2.0-SNAPSHOT/wss4j-2.0-SNAPSHOT.pom
[JENKINS] Archiving <https://builds.apache.org/job/wss4j-trunk/ws/wss4j/bindings/wsu10-binding/pom.xml>
to /home/hudson/hudson/jobs/wss4j-trunk/modules/org.swssf$wsu10-binding/builds/2012-08-15_16-07-29/archive/org.swssf/wsu10-binding/2.0-SNAPSHOT/wsu10-binding-2.0-SNAPSHOT.pom
[JENKINS] Archiving <https://builds.apache.org/job/wss4j-trunk/ws/wss4j/bindings/wsu10-binding/target/wsu10-binding-2.0-SNAPSHOT.jar>
to /home/hudson/hudson/jobs/wss4j-trunk/modules/org.swssf$wsu10-binding/builds/2012-08-15_16-07-29/archive/org.swssf/wsu10-binding/2.0-20120815.160817-1/wsu10-binding-2.0-20120815.160817-1.jar
[JENKINS] Archiving <https://builds.apache.org/job/wss4j-trunk/ws/wss4j/bindings/pom.xml>
to /home/hudson/hudson/jobs/wss4j-trunk/modules/org.swssf$bindings/builds/2012-08-15_16-07-29/archive/org.swssf/bindings/2.0-SNAPSHOT/bindings-2.0-SNAPSHOT.pom
[JENKINS] Archiving <https://builds.apache.org/job/wss4j-trunk/ws/wss4j/rampart-policy/pom.xml>
to /home/hudson/hudson/jobs/wss4j-trunk/modules/org.swssf$rampart-policy/builds/2012-08-15_16-07-30/archive/org.swssf/rampart-policy/2.0-SNAPSHOT/rampart-policy-2.0-SNAPSHOT.pom
[JENKINS] Archiving <https://builds.apache.org/job/wss4j-trunk/ws/wss4j/rampart-policy/target/rampart-policy-2.0-SNAPSHOT.jar>
to /home/hudson/hudson/jobs/wss4j-trunk/modules/org.swssf$rampart-policy/builds/2012-08-15_16-07-30/archive/org.swssf/rampart-policy/2.0-SNAPSHOT/rampart-policy-2.0-SNAPSHOT.jar
[JENKINS] Archiving <https://builds.apache.org/job/wss4j-trunk/ws/wss4j/streaming-ws-security/pom.xml>
to /home/hudson/hudson/jobs/wss4j-trunk/modules/org.swssf$streaming-ws-security/builds/2012-08-15_16-07-30/archive/org.swssf/streaming-ws-security/2.0-SNAPSHOT/streaming-ws-security-2.0-SNAPSHOT.pom
[JENKINS] Archiving <https://builds.apache.org/job/wss4j-trunk/ws/wss4j/streaming-ws-security/target/streaming-ws-security-2.0-SNAPSHOT.jar>
to /home/hudson/hudson/jobs/wss4j-trunk/modules/org.swssf$streaming-ws-security/builds/2012-08-15_16-07-30/archive/org.swssf/streaming-ws-security/2.0-20120815.161009-1/streaming-ws-security-2.0-20120815.161009-1.jar
[JENKINS] Archiving <https://builds.apache.org/job/wss4j-trunk/ws/wss4j/streaming-ws-security/target/streaming-ws-security-2.0-SNAPSHOT-tests.jar>
to /home/hudson/hudson/jobs/wss4j-trunk/modules/org.swssf$streaming-ws-security/builds/2012-08-15_16-07-30/archive/org.swssf/streaming-ws-security/2.0-20120815.161009-1/streaming-ws-security-2.0-20120815.161009-1-tests.jar
[JENKINS] Archiving <https://builds.apache.org/job/wss4j-trunk/ws/wss4j/parent/pom.xml>
to /home/hudson/hudson/jobs/wss4j-trunk/modules/org.apache.ws.security$wss4j-parent/builds/2012-08-15_16-07-29/archive/org.apache.ws.security/wss4j-parent/2.0-SNAPSHOT/wss4j-parent-2.0-SNAPSHOT.pom
[JENKINS] Archiving <https://builds.apache.org/job/wss4j-trunk/ws/wss4j/bindings/ws-secureconversation-binding/pom.xml>
to /home/hudson/hudson/jobs/wss4j-trunk/modules/org.swssf$ws-secureconversation-binding/builds/2012-08-15_16-07-30/archive/org.swssf/ws-secureconversation-binding/2.0-SNAPSHOT/ws-secureconversation-binding-2.0-SNAPSHOT.pom
[JENKINS] Archiving <https://builds.apache.org/job/wss4j-trunk/ws/wss4j/bindings/ws-secureconversation-binding/target/ws-secureconversation-binding-2.0-SNAPSHOT.jar>
to /home/hudson/hudson/jobs/wss4j-trunk/modules/org.swssf$ws-secureconversation-binding/builds/2012-08-15_16-07-30/archive/org.swssf/ws-secureconversation-binding/2.0-20120815.160839-1/ws-secureconversation-binding-2.0-20120815.160839-1.jar
[JENKINS] Archiving <https://builds.apache.org/job/wss4j-trunk/ws/wss4j/bindings/wss10-binding/pom.xml>
to /home/hudson/hudson/jobs/wss4j-trunk/modules/org.swssf$wss10-binding/builds/2012-08-15_16-07-29/archive/org.swssf/wss10-binding/2.0-SNAPSHOT/wss10-binding-2.0-SNAPSHOT.pom
[JENKINS] Archiving <https://builds.apache.org/job/wss4j-trunk/ws/wss4j/bindings/wss10-binding/target/wss10-binding-2.0-SNAPSHOT.jar>
to /home/hudson/hudson/jobs/wss4j-trunk/modules/org.swssf$wss10-binding/builds/2012-08-15_16-07-29/archive/org.swssf/wss10-binding/2.0-20120815.160824-1/wss10-binding-2.0-20120815.160824-1.jar
[JENKINS] Archiving <https://builds.apache.org/job/wss4j-trunk/ws/wss4j/wss4j-dom/pom.xml>
to /home/hudson/hudson/jobs/wss4j-trunk/modules/org.apache.ws.security$wss4j-dom/builds/2012-08-15_16-07-30/archive/org.apache.ws.security/wss4j-dom/2.0-SNAPSHOT/wss4j-dom-2.0-SNAPSHOT.pom
[JENKINS] Archiving <https://builds.apache.org/job/wss4j-trunk/ws/wss4j/wss4j-dom/target/wss4j-dom-2.0-SNAPSHOT.jar>
to /home/hudson/hudson/jobs/wss4j-trunk/modules/org.apache.ws.security$wss4j-dom/builds/2012-08-15_16-07-30/archive/org.apache.ws.security/wss4j-dom/2.0-20120815.160919-1/wss4j-dom-2.0-20120815.160919-1.jar
[JENKINS] Archiving <https://builds.apache.org/job/wss4j-trunk/ws/wss4j/bindings/wss11-binding/pom.xml>
to /home/hudson/hudson/jobs/wss4j-trunk/modules/org.swssf$wss11-binding/builds/2012-08-15_16-07-30/archive/org.swssf/wss11-binding/2.0-SNAPSHOT/wss11-binding-2.0-SNAPSHOT.pom
[JENKINS] Archiving <https://builds.apache.org/job/wss4j-trunk/ws/wss4j/bindings/wss11-binding/target/wss11-binding-2.0-SNAPSHOT.jar>
to /home/hudson/hudson/jobs/wss4j-trunk/modules/org.swssf$wss11-binding/builds/2012-08-15_16-07-30/archive/org.swssf/wss11-binding/2.0-20120815.160832-1/wss11-binding-2.0-20120815.160832-1.jar
[JENKINS] Archiving <https://builds.apache.org/job/wss4j-trunk/ws/wss4j/cxf-integration/pom.xml>
to /home/hudson/hudson/jobs/wss4j-trunk/modules/org.swssf$cxf-integration/builds/2012-08-15_16-07-30/archive/org.swssf/cxf-integration/2.0-SNAPSHOT/cxf-integration-2.0-SNAPSHOT.pom
[JENKINS] Archiving <https://builds.apache.org/job/wss4j-trunk/ws/wss4j/streaming-ws-policy/pom.xml>
to /home/hudson/hudson/jobs/wss4j-trunk/modules/org.swssf$streaming-ws-policy/builds/2012-08-15_16-07-30/archive/org.swssf/streaming-ws-policy/2.0-SNAPSHOT/streaming-ws-policy-2.0-SNAPSHOT.pom
[WARNING] The requested profile "deploy" could not be activated because it does not exist.
Waiting for Jenkins to finish collecting data
mavenExecutionResult exceptions not empty
message : Failed to execute goal org.apache.maven.plugins:maven-deploy-plugin:2.5:deploy (default-deploy)
on project rampart-policy: Deployment failed: repository element was not specified in the
POM inside distributionManagement element or in -DaltDeploymentRepository=id::layout::url
parameter
cause : Deployment failed: repository element was not specified in the POM inside distributionManagement
element or in -DaltDeploymentRepository=id::layout::url parameter
Stack trace : 
org.apache.maven.lifecycle.LifecycleExecutionException: Failed to execute goal org.apache.maven.plugins:maven-deploy-plugin:2.5:deploy
(default-deploy) on project rampart-policy: Deployment failed: repository element was not
specified in the POM inside distributionManagement element or in -DaltDeploymentRepository=id::layout::url
parameter
	at org.apache.maven.lifecycle.internal.MojoExecutor.execute(MojoExecutor.java:217)
	at org.apache.maven.lifecycle.internal.MojoExecutor.execute(MojoExecutor.java:153)
	at org.apache.maven.lifecycle.internal.MojoExecutor.execute(MojoExecutor.java:145)
	at org.apache.maven.lifecycle.internal.LifecycleModuleBuilder.buildProject(LifecycleModuleBuilder.java:84)
	at org.apache.maven.lifecycle.internal.LifecycleModuleBuilder.buildProject(LifecycleModuleBuilder.java:59)
	at org.apache.maven.lifecycle.internal.LifecycleStarter.singleThreadedBuild(LifecycleStarter.java:183)
	at org.apache.maven.lifecycle.internal.LifecycleStarter.execute(LifecycleStarter.java:161)
	at org.apache.maven.DefaultMaven.doExecute(DefaultMaven.java:319)
	at org.apache.maven.DefaultMaven.execute(DefaultMaven.java:156)
	at org.jvnet.hudson.maven3.launcher.Maven3Launcher.main(Maven3Launcher.java:79)
	at sun.reflect.NativeMethodAccessorImpl.invoke0(Native Method)
	at sun.reflect.NativeMethodAccessorImpl.invoke(NativeMethodAccessorImpl.java:39)
	at sun.reflect.DelegatingMethodAccessorImpl.invoke(DelegatingMethodAccessorImpl.java:25)
	at java.lang.reflect.Method.invoke(Method.java:597)
	at org.codehaus.plexus.classworlds.launcher.Launcher.launchStandard(Launcher.java:329)
	at org.codehaus.plexus.classworlds.launcher.Launcher.launch(Launcher.java:239)
	at org.jvnet.hudson.maven3.agent.Maven3Main.launch(Maven3Main.java:158)
	at hudson.maven.Maven3Builder.call(Maven3Builder.java:98)
	at hudson.maven.Maven3Builder.call(Maven3Builder.java:64)
	at hudson.remoting.UserRequest.perform(UserRequest.java:118)
	at hudson.remoting.UserRequest.perform(UserRequest.java:48)
	at hudson.remoting.Request$2.run(Request.java:326)
	at hudson.remoting.InterceptingExecutorService$1.call(InterceptingExecutorService.java:72)
	at java.util.concurrent.FutureTask$Sync.innerRun(FutureTask.java:303)
	at java.util.concurrent.FutureTask.run(FutureTask.java:138)
	at java.util.concurrent.ThreadPoolExecutor$Worker.runTask(ThreadPoolExecutor.java:886)
	at java.util.concurrent.ThreadPoolExecutor$Worker.run(ThreadPoolExecutor.java:908)
	at java.lang.Thread.run(Thread.java:619)
Caused by: org.apache.maven.plugin.MojoExecutionException: Deployment failed: repository element
was not specified in the POM inside distributionManagement element or in -DaltDeploymentRepository=id::layout::url
parameter
	at org.apache.maven.plugin.deploy.DeployMojo.getDeploymentRepository(DeployMojo.java:231)
	at org.apache.maven.plugin.deploy.DeployMojo.execute(DeployMojo.java:117)
	at org.apache.maven.plugin.DefaultBuildPluginManager.executeMojo(DefaultBuildPluginManager.java:101)
	at org.apache.maven.lifecycle.internal.MojoExecutor.execute(MojoExecutor.java:209)
	... 27 more
Sending e-mails to: dev@ws.apache.org coheigea@apache.org
channel stopped

---------------------------------------------------------------------
To unsubscribe, e-mail: dev-unsubscribe@ws.apache.org
For additional commands, e-mail: dev-help@ws.apache.org


Mime
View raw message