ws-dev mailing list archives

Site index · List index
Message view « Date » · « Thread »
Top « Date » · « Thread »
From Apache Jenkins Server <jenk...@builds.apache.org>
Subject Build failed in Jenkins: woden-trunk #726
Date Tue, 09 Oct 2012 07:09:16 GMT
See <https://builds.apache.org/job/woden-trunk/726/>

------------------------------------------
[...truncated 1417 lines...]
Downloaded: http://repository.apache.org/snapshots/org/apache/woden/woden-api/1.0-SNAPSHOT/woden-api-1.0-20120626.005613-416.jar
(154 KB at 426.0 KB/sec)
mojoStarted org.apache.maven.plugins:maven-clean-plugin:2.3(default-clean)
[INFO] 
[INFO] --- maven-clean-plugin:2.3:clean (default-clean) @ woden-tests ---
mojoSucceeded org.apache.maven.plugins:maven-clean-plugin:2.3(default-clean)
mojoStarted org.apache.maven.plugins:maven-remote-resources-plugin:1.1(default)
[INFO] 
[INFO] --- maven-remote-resources-plugin:1.1:process (default) @ woden-tests ---
mojoSucceeded org.apache.maven.plugins:maven-remote-resources-plugin:1.1(default)
mojoStarted org.apache.maven.plugins:maven-resources-plugin:2.4(default-resources)
[INFO] 
[INFO] --- maven-resources-plugin:2.4:resources (default-resources) @ woden-tests ---
[INFO] Using 'UTF-8' encoding to copy filtered resources.
[INFO] Copying 1 resource
[INFO] Copying 3 resources
mojoSucceeded org.apache.maven.plugins:maven-resources-plugin:2.4(default-resources)
mojoStarted org.apache.maven.plugins:maven-compiler-plugin:2.0.2(default-compile)
[INFO] No sources to compile
[INFO] 
[INFO] --- maven-compiler-plugin:2.0.2:compile (default-compile) @ woden-tests ---
mojoSucceeded org.apache.maven.plugins:maven-compiler-plugin:2.0.2(default-compile)
mojoStarted org.apache.maven.plugins:maven-resources-plugin:2.4(default-testResources)[INFO]
Using 'UTF-8' encoding to copy filtered resources.

[INFO] [INFO] Copying 29 resources

[INFO] --- maven-resources-plugin:2.4:testResources (default-testResources) @ woden-tests
---
[INFO] Copying 3 resources
mojoSucceeded org.apache.maven.plugins:maven-resources-plugin:2.4(default-testResources)
mojoStarted org.apache.maven.plugins:maven-compiler-plugin:2.0.2(default-testCompile)
[INFO] 
[INFO] --- maven-compiler-plugin:2.0.2:testCompile (default-testCompile) @ woden-tests ---
[INFO] Compiling 71 source files to <https://builds.apache.org/job/woden-trunk/ws/woden/woden-tests/target/dom/test-classes>
mojoSucceeded org.apache.maven.plugins:maven-compiler-plugin:2.0.2(default-testCompile)
mojoStarted org.apache.maven.plugins:maven-surefire-plugin:2.4.3(default-test)
[INFO] 
[INFO] --- maven-surefire-plugin:2.4.3:test (default-test) @ woden-tests ---
[INFO] Surefire report directory: <https://builds.apache.org/job/woden-trunk/ws/woden/woden-tests/target/dom/surefire-reports>

-------------------------------------------------------
 T E S T S
-------------------------------------------------------
Running org.apache.woden.wsdl20.xml.InterfaceFaultElementTest
Tests run: 3, Failures: 0, Errors: 0, Skipped: 0, Time elapsed: 0.258 sec
Running org.apache.woden.resolver.SimpleURIResolverTest
Tests run: 4, Failures: 0, Errors: 0, Skipped: 0, Time elapsed: 3.46 sec
Running org.apache.woden.wsdl20.ElementDeclarationTest
Tests run: 4, Failures: 0, Errors: 0, Skipped: 0, Time elapsed: 0.004 sec
Running org.apache.woden.wsdl20.xml.ChildElementCreationTest
Tests run: 9, Failures: 0, Errors: 0, Skipped: 0, Time elapsed: 0.013 sec
Running org.apache.woden.wsdl20.extensions.http.HTTPBindingOperationExtensionsTest
Tests run: 8, Failures: 0, Errors: 0, Skipped: 0, Time elapsed: 0.529 sec
Running org.apache.woden.wsdl20.xml.BindingOperationElementTest
Tests run: 4, Failures: 0, Errors: 0, Skipped: 0, Time elapsed: 0.004 sec
Running org.apache.woden.wsdl20.extensions.soap.SOAPBindingFaultReferenceExtensionsTest
Tests run: 2, Failures: 0, Errors: 0, Skipped: 0, Time elapsed: 0.094 sec
Running org.apache.woden.internal.wsdl20.assertions.TestDescription1001
Tests run: 3, Failures: 1, Errors: 0, Skipped: 0, Time elapsed: 0.189 sec <<< FAILURE!
Running org.apache.woden.internal.wsdl20.assertions.TestInterface1010
Tests run: 5, Failures: 0, Errors: 0, Skipped: 0, Time elapsed: 0.013 sec
Running org.apache.woden.wsdl20.TypeDefinitionTest
Tests run: 4, Failures: 0, Errors: 0, Skipped: 0, Time elapsed: 0.003 sec
Running org.apache.woden.wsdl20.InterfaceTest
Tests run: 7, Failures: 0, Errors: 0, Skipped: 0, Time elapsed: 0.007 sec
Running org.apache.woden.wsdl20.extensions.soap.SOAPBindingExtensionsTest
Tests run: 5, Failures: 0, Errors: 0, Skipped: 0, Time elapsed: 0.191 sec
Running org.apache.woden.wsdl20.extensions.soap.SOAPBindingFaultExtensionsTest
Tests run: 8, Failures: 0, Errors: 0, Skipped: 0, Time elapsed: 0.229 sec
Running org.apache.woden.xml.IntOrTokenAttrTest
Tests run: 5, Failures: 0, Errors: 0, Skipped: 0, Time elapsed: 0.012 sec
Running org.apache.woden.wsdl20.extensions.soap.SOAPBindingMessageReferenceExtensionsTest
Tests run: 4, Failures: 0, Errors: 0, Skipped: 0, Time elapsed: 0.115 sec
Running org.apache.woden.internal.wsdl20.validation.WSDLDocumentValidatorTest
Tests run: 8, Failures: 0, Errors: 0, Skipped: 0, Time elapsed: 0.035 sec
Running org.apache.woden.wsdl20.BindingOperationTest
Tests run: 4, Failures: 0, Errors: 0, Skipped: 0, Time elapsed: 0.003 sec
Running org.apache.woden.wsdl20.extensions.http.HTTPLocationTemplateTest
Tests run: 5, Failures: 0, Errors: 0, Skipped: 0, Time elapsed: 0.003 sec
Running org.apache.woden.wsdl20.InterfaceOperationTest
Tests run: 6, Failures: 0, Errors: 0, Skipped: 0, Time elapsed: 0.005 sec
Running org.apache.woden.wsdl20.xml.BindingFaultElementTest
Tests run: 2, Failures: 0, Errors: 0, Skipped: 0, Time elapsed: 0.003 sec
Running org.apache.woden.tests.TestErrorHandler
Tests run: 0, Failures: 0, Errors: 0, Skipped: 0, Time elapsed: 0.001 sec
Running org.apache.woden.internal.wsdl20.validation.WSDLComponentValidatorTest
Tests run: 18, Failures: 0, Errors: 0, Skipped: 0, Time elapsed: 0.066 sec
Running org.apache.woden.wsdl20.xml.WSDLElementTest
Tests run: 3, Failures: 0, Errors: 0, Skipped: 0, Time elapsed: 0.004 sec
Running org.apache.woden.wsdl20.BindingMessageReferenceTest
Tests run: 2, Failures: 0, Errors: 0, Skipped: 0, Time elapsed: 0.002 sec
Running org.apache.woden.wsdl20.DescriptionTest
Tests run: 11, Failures: 0, Errors: 0, Skipped: 0, Time elapsed: 0.016 sec
Running org.apache.woden.wsdl20.extensions.http.HTTPBindingMessageReferenceExtensionsTest
Tests run: 2, Failures: 0, Errors: 0, Skipped: 0, Time elapsed: 0.055 sec
Running org.apache.woden.wsdl20.extensions.soap.SOAPBindingOperationExtensionsTest
Tests run: 4, Failures: 0, Errors: 0, Skipped: 0, Time elapsed: 0.106 sec
Running org.apache.woden.wsdl20.InterfaceMessageReferenceTest
Tests run: 5, Failures: 0, Errors: 0, Skipped: 0, Time elapsed: 0.005 sec
Running org.apache.woden.wsdl20.xml.NameAttributeTest
Tests run: 1, Failures: 0, Errors: 0, Skipped: 0, Time elapsed: 0.001 sec
Running org.apache.woden.wsdl20.extensions.http.HTTPEndpointExtensionsTest
Tests run: 2, Failures: 0, Errors: 0, Skipped: 0, Time elapsed: 0.053 sec
Running org.apache.woden.wsdl20.xml.EndpointElementTest
Tests run: 8, Failures: 0, Errors: 0, Skipped: 0, Time elapsed: 0.204 sec
Running org.apache.woden.wsdl20.xml.DocumentationElementTest
Tests run: 2, Failures: 0, Errors: 0, Skipped: 0, Time elapsed: 0.002 sec
Running org.apache.woden.wsdl20.BindingFaultReferenceTest
Tests run: 2, Failures: 0, Errors: 0, Skipped: 0, Time elapsed: 0.002 sec
Running org.apache.woden.wsdl20.EndpointTest
Tests run: 5, Failures: 0, Errors: 0, Skipped: 0, Time elapsed: 0.003 sec
Running org.apache.woden.internal.wsdl20.assertions.TestInterface1009
Tests run: 4, Failures: 0, Errors: 0, Skipped: 0, Time elapsed: 0.009 sec
Running org.apache.woden.wsdl20.xml.IncludeElementTest
Tests run: 2, Failures: 0, Errors: 0, Skipped: 0, Time elapsed: 0.002 sec
Running org.apache.woden.wsdl20.xml.BindingFaultReferenceElementTest
Tests run: 3, Failures: 0, Errors: 0, Skipped: 0, Time elapsed: 0.003 sec
Running org.apache.woden.wsdl20.extensions.http.HTTPBindingExtensionsTest
Tests run: 5, Failures: 0, Errors: 0, Skipped: 0, Time elapsed: 0.124 sec
Running org.apache.woden.wsdl20.extensions.ExtensionRegistryTest
Tests run: 2, Failures: 0, Errors: 0, Skipped: 0, Time elapsed: 0.007 sec
Running org.apache.woden.wsdl20.xml.InterfaceOperationElementTest
Tests run: 5, Failures: 0, Errors: 0, Skipped: 0, Time elapsed: 0.004 sec
Running org.apache.woden.wsdl20.BindingFaultTest
Tests run: 2, Failures: 0, Errors: 0, Skipped: 0, Time elapsed: 0.002 sec
Running org.apache.woden.wsdl20.xml.InterfaceFaultReferenceElementTest
Tests run: 4, Failures: 0, Errors: 0, Skipped: 0, Time elapsed: 0.003 sec
Running org.apache.woden.wsdl20.extensions.http.HTTPBindingFaultExtensionsTest
Tests run: 4, Failures: 0, Errors: 0, Skipped: 0, Time elapsed: 0.101 sec
Running org.apache.woden.WSDLFactoryTest
Tests run: 2, Failures: 0, Errors: 0, Skipped: 0, Time elapsed: 0.004 sec
Running org.apache.woden.wsdl20.InterfaceFaultTest
Tests run: 4, Failures: 0, Errors: 0, Skipped: 0, Time elapsed: 0.004 sec
Running org.apache.woden.wsdl20.xml.InterfaceMessageReferenceElementTest
Tests run: 4, Failures: 0, Errors: 0, Skipped: 0, Time elapsed: 0.003 sec
Running org.apache.woden.wsdl20.xml.BindingMessageReferenceElementTest
Tests run: 3, Failures: 0, Errors: 0, Skipped: 0, Time elapsed: 0.002 sec
Running testcase.extensions.foo.FooBindingExtensionsTest
Tests run: 2, Failures: 0, Errors: 0, Skipped: 0, Time elapsed: 0.051 sec
Running org.apache.woden.wsdl20.xml.TypesElementTest
Tests run: 5, Failures: 0, Errors: 0, Skipped: 0, Time elapsed: 0.004 sec
Running org.apache.woden.xml.TokenAttrTest
Tests run: 3, Failures: 0, Errors: 0, Skipped: 0, Time elapsed: 0.007 sec
Running org.apache.woden.wsdl20.xml.DescriptiontElementTest
Tests run: 9, Failures: 0, Errors: 0, Skipped: 0, Time elapsed: 0.005 sec
Running org.apache.woden.wsdl20.ServiceTest
Tests run: 4, Failures: 0, Errors: 0, Skipped: 0, Time elapsed: 0.003 sec
Running org.apache.woden.wsdl20.xml.ImportElementTest
Tests run: 5, Failures: 0, Errors: 0, Skipped: 0, Time elapsed: 0.003 sec
Running org.apache.woden.wsdl20.xml.ServiceElementTest
Tests run: 6, Failures: 0, Errors: 0, Skipped: 0, Time elapsed: 0.153 sec
Running org.apache.woden.wsdl20.extensions.http.HTTPLocationTest
Tests run: 16, Failures: 0, Errors: 0, Skipped: 0, Time elapsed: 0.01 sec
Running testcase.documentation.extension.DocExtensionNoNSTest
Tests run: 1, Failures: 0, Errors: 0, Skipped: 0, Time elapsed: 0.185 sec
Running org.apache.woden.wsdl20.InterfaceFaultReferenceTest
Tests run: 4, Failures: 0, Errors: 0, Skipped: 0, Time elapsed: 0.003 sec
Running org.apache.woden.wsdl20.fragids.FragmentIdentificationTest
Tests run: 1, Failures: 0, Errors: 0, Skipped: 0, Time elapsed: 0.038 sec
Running org.apache.woden.wsdl20.xml.BindingElementTest
Tests run: 6, Failures: 0, Errors: 0, Skipped: 0, Time elapsed: 0.004 sec
Running testcase.resolver.schemaloc.SchemaLocationTest
Tests run: 6, Failures: 0, Errors: 0, Skipped: 0, Time elapsed: 0.01 sec
Running org.apache.woden.wsdl20.BindingTest
Tests run: 6, Failures: 0, Errors: 0, Skipped: 0, Time elapsed: 0.004 sec
Running org.apache.woden.wsdl20.xml.InterfaceElementTest
Tests run: 6, Failures: 0, Errors: 0, Skipped: 0, Time elapsed: 0.004 sec

Results :

Failed tests: 
  testTargetNamespaceResolves(org.apache.woden.internal.wsdl20.assertions.TestDescription1001)

Tests run: 289, Failures: 1, Errors: 0, Skipped: 0

mojoFailed org.apache.maven.plugins:maven-surefire-plugin:2.4.3(default-test)
[JENKINS] Recording test results
projectFailed org.apache.woden:woden-tests:1.0-SNAPSHOT
sessionEnded
[INFO] ------------------------------------------------------------------------
[INFO] Reactor Summary:
[INFO] 
[INFO] Woden ............................................. SUCCESS [22.671s]
[INFO] Woden - Core ...................................... SUCCESS [19.941s]
[INFO] Woden - Tests ..................................... FAILURE [13.821s]
[INFO] Woden - Tool ...................................... SKIPPED
[INFO] Woden - converter Maven plugin .................... SKIPPED
[INFO] Woden - Ant ....................................... SKIPPED
[INFO] ------------------------------------------------------------------------
[INFO] BUILD FAILURE
[INFO] ------------------------------------------------------------------------
[INFO] Total time: 1:01.880s
[INFO] Finished at: Tue Oct 09 07:09:08 UTC 2012
[INFO] Final Memory: 20M/151M
[INFO] ------------------------------------------------------------------------
Projects to build: [MavenProject: org.apache.woden:woden:1.0-SNAPSHOT @ <https://builds.apache.org/job/woden-trunk/ws/woden/pom.xml,>
MavenProject: org.apache.woden:woden-core:1.0-SNAPSHOT @ <https://builds.apache.org/job/woden-trunk/ws/woden/woden-core/pom.xml,>
MavenProject: org.apache.woden:woden-tests:1.0-SNAPSHOT @ <https://builds.apache.org/job/woden-trunk/ws/woden/woden-tests/pom.xml,>
MavenProject: org.apache.woden:woden-tool:1.0-SNAPSHOT @ <https://builds.apache.org/job/woden-trunk/ws/woden/woden-tool/pom.xml,>
MavenProject: org.apache.woden:woden-converter-maven-plugin:1.0-SNAPSHOT @ <https://builds.apache.org/job/woden-trunk/ws/woden/woden-converter-maven-plugin/pom.xml,>
MavenProject: org.apache.woden:woden-ant:1.0-SNAPSHOT @ <https://builds.apache.org/job/woden-trunk/ws/woden/woden-ant/pom.xml]>
[JENKINS] Archiving <https://builds.apache.org/job/woden-trunk/ws/woden/woden-tests/pom.xml>
to /home/hudson/hudson/jobs/woden-trunk/modules/org.apache.woden$woden-tests/builds/2012-10-09_07-07-52/archive/org.apache.woden/woden-tests/1.0-SNAPSHOT/woden-tests-1.0-SNAPSHOT.pom
[JENKINS] Archiving <https://builds.apache.org/job/woden-trunk/ws/woden/woden-ant/pom.xml>
to /home/hudson/hudson/jobs/woden-trunk/modules/org.apache.woden$woden-ant/builds/2012-10-09_07-07-52/archive/org.apache.woden/woden-ant/1.0-SNAPSHOT/woden-ant-1.0-SNAPSHOT.pom
[JENKINS] Archiving <https://builds.apache.org/job/woden-trunk/ws/woden/pom.xml> to
/home/hudson/hudson/jobs/woden-trunk/modules/org.apache.woden$woden/builds/2012-10-09_07-07-52/archive/org.apache.woden/woden/1.0-SNAPSHOT/woden-1.0-SNAPSHOT.pom
[JENKINS] Archiving <https://builds.apache.org/job/woden-trunk/ws/woden/woden-converter-maven-plugin/pom.xml>
to /home/hudson/hudson/jobs/woden-trunk/modules/org.apache.woden$woden-converter-maven-plugin/builds/2012-10-09_07-07-52/archive/org.apache.woden/woden-converter-maven-plugin/1.0-SNAPSHOT/woden-converter-maven-plugin-1.0-SNAPSHOT.pom
[JENKINS] Archiving <https://builds.apache.org/job/woden-trunk/ws/woden/woden-core/pom.xml>
to /home/hudson/hudson/jobs/woden-trunk/modules/org.apache.woden$woden-core/builds/2012-10-09_07-07-52/archive/org.apache.woden/woden-core/1.0-SNAPSHOT/woden-core-1.0-SNAPSHOT.pom
[JENKINS] Archiving <https://builds.apache.org/job/woden-trunk/ws/woden/woden-core/target/woden-core-1.0-SNAPSHOT.jar>
to /home/hudson/hudson/jobs/woden-trunk/modules/org.apache.woden$woden-core/builds/2012-10-09_07-07-52/archive/org.apache.woden/woden-core/1.0-SNAPSHOT/woden-core-1.0-SNAPSHOT.jar
[JENKINS] Archiving <https://builds.apache.org/job/woden-trunk/ws/woden/woden-tool/pom.xml>
to /home/hudson/hudson/jobs/woden-trunk/modules/org.apache.woden$woden-tool/builds/2012-10-09_07-07-52/archive/org.apache.woden/woden-tool/1.0-SNAPSHOT/woden-tool-1.0-SNAPSHOT.pom
Waiting for Jenkins to finish collecting data
mavenExecutionResult exceptions not empty
message : Failed to execute goal org.apache.maven.plugins:maven-surefire-plugin:2.4.3:test
(default-test) on project woden-tests: There are test failures.

Please refer to <https://builds.apache.org/job/woden-trunk/ws/woden/woden-tests/target/dom/surefire-reports>
for the individual test results.
cause : There are test failures.

Please refer to <https://builds.apache.org/job/woden-trunk/ws/woden/woden-tests/target/dom/surefire-reports>
for the individual test results.
Stack trace : 
org.apache.maven.lifecycle.LifecycleExecutionException: Failed to execute goal org.apache.maven.plugins:maven-surefire-plugin:2.4.3:test
(default-test) on project woden-tests: There are test failures.

Please refer to <https://builds.apache.org/job/woden-trunk/ws/woden/woden-tests/target/dom/surefire-reports>
for the individual test results.
	at org.apache.maven.lifecycle.internal.MojoExecutor.execute(MojoExecutor.java:213)
	at org.apache.maven.lifecycle.internal.MojoExecutor.execute(MojoExecutor.java:153)
	at org.apache.maven.lifecycle.internal.MojoExecutor.execute(MojoExecutor.java:145)
	at org.apache.maven.lifecycle.internal.LifecycleModuleBuilder.buildProject(LifecycleModuleBuilder.java:84)
	at org.apache.maven.lifecycle.internal.LifecycleModuleBuilder.buildProject(LifecycleModuleBuilder.java:59)
	at org.apache.maven.lifecycle.internal.LifecycleStarter.singleThreadedBuild(LifecycleStarter.java:183)
	at org.apache.maven.lifecycle.internal.LifecycleStarter.execute(LifecycleStarter.java:161)
	at org.apache.maven.DefaultMaven.doExecute(DefaultMaven.java:319)
	at org.apache.maven.DefaultMaven.execute(DefaultMaven.java:156)
	at org.jvnet.hudson.maven3.launcher.Maven3Launcher.main(Maven3Launcher.java:79)
	at sun.reflect.NativeMethodAccessorImpl.invoke0(Native Method)
	at sun.reflect.NativeMethodAccessorImpl.invoke(NativeMethodAccessorImpl.java:39)
	at sun.reflect.DelegatingMethodAccessorImpl.invoke(DelegatingMethodAccessorImpl.java:25)
	at java.lang.reflect.Method.invoke(Method.java:592)
	at org.codehaus.plexus.classworlds.launcher.Launcher.launchStandard(Launcher.java:329)
	at org.codehaus.plexus.classworlds.launcher.Launcher.launch(Launcher.java:239)
	at org.jvnet.hudson.maven3.agent.Maven3Main.launch(Maven3Main.java:158)
	at hudson.maven.Maven3Builder.call(Maven3Builder.java:98)
	at hudson.maven.Maven3Builder.call(Maven3Builder.java:64)
	at hudson.remoting.UserRequest.perform(UserRequest.java:118)
	at hudson.remoting.UserRequest.perform(UserRequest.java:48)
	at hudson.remoting.Request$2.run(Request.java:326)
	at hudson.remoting.InterceptingExecutorService$1.call(InterceptingExecutorService.java:72)
	at java.util.concurrent.FutureTask$Sync.innerRun(FutureTask.java:269)
	at java.util.concurrent.FutureTask.run(FutureTask.java:123)
	at java.util.concurrent.ThreadPoolExecutor$Worker.runTask(ThreadPoolExecutor.java:651)
	at java.util.concurrent.ThreadPoolExecutor$Worker.run(ThreadPoolExecutor.java:676)
	at java.lang.Thread.run(Thread.java:595)
Caused by: org.apache.maven.plugin.MojoFailureException: There are test failures.

Please refer to <https://builds.apache.org/job/woden-trunk/ws/woden/woden-tests/target/dom/surefire-reports>
for the individual test results.
	at org.apache.maven.plugin.surefire.SurefirePlugin.execute(SurefirePlugin.java:575)
	at org.apache.maven.plugin.DefaultBuildPluginManager.executeMojo(DefaultBuildPluginManager.java:101)
	at org.apache.maven.lifecycle.internal.MojoExecutor.execute(MojoExecutor.java:209)
	... 27 more
channel stopped

---------------------------------------------------------------------
To unsubscribe, e-mail: dev-unsubscribe@ws.apache.org
For additional commands, e-mail: dev-help@ws.apache.org


Mime
View raw message