ws-dev mailing list archives

Site index · List index
Message view « Date » · « Thread »
Top « Date » · « Thread »
From Apache Jenkins Server <jenk...@builds.apache.org>
Subject Build failed in Jenkins: ws-axiom-trunk #1315
Date Sun, 30 Dec 2012 22:13:40 GMT
See <https://builds.apache.org/job/ws-axiom-trunk/1315/changes>

Changes:

[veithen] Added automatic code coverage reporting based on Jacoco.

------------------------------------------
[...truncated 162 lines...]
Downloading: http://repo.maven.apache.org/maven2/org/jacoco/org.jacoco.core/0.6.1.201212231917/org.jacoco.core-0.6.1.201212231917.jar
Downloaded: http://repo.maven.apache.org/maven2/org/apache/maven/doxia/doxia-decoration-model/1.1.2/doxia-decoration-model-1.1.2.jar
(52 KB at 452.0 KB/sec)
Downloading: http://repo.maven.apache.org/maven2/org/ow2/asm/asm-all/4.1/asm-all-4.1.jar
Downloaded: http://repo.maven.apache.org/maven2/org/apache/maven/doxia/doxia-module-fml/1.1.2/doxia-module-fml-1.1.2.jar
(37 KB at 521.7 KB/sec)
Downloading: http://repo.maven.apache.org/maven2/org/jacoco/org.jacoco.report/0.6.1.201212231917/org.jacoco.report-0.6.1.201212231917.jar
Downloaded: http://repo.maven.apache.org/maven2/org/ow2/asm/asm-all/4.1/asm-all-4.1.jar (210
KB at 1496.9 KB/sec)
Downloaded: http://repo.maven.apache.org/maven2/org/apache/maven/doxia/doxia-site-renderer/1.1.2/doxia-site-renderer-1.1.2.jar
(50 KB at 145.3 KB/sec)
Downloaded: http://repo.maven.apache.org/maven2/org/jacoco/org.jacoco.agent/0.6.1.201212231917/org.jacoco.agent-0.6.1.201212231917-runtime.jar
(182 KB at 493.2 KB/sec)
Downloaded: http://repo.maven.apache.org/maven2/org/jacoco/org.jacoco.core/0.6.1.201212231917/org.jacoco.core-0.6.1.201212231917.jar
(124 KB at 183.8 KB/sec)
Downloaded: http://repo.maven.apache.org/maven2/org/jacoco/org.jacoco.report/0.6.1.201212231917/org.jacoco.report-0.6.1.201212231917.jar
(125 KB at 186.8 KB/sec)
[INFO] Skipping JaCoCo for project with packaging type 'pom'
[INFO] argLine set to 
mojoSucceeded org.jacoco:jacoco-maven-plugin:0.6.1.201212231917(default)
mojoStarted org.apache.maven.plugins:maven-remote-resources-plugin:1.1(default)
[INFO] 
[INFO] --- maven-remote-resources-plugin:1.1:process (default) @ axiom ---
[INFO] Setting property: classpath.resource.loader.class => 'org.codehaus.plexus.velocity.ContextClassLoaderResourceLoader'.
[INFO] Setting property: velocimacro.messages.on => 'false'.
[INFO] Setting property: resource.loader => 'classpath'.
[INFO] Setting property: resource.manager.logwhenfound => 'false'.
mojoSucceeded org.apache.maven.plugins:maven-remote-resources-plugin:1.1(default)
mojoStarted org.codehaus.mojo:build-helper-maven-plugin:1.5(attach-jacoco-exec)
[INFO] 
[INFO] --- build-helper-maven-plugin:1.5:attach-artifact (attach-jacoco-exec) @ axiom ---
mojoSucceeded org.codehaus.mojo:build-helper-maven-plugin:1.5(attach-jacoco-exec)
mojoStarted org.apache.maven.plugins:maven-assembly-plugin:2.2-beta-5(source-release-assembly)
[INFO] 
[INFO] --- maven-assembly-plugin:2.2-beta-5:single (source-release-assembly) @ axiom ---
[INFO] axiom-1.2.15-SNAPSHOT/ already added, skipping
[INFO] axiom-1.2.15-SNAPSHOT/NOTICE already added, skipping
[INFO] Building zip: <https://builds.apache.org/job/ws-axiom-trunk/ws/axiom/target/axiom-1.2.15-SNAPSHOT-source-release.zip>
[INFO] axiom-1.2.15-SNAPSHOT/ already added, skipping
[INFO] axiom-1.2.15-SNAPSHOT/NOTICE already added, skipping
mojoSucceeded org.apache.maven.plugins:maven-assembly-plugin:2.2-beta-5(source-release-assembly)
forkedProjectStarted org.apache.ws.commons.axiom:axiom:1.2.15-SNAPSHOT
mojoStarted org.apache.maven.plugins:maven-enforcer-plugin:1.1(default)
[INFO] 
[INFO] --- maven-enforcer-plugin:1.1:enforce (default) @ axiom ---
mojoSucceeded org.apache.maven.plugins:maven-enforcer-plugin:1.1(default)
mojoStarted org.jacoco:jacoco-maven-plugin:0.6.1.201212231917(default)[INFO] Skipping JaCoCo
for project with packaging type 'pom'
[INFO] argLine set to  

[INFO] 
[INFO] --- jacoco-maven-plugin:0.6.1.201212231917:prepare-agent (default) @ axiom ---
mojoSucceeded org.jacoco:jacoco-maven-plugin:0.6.1.201212231917(default)
Dec 30, 2012 10:11:37 PM hudson.maven.ExecutedMojo <init>
forkedProjectSucceeded org.apache.ws.commons.axiom:axiom:1.2.15-SNAPSHOTWARNING: Failed to
getClass for org.apache.maven.plugin.source.SourceJarMojo

mojoStarted org.apache.maven.plugins:maven-source-plugin:2.1.2(attach-sources)
[INFO] 
[INFO] --- maven-source-plugin:2.1.2:jar (attach-sources) @ axiom ---
mojoSucceeded org.apache.maven.plugins:maven-source-plugin:2.1.2(attach-sources)
mojoStarted org.apache.maven.plugins:maven-javadoc-plugin:2.5(attach-javadocs)
[INFO] 
[INFO] --- maven-javadoc-plugin:2.5:jar (attach-javadocs) @ axiom ---
[INFO] Not executing Javadoc as the project is not a Java classpath-capable package
mojoSucceeded org.apache.maven.plugins:maven-javadoc-plugin:2.5(attach-javadocs)
mojoStarted org.apache.maven.plugins:maven-gpg-plugin:1.1(default)
[INFO] 
[INFO] --- maven-gpg-plugin:1.1:sign (default) @ axiom ---
mojoSucceeded org.apache.maven.plugins:maven-gpg-plugin:1.1(default)
mojoStarted org.apache.rat:apache-rat-plugin:0.8(default)
[INFO] 
[INFO] --- apache-rat-plugin:0.8:check (default) @ axiom ---
[INFO] Exclude: RELEASE-NOTE.txt
[INFO] Exclude: **/*.svg
[INFO] Exclude: legal/jaxen-LICENSE.txt
[INFO] Exclude: legal/stax2-api-LICENSE.txt
[INFO] Exclude: *.sonarj
[INFO] Exclude: release.properties
[INFO] Exclude: src/test/resources/**
[INFO] Exclude: dependency-reduced-pom.xml
mojoSucceeded org.apache.rat:apache-rat-plugin:0.8(default)
mojoStarted org.apache.maven.plugins:maven-install-plugin:2.3.1(default-install)[INFO] Installing
<https://builds.apache.org/job/ws-axiom-trunk/ws/axiom/pom.xml> to <https://builds.apache.org/job/ws-axiom-trunk/ws/.repository/org/apache/ws/commons/axiom/axiom/1.2.15-SNAPSHOT/axiom-1.2.15-SNAPSHOT.pom>

[INFO] Installing <https://builds.apache.org/job/ws-axiom-trunk/ws/axiom/target/jacoco.exec>
to <https://builds.apache.org/job/ws-axiom-trunk/ws/.repository/org/apache/ws/commons/axiom/axiom/1.2.15-SNAPSHOT/axiom-1.2.15-SNAPSHOT-jacoco.exec>
[INFO] [INFO] Installing <https://builds.apache.org/job/ws-axiom-trunk/ws/axiom/target/axiom-1.2.15-SNAPSHOT-source-release.zip>
to <https://builds.apache.org/job/ws-axiom-trunk/ws/.repository/org/apache/ws/commons/axiom/axiom/1.2.15-SNAPSHOT/axiom-1.2.15-SNAPSHOT-source-release.zip>

[INFO] --- maven-install-plugin:2.3.1:install (default-install) @ axiom ---
mojoSucceeded org.apache.maven.plugins:maven-install-plugin:2.3.1(default-install)
mojoStarted org.apache.maven.plugins:maven-deploy-plugin:2.5(default-deploy)Downloading: https://repository.apache.org/content/repositories/snapshots/org/apache/ws/commons/axiom/axiom/1.2.15-SNAPSHOT/maven-metadata.xml

[INFO] 
[INFO] --- maven-deploy-plugin:2.5:deploy (default-deploy) @ axiom ---
Downloaded: https://repository.apache.org/content/repositories/snapshots/org/apache/ws/commons/axiom/axiom/1.2.15-SNAPSHOT/maven-metadata.xml
(836 B at 2.0 KB/sec)
Uploading: https://repository.apache.org/content/repositories/snapshots/org/apache/ws/commons/axiom/axiom/1.2.15-SNAPSHOT/axiom-1.2.15-20121230.221143-30.pom
Uploaded: https://repository.apache.org/content/repositories/snapshots/org/apache/ws/commons/axiom/axiom/1.2.15-SNAPSHOT/axiom-1.2.15-20121230.221143-30.pom
(30 KB at 86.9 KB/sec)
Downloading: https://repository.apache.org/content/repositories/snapshots/org/apache/ws/commons/axiom/axiom/maven-metadata.xml
Downloaded: https://repository.apache.org/content/repositories/snapshots/org/apache/ws/commons/axiom/axiom/maven-metadata.xml
(354 B at 1.6 KB/sec)
Uploading: https://repository.apache.org/content/repositories/snapshots/org/apache/ws/commons/axiom/axiom/1.2.15-SNAPSHOT/maven-metadata.xml
Uploaded: https://repository.apache.org/content/repositories/snapshots/org/apache/ws/commons/axiom/axiom/1.2.15-SNAPSHOT/maven-metadata.xml
(836 B at 2.8 KB/sec)
Uploading: https://repository.apache.org/content/repositories/snapshots/org/apache/ws/commons/axiom/axiom/maven-metadata.xml
Uploaded: https://repository.apache.org/content/repositories/snapshots/org/apache/ws/commons/axiom/axiom/maven-metadata.xml
(354 B at 0.9 KB/sec)
Uploading: https://repository.apache.org/content/repositories/snapshots/org/apache/ws/commons/axiom/axiom/1.2.15-SNAPSHOT/axiom-1.2.15-20121230.221143-30-jacoco.exec
Dec 30, 2012 10:11:44 PM org.apache.maven.wagon.providers.http.httpclient.impl.client.DefaultRequestDirector
tryExecute
INFO: I/O exception (java.io.FileNotFoundException) caught when processing request: <https://builds.apache.org/job/ws-axiom-trunk/ws/axiom/target/jacoco.exec>
(No such file or directory)
Dec 30, 2012 10:11:44 PM org.apache.maven.wagon.providers.http.httpclient.impl.client.DefaultRequestDirector
tryExecute
INFO: Retrying request
mojoFailed org.apache.maven.plugins:maven-deploy-plugin:2.5(default-deploy)
projectFailed org.apache.ws.commons.axiom:axiom:1.2.15-SNAPSHOT
sessionEnded
[INFO] ------------------------------------------------------------------------
[INFO] Reactor Summary:
[INFO] 
[INFO] Axiom ............................................. FAILURE [50.989s]
[INFO] Axiom Build Utilities ............................. SKIPPED
[INFO] Axiom Test Utilities .............................. SKIPPED
[INFO] Axiom Jaxen Test Suite ............................ SKIPPED
[INFO] Axiom DOM Test Suite .............................. SKIPPED
[INFO] Axiom API ......................................... SKIPPED
[INFO] Axiom Implementation Test Suite ................... SKIPPED
[INFO] Axiom Common Implementation Classes ............... SKIPPED
[INFO] Axiom Common Implementation Test Suite ............ SKIPPED
[INFO] Axiom Impl ........................................ SKIPPED
[INFO] Axiom DOM ......................................... SKIPPED
[INFO] Axiom Compatibility Classes ....................... SKIPPED
[INFO] Axiom JAXB Integration ............................ SKIPPED
[INFO] Axiom C14N ........................................ SKIPPED
[INFO] Axiom Test Suite .................................. SKIPPED
[INFO] Axiom OSGi Tests .................................. SKIPPED
[INFO] Axiom Integration Test Suite ...................... SKIPPED
[INFO] Axiom Uber-JAR .................................... SKIPPED
[INFO] Axiom Samples ..................................... SKIPPED
[INFO] Developer Guide ................................... SKIPPED
[INFO] User Guide ........................................ SKIPPED
[INFO] Javadoc ........................................... SKIPPED
[INFO] Distribution ...................................... SKIPPED
[INFO] Code Coverage Report .............................. SKIPPED
[INFO] ------------------------------------------------------------------------
[INFO] BUILD FAILURE
[INFO] ------------------------------------------------------------------------
[INFO] Total time: 54.466s
[INFO] Finished at: Sun Dec 30 22:11:44 UTC 2012
[INFO] Final Memory: 20M/140M
[INFO] ------------------------------------------------------------------------
Projects to build: [MavenProject: org.apache.ws.commons.axiom:axiom:1.2.15-SNAPSHOT @ <https://builds.apache.org/job/ws-axiom-trunk/ws/axiom/pom.xml,>
MavenProject: org.apache.ws.commons.axiom:axiom-buildutils:1.2.15-SNAPSHOT @ <https://builds.apache.org/job/ws-axiom-trunk/ws/axiom/modules/axiom-buildutils/pom.xml,>
MavenProject: org.apache.ws.commons.axiom:axiom-testutils:1.2.15-SNAPSHOT @ <https://builds.apache.org/job/ws-axiom-trunk/ws/axiom/modules/axiom-testutils/pom.xml,>
MavenProject: org.apache.ws.commons.axiom:axiom-jaxen-testsuite:1.2.15-SNAPSHOT @ <https://builds.apache.org/job/ws-axiom-trunk/ws/axiom/modules/axiom-jaxen-testsuite/pom.xml,>
MavenProject: org.apache.ws.commons.axiom:axiom-dom-testsuite:1.2.15-SNAPSHOT @ <https://builds.apache.org/job/ws-axiom-trunk/ws/axiom/modules/axiom-dom-testsuite/pom.xml,>
MavenProject: org.apache.ws.commons.axiom:axiom-api:1.2.15-SNAPSHOT @ <https://builds.apache.org/job/ws-axiom-trunk/ws/axiom/modules/axiom-api/pom.xml,>
MavenProject: org.apache.ws.commons.axiom:axiom-testsuite:1.2.15-SNAPSHOT @ <https://builds.apache.org/job/ws-axiom-trunk/ws/axiom/modules/axiom-testsuite/pom.xml,>
MavenProject: org.apache.ws.commons.axiom:axiom-common-impl:1.2.15-SNAPSHOT @ <https://builds.apache.org/job/ws-axiom-trunk/ws/axiom/modules/axiom-common-impl/pom.xml,>
MavenProject: org.apache.ws.commons.axiom:axiom-common-impl-testsuite:1.2.15-SNAPSHOT @ <https://builds.apache.org/job/ws-axiom-trunk/ws/axiom/modules/axiom-common-impl-testsuite/pom.xml,>
MavenProject: org.apache.ws.commons.axiom:axiom-impl:1.2.15-SNAPSHOT @ <https://builds.apache.org/job/ws-axiom-trunk/ws/axiom/modules/axiom-impl/pom.xml,>
MavenProject: org.apache.ws.commons.axiom:axiom-dom:1.2.15-SNAPSHOT @ <https://builds.apache.org/job/ws-axiom-trunk/ws/axiom/modules/axiom-dom/pom.xml,>
MavenProject: org.apache.ws.commons.axiom:axiom-compat:1.2.15-SNAPSHOT @ <https://builds.apache.org/job/ws-axiom-trunk/ws/axiom/modules/axiom-compat/pom.xml,>
MavenProject: org.apache.ws.commons.axiom:axiom-jaxb:1.2.15-SNAPSHOT @ <https://builds.apache.org/job/ws-axiom-trunk/ws/axiom/modules/axiom-jaxb/pom.xml,>
MavenProject: org.apache.ws.commons.axiom:axiom-c14n:1.2.15-SNAPSHOT @ <https://builds.apache.org/job/ws-axiom-trunk/ws/axiom/modules/axiom-c14n/pom.xml,>
MavenProject: org.apache.ws.commons.axiom:axiom-tests:1.2.15-SNAPSHOT @ <https://builds.apache.org/job/ws-axiom-trunk/ws/axiom/modules/axiom-tests/pom.xml,>
MavenProject: org.apache.ws.commons.axiom:axiom-osgi-tests:1.2.15-SNAPSHOT @ <https://builds.apache.org/job/ws-axiom-trunk/ws/axiom/modules/axiom-osgi-tests/pom.xml,>
MavenProject: org.apache.ws.commons.axiom:axiom-integration:1.2.15-SNAPSHOT @ <https://builds.apache.org/job/ws-axiom-trunk/ws/axiom/modules/axiom-integration/pom.xml,>
MavenProject: org.apache.ws.commons.axiom:axiom-all:1.2.15-SNAPSHOT @ <https://builds.apache.org/job/ws-axiom-trunk/ws/axiom/modules/axiom-all/pom.xml,>
MavenProject: org.apache.ws.commons.axiom:axiom-samples:1.2.15-SNAPSHOT @ <https://builds.apache.org/job/ws-axiom-trunk/ws/axiom/modules/axiom-samples/pom.xml,>
MavenProject: org.apache.ws.commons.axiom:devguide:1.2.15-SNAPSHOT @ <https://builds.apache.org/job/ws-axiom-trunk/ws/axiom/devguide/pom.xml,>
MavenProject: org.apache.ws.commons.axiom:userguide:1.2.15-SNAPSHOT @ <https://builds.apache.org/job/ws-axiom-trunk/ws/axiom/userguide/pom.xml,>
MavenProject: org.apache.ws.commons.axiom:apidocs:1.2.15-SNAPSHOT @ <https://builds.apache.org/job/ws-axiom-trunk/ws/axiom/apidocs/pom.xml,>
MavenProject: org.apache.ws.commons.axiom:distribution:1.2.15-SNAPSHOT @ <https://builds.apache.org/job/ws-axiom-trunk/ws/axiom/distribution/pom.xml,>
MavenProject: org.apache.ws.commons.axiom:code-coverage:1.2.15-SNAPSHOT @ <https://builds.apache.org/job/ws-axiom-trunk/ws/axiom/code-coverage/pom.xml]>
[JENKINS] Archiving <https://builds.apache.org/job/ws-axiom-trunk/ws/axiom/modules/axiom-impl/pom.xml>
to /home/hudson/hudson/jobs/ws-axiom-trunk/modules/org.apache.ws.commons.axiom$axiom-impl/builds/2012-12-30_22-10-35/archive/org.apache.ws.commons.axiom/axiom-impl/1.2.15-SNAPSHOT/axiom-impl-1.2.15-SNAPSHOT.pom
[JENKINS] Archiving <https://builds.apache.org/job/ws-axiom-trunk/ws/axiom/apidocs/pom.xml>
to /home/hudson/hudson/jobs/ws-axiom-trunk/modules/org.apache.ws.commons.axiom$apidocs/builds/2012-12-30_22-10-36/archive/org.apache.ws.commons.axiom/apidocs/1.2.15-SNAPSHOT/apidocs-1.2.15-SNAPSHOT.pom
[JENKINS] Archiving <https://builds.apache.org/job/ws-axiom-trunk/ws/axiom/modules/axiom-jaxb/pom.xml>
to /home/hudson/hudson/jobs/ws-axiom-trunk/modules/org.apache.ws.commons.axiom$axiom-jaxb/builds/2012-12-30_22-10-36/archive/org.apache.ws.commons.axiom/axiom-jaxb/1.2.15-SNAPSHOT/axiom-jaxb-1.2.15-SNAPSHOT.pom
[JENKINS] Archiving <https://builds.apache.org/job/ws-axiom-trunk/ws/axiom/modules/axiom-common-impl/pom.xml>
to /home/hudson/hudson/jobs/ws-axiom-trunk/modules/org.apache.ws.commons.axiom$axiom-common-impl/builds/2012-12-30_22-10-35/archive/org.apache.ws.commons.axiom/axiom-common-impl/1.2.15-SNAPSHOT/axiom-common-impl-1.2.15-SNAPSHOT.pom
[JENKINS] Archiving <https://builds.apache.org/job/ws-axiom-trunk/ws/axiom/modules/axiom-buildutils/pom.xml>
to /home/hudson/hudson/jobs/ws-axiom-trunk/modules/org.apache.ws.commons.axiom$axiom-buildutils/builds/2012-12-30_22-10-34/archive/org.apache.ws.commons.axiom/axiom-buildutils/1.2.15-SNAPSHOT/axiom-buildutils-1.2.15-SNAPSHOT.pom
[JENKINS] Archiving <https://builds.apache.org/job/ws-axiom-trunk/ws/axiom/modules/axiom-tests/pom.xml>
to /home/hudson/hudson/jobs/ws-axiom-trunk/modules/org.apache.ws.commons.axiom$axiom-tests/builds/2012-12-30_22-10-36/archive/org.apache.ws.commons.axiom/axiom-tests/1.2.15-SNAPSHOT/axiom-tests-1.2.15-SNAPSHOT.pom
[JENKINS] Archiving <https://builds.apache.org/job/ws-axiom-trunk/ws/axiom/modules/axiom-jaxen-testsuite/pom.xml>
to /home/hudson/hudson/jobs/ws-axiom-trunk/modules/org.apache.ws.commons.axiom$axiom-jaxen-testsuite/builds/2012-12-30_22-10-34/archive/org.apache.ws.commons.axiom/axiom-jaxen-testsuite/1.2.15-SNAPSHOT/axiom-jaxen-testsuite-1.2.15-SNAPSHOT.pom
[JENKINS] Archiving <https://builds.apache.org/job/ws-axiom-trunk/ws/axiom/modules/axiom-testutils/pom.xml>
to /home/hudson/hudson/jobs/ws-axiom-trunk/modules/org.apache.ws.commons.axiom$axiom-testutils/builds/2012-12-30_22-10-34/archive/org.apache.ws.commons.axiom/axiom-testutils/1.2.15-SNAPSHOT/axiom-testutils-1.2.15-SNAPSHOT.pom
[JENKINS] Archiving <https://builds.apache.org/job/ws-axiom-trunk/ws/axiom/modules/axiom-api/pom.xml>
to /home/hudson/hudson/jobs/ws-axiom-trunk/modules/org.apache.ws.commons.axiom$axiom-api/builds/2012-12-30_22-10-35/archive/org.apache.ws.commons.axiom/axiom-api/1.2.15-SNAPSHOT/axiom-api-1.2.15-SNAPSHOT.pom
[JENKINS] Archiving <https://builds.apache.org/job/ws-axiom-trunk/ws/axiom/modules/axiom-samples/pom.xml>
to /home/hudson/hudson/jobs/ws-axiom-trunk/modules/org.apache.ws.commons.axiom$axiom-samples/builds/2012-12-30_22-10-36/archive/org.apache.ws.commons.axiom/axiom-samples/1.2.15-SNAPSHOT/axiom-samples-1.2.15-SNAPSHOT.pom
[JENKINS] Archiving <https://builds.apache.org/job/ws-axiom-trunk/ws/axiom/modules/axiom-all/pom.xml>
to /home/hudson/hudson/jobs/ws-axiom-trunk/modules/org.apache.ws.commons.axiom$axiom-all/builds/2012-12-30_22-10-36/archive/org.apache.ws.commons.axiom/axiom-all/1.2.15-SNAPSHOT/axiom-all-1.2.15-SNAPSHOT.pom
[JENKINS] Archiving <https://builds.apache.org/job/ws-axiom-trunk/ws/axiom/modules/axiom-dom/pom.xml>
to /home/hudson/hudson/jobs/ws-axiom-trunk/modules/org.apache.ws.commons.axiom$axiom-dom/builds/2012-12-30_22-10-35/archive/org.apache.ws.commons.axiom/axiom-dom/1.2.15-SNAPSHOT/axiom-dom-1.2.15-SNAPSHOT.pom
[JENKINS] Archiving <https://builds.apache.org/job/ws-axiom-trunk/ws/axiom/modules/axiom-dom-testsuite/pom.xml>
to /home/hudson/hudson/jobs/ws-axiom-trunk/modules/org.apache.ws.commons.axiom$axiom-dom-testsuite/builds/2012-12-30_22-10-34/archive/org.apache.ws.commons.axiom/axiom-dom-testsuite/1.2.15-SNAPSHOT/axiom-dom-testsuite-1.2.15-SNAPSHOT.pom
[JENKINS] Archiving <https://builds.apache.org/job/ws-axiom-trunk/ws/axiom/modules/axiom-testsuite/pom.xml>
to /home/hudson/hudson/jobs/ws-axiom-trunk/modules/org.apache.ws.commons.axiom$axiom-testsuite/builds/2012-12-30_22-10-35/archive/org.apache.ws.commons.axiom/axiom-testsuite/1.2.15-SNAPSHOT/axiom-testsuite-1.2.15-SNAPSHOT.pom
[JENKINS] Archiving <https://builds.apache.org/job/ws-axiom-trunk/ws/axiom/modules/axiom-c14n/pom.xml>
to /home/hudson/hudson/jobs/ws-axiom-trunk/modules/org.apache.ws.commons.axiom$axiom-c14n/builds/2012-12-30_22-10-36/archive/org.apache.ws.commons.axiom/axiom-c14n/1.2.15-SNAPSHOT/axiom-c14n-1.2.15-SNAPSHOT.pom
[JENKINS] Archiving <https://builds.apache.org/job/ws-axiom-trunk/ws/axiom/pom.xml>
to /home/hudson/hudson/jobs/ws-axiom-trunk/modules/org.apache.ws.commons.axiom$axiom/builds/2012-12-30_22-10-34/archive/org.apache.ws.commons.axiom/axiom/1.2.15-SNAPSHOT/axiom-1.2.15-SNAPSHOT.pom
[JENKINS] Archiving <https://builds.apache.org/job/ws-axiom-trunk/ws/axiom/target/axiom-1.2.15-SNAPSHOT-source-release.zip>
to /home/hudson/hudson/jobs/ws-axiom-trunk/modules/org.apache.ws.commons.axiom$axiom/builds/2012-12-30_22-10-34/archive/org.apache.ws.commons.axiom/axiom/1.2.15-20121230.221143-30/axiom-1.2.15-20121230.221143-30-source-release.zip
[JENKINS] Archiving <https://builds.apache.org/job/ws-axiom-trunk/ws/axiom/modules/axiom-common-impl-testsuite/pom.xml>
to /home/hudson/hudson/jobs/ws-axiom-trunk/modules/org.apache.ws.commons.axiom$axiom-common-impl-testsuite/builds/2012-12-30_22-10-35/archive/org.apache.ws.commons.axiom/axiom-common-impl-testsuite/1.2.15-SNAPSHOT/axiom-common-impl-testsuite-1.2.15-SNAPSHOT.pom
[JENKINS] Archiving <https://builds.apache.org/job/ws-axiom-trunk/ws/axiom/userguide/pom.xml>
to /home/hudson/hudson/jobs/ws-axiom-trunk/modules/org.apache.ws.commons.axiom$userguide/builds/2012-12-30_22-10-36/archive/org.apache.ws.commons.axiom/userguide/1.2.15-SNAPSHOT/userguide-1.2.15-SNAPSHOT.pom
[JENKINS] Archiving <https://builds.apache.org/job/ws-axiom-trunk/ws/axiom/modules/axiom-compat/pom.xml>
to /home/hudson/hudson/jobs/ws-axiom-trunk/modules/org.apache.ws.commons.axiom$axiom-compat/builds/2012-12-30_22-10-35/archive/org.apache.ws.commons.axiom/axiom-compat/1.2.15-SNAPSHOT/axiom-compat-1.2.15-SNAPSHOT.pom
[JENKINS] Archiving <https://builds.apache.org/job/ws-axiom-trunk/ws/axiom/code-coverage/pom.xml>
to /home/hudson/hudson/jobs/ws-axiom-trunk/modules/org.apache.ws.commons.axiom$code-coverage/builds/2012-12-30_22-10-37/archive/org.apache.ws.commons.axiom/code-coverage/1.2.15-SNAPSHOT/code-coverage-1.2.15-SNAPSHOT.pom
[JENKINS] Archiving <https://builds.apache.org/job/ws-axiom-trunk/ws/axiom/distribution/pom.xml>
to /home/hudson/hudson/jobs/ws-axiom-trunk/modules/org.apache.ws.commons.axiom$distribution/builds/2012-12-30_22-10-37/archive/org.apache.ws.commons.axiom/distribution/1.2.15-SNAPSHOT/distribution-1.2.15-SNAPSHOT.pom
[JENKINS] Archiving <https://builds.apache.org/job/ws-axiom-trunk/ws/axiom/modules/axiom-osgi-tests/pom.xml>
to /home/hudson/hudson/jobs/ws-axiom-trunk/modules/org.apache.ws.commons.axiom$axiom-osgi-tests/builds/2012-12-30_22-10-36/archive/org.apache.ws.commons.axiom/axiom-osgi-tests/1.2.15-SNAPSHOT/axiom-osgi-tests-1.2.15-SNAPSHOT.pom
[JENKINS] Archiving <https://builds.apache.org/job/ws-axiom-trunk/ws/axiom/devguide/pom.xml>
to /home/hudson/hudson/jobs/ws-axiom-trunk/modules/org.apache.ws.commons.axiom$devguide/builds/2012-12-30_22-10-36/archive/org.apache.ws.commons.axiom/devguide/1.2.15-SNAPSHOT/devguide-1.2.15-SNAPSHOT.pom
[JENKINS] Archiving <https://builds.apache.org/job/ws-axiom-trunk/ws/axiom/modules/axiom-integration/pom.xml>
to /home/hudson/hudson/jobs/ws-axiom-trunk/modules/org.apache.ws.commons.axiom$axiom-integration/builds/2012-12-30_22-10-36/archive/org.apache.ws.commons.axiom/axiom-integration/1.2.15-SNAPSHOT/axiom-integration-1.2.15-SNAPSHOT.pom
Waiting for Jenkins to finish collecting data
mavenExecutionResult exceptions not empty
message : Failed to execute goal org.apache.maven.plugins:maven-deploy-plugin:2.5:deploy (default-deploy)
on project axiom: Failed to deploy artifacts: Could not transfer artifact org.apache.ws.commons.axiom:axiom:exec:jacoco:1.2.15-20121230.221143-30
from/to apache.snapshots.https (https://repository.apache.org/content/repositories/snapshots):
TransferFailedException
cause : Failed to deploy artifacts: Could not transfer artifact org.apache.ws.commons.axiom:axiom:exec:jacoco:1.2.15-20121230.221143-30
from/to apache.snapshots.https (https://repository.apache.org/content/repositories/snapshots):
TransferFailedException
Stack trace : 
org.apache.maven.lifecycle.LifecycleExecutionException: Failed to execute goal org.apache.maven.plugins:maven-deploy-plugin:2.5:deploy
(default-deploy) on project axiom: Failed to deploy artifacts: Could not transfer artifact
org.apache.ws.commons.axiom:axiom:exec:jacoco:1.2.15-20121230.221143-30 from/to apache.snapshots.https
(https://repository.apache.org/content/repositories/snapshots): TransferFailedException
	at org.apache.maven.lifecycle.internal.MojoExecutor.execute(MojoExecutor.java:217)
	at org.apache.maven.lifecycle.internal.MojoExecutor.execute(MojoExecutor.java:153)
	at org.apache.maven.lifecycle.internal.MojoExecutor.execute(MojoExecutor.java:145)
	at org.apache.maven.lifecycle.internal.LifecycleModuleBuilder.buildProject(LifecycleModuleBuilder.java:84)
	at org.apache.maven.lifecycle.internal.LifecycleModuleBuilder.buildProject(LifecycleModuleBuilder.java:59)
	at org.apache.maven.lifecycle.internal.LifecycleStarter.singleThreadedBuild(LifecycleStarter.java:183)
	at org.apache.maven.lifecycle.internal.LifecycleStarter.execute(LifecycleStarter.java:161)
	at org.apache.maven.DefaultMaven.doExecute(DefaultMaven.java:320)
	at org.apache.maven.DefaultMaven.execute(DefaultMaven.java:156)
	at org.jvnet.hudson.maven3.launcher.Maven3Launcher.main(Maven3Launcher.java:79)
	at sun.reflect.NativeMethodAccessorImpl.invoke0(Native Method)
	at sun.reflect.NativeMethodAccessorImpl.invoke(NativeMethodAccessorImpl.java:39)
	at sun.reflect.DelegatingMethodAccessorImpl.invoke(DelegatingMethodAccessorImpl.java:25)
	at java.lang.reflect.Method.invoke(Method.java:592)
	at org.codehaus.plexus.classworlds.launcher.Launcher.launchStandard(Launcher.java:329)
	at org.codehaus.plexus.classworlds.launcher.Launcher.launch(Launcher.java:239)
	at org.jvnet.hudson.maven3.agent.Maven3Main.launch(Maven3Main.java:158)
	at hudson.maven.Maven3Builder.call(Maven3Builder.java:98)
	at hudson.maven.Maven3Builder.call(Maven3Builder.java:64)
	at hudson.remoting.UserRequest.perform(UserRequest.java:118)
	at hudson.remoting.UserRequest.perform(UserRequest.java:48)
	at hudson.remoting.Request$2.run(Request.java:326)
	at hudson.remoting.InterceptingExecutorService$1.call(InterceptingExecutorService.java:72)
	at java.util.concurrent.FutureTask$Sync.innerRun(FutureTask.java:269)
	at java.util.concurrent.FutureTask.run(FutureTask.java:123)
	at java.util.concurrent.ThreadPoolExecutor$Worker.runTask(ThreadPoolExecutor.java:651)
	at java.util.concurrent.ThreadPoolExecutor$Worker.run(ThreadPoolExecutor.java:676)
	at java.lang.Thread.run(Thread.java:595)
Caused by: org.apache.maven.plugin.MojoExecutionException: Failed to deploy artifacts: Could
not transfer artifact org.apache.ws.commons.axiom:axiom:exec:jacoco:1.2.15-20121230.221143-30
from/to apache.snapshots.https (https://repository.apache.org/content/repositories/snapshots):
TransferFailedException
	at org.apache.maven.plugin.deploy.DeployMojo.execute(DeployMojo.java:189)
	at org.apache.maven.plugin.DefaultBuildPluginManager.executeMojo(DefaultBuildPluginManager.java:101)
	at org.apache.maven.lifecycle.internal.MojoExecutor.execute(MojoExecutor.java:209)
	... 27 more
Caused by: org.apache.maven.artifact.deployer.ArtifactDeploymentException: Failed to deploy
artifacts: Could not transfer artifact org.apache.ws.commons.axiom:axiom:exec:jacoco:1.2.15-20121230.221143-30
from/to apache.snapshots.https (https://repository.apache.org/content/repositories/snapshots):
TransferFailedException
	at org.apache.maven.artifact.deployer.DefaultArtifactDeployer.deploy(DefaultArtifactDeployer.java:141)
	at org.apache.maven.plugin.deploy.DeployMojo.execute(DeployMojo.java:184)
	... 29 more
Caused by: org.sonatype.aether.deployment.DeploymentException: Failed to deploy artifacts:
Could not transfer artifact org.apache.ws.commons.axiom:axiom:exec:jacoco:1.2.15-20121230.221143-30
from/to apache.snapshots.https (https://repository.apache.org/content/repositories/snapshots):
TransferFailedException
	at org.sonatype.aether.impl.internal.DefaultDeployer.deploy(DefaultDeployer.java:280)
	at org.sonatype.aether.impl.internal.DefaultDeployer.deploy(DefaultDeployer.java:211)
	at org.sonatype.aether.impl.internal.DefaultRepositorySystem.deploy(DefaultRepositorySystem.java:443)
	at org.apache.maven.artifact.deployer.DefaultArtifactDeployer.deploy(DefaultArtifactDeployer.java:137)
	... 30 more
Caused by: org.sonatype.aether.transfer.ArtifactTransferException: Could not transfer artifact
org.apache.ws.commons.axiom:axiom:exec:jacoco:1.2.15-20121230.221143-30 from/to apache.snapshots.https
(https://repository.apache.org/content/repositories/snapshots): TransferFailedException
	at org.sonatype.aether.connector.wagon.WagonRepositoryConnector$4.wrap(WagonRepositoryConnector.java:951)
	at org.sonatype.aether.connector.wagon.WagonRepositoryConnector$4.wrap(WagonRepositoryConnector.java:941)
	at org.sonatype.aether.connector.wagon.WagonRepositoryConnector$PutTask.run(WagonRepositoryConnector.java:837)
	at org.sonatype.aether.connector.wagon.WagonRepositoryConnector.put(WagonRepositoryConnector.java:467)
	at org.sonatype.aether.impl.internal.DefaultDeployer.deploy(DefaultDeployer.java:274)
	... 33 more
Caused by: org.apache.maven.wagon.TransferFailedException
	at org.apache.maven.wagon.shared.http4.AbstractHttpClientWagon.put(AbstractHttpClientWagon.java:521)
	at org.apache.maven.wagon.shared.http4.AbstractHttpClientWagon.put(AbstractHttpClientWagon.java:471)
	at org.apache.maven.wagon.shared.http4.AbstractHttpClientWagon.put(AbstractHttpClientWagon.java:451)
	at org.sonatype.aether.connector.wagon.WagonRepositoryConnector$PutTask.run(WagonRepositoryConnector.java:811)
	... 35 more
Caused by: org.apache.maven.wagon.providers.http.httpclient.client.ClientProtocolException
	at org.apache.maven.wagon.providers.http.httpclient.impl.client.AbstractHttpClient.execute(AbstractHttpClient.java:822)
	at org.apache.maven.wagon.providers.http.httpclient.impl.client.AbstractHttpClient.execute(AbstractHttpClient.java:754)
	at org.apache.maven.wagon.shared.http4.AbstractHttpClientWagon.execute(AbstractHttpClientWagon.java:674)
	at org.apache.maven.wagon.shared.http4.AbstractHttpClientWagon.put(AbstractHttpClientWagon.java:515)
	... 38 more
Caused by: org.apache.maven.wagon.providers.http.httpclient.client.NonRepeatableRequestException:
Cannot retry request with a non-repeatable request entity.  The cause lists the reason the
original request failed.
	at org.apache.maven.wagon.providers.http.httpclient.impl.client.DefaultRequestDirector.tryExecute(DefaultRequestDirector.java:619)
	at org.apache.maven.wagon.providers.http.httpclient.impl.client.DefaultRequestDirector.execute(DefaultRequestDirector.java:464)
	at org.apache.maven.wagon.providers.http.httpclient.impl.client.AbstractHttpClient.execute(AbstractHttpClient.java:820)
	... 41 more
Caused by: java.io.FileNotFoundException: <https://builds.apache.org/job/ws-axiom-trunk/ws/axiom/target/jacoco.exec>
(No such file or directory)
	at java.io.FileInputStream.open(Native Method)
	at java.io.FileInputStream.<init>(FileInputStream.java:106)
	at org.apache.maven.wagon.shared.http4.AbstractHttpClientWagon$RequestEntityImplementation.writeTo(AbstractHttpClientWagon.java:162)
	at org.apache.maven.wagon.providers.http.httpclient.entity.HttpEntityWrapper.writeTo(HttpEntityWrapper.java:96)
	at org.apache.maven.wagon.providers.http.httpclient.impl.client.EntityEnclosingRequestWrapper$EntityWrapper.writeTo(EntityEnclosingRequestWrapper.java:108)
	at org.apache.maven.wagon.providers.http.httpclient.impl.entity.EntitySerializer.serialize(EntitySerializer.java:120)
	at org.apache.maven.wagon.providers.http.httpclient.impl.AbstractHttpClientConnection.sendRequestEntity(AbstractHttpClientConnection.java:263)
	at org.apache.maven.wagon.providers.http.httpclient.impl.conn.AbstractClientConnAdapter.sendRequestEntity(AbstractClientConnAdapter.java:227)
	at org.apache.maven.wagon.providers.http.httpclient.protocol.HttpRequestExecutor.doSendRequest(HttpRequestExecutor.java:255)
	at org.apache.maven.wagon.providers.http.httpclient.protocol.HttpRequestExecutor.execute(HttpRequestExecutor.java:123)
	at org.apache.maven.wagon.providers.http.httpclient.impl.client.DefaultRequestDirector.tryExecute(DefaultRequestDirector.java:645)
	... 43 more
Sending e-mails to: dev@ws.apache.org veithen@apache.org
channel stopped

---------------------------------------------------------------------
To unsubscribe, e-mail: dev-unsubscribe@ws.apache.org
For additional commands, e-mail: dev-help@ws.apache.org


Mime
View raw message