ws-dev mailing list archives

Site index · List index
Message view « Date » · « Thread »
Top « Date » · « Thread »
From Apache Jenkins Server <jenk...@builds.apache.org>
Subject Build failed in Jenkins: ws-axiom-trunk #1291
Date Thu, 20 Dec 2012 13:00:13 GMT
See <https://builds.apache.org/job/ws-axiom-trunk/1291/changes>

Changes:

[veithen] Reverted the changes done in AXIOM-62. Reason: performance & security.

------------------------------------------
[...truncated 4076 lines...]
Generating <https://builds.apache.org/job/ws-axiom-trunk/ws/axiom/modules/axiom-impl/target/apidocs/org/apache/axiom/soap/impl/llom/soap11/class-use//SOAP11FaultImpl.html...>
Generating <https://builds.apache.org/job/ws-axiom-trunk/ws/axiom/modules/axiom-impl/target/apidocs/org/apache/axiom/soap/impl/llom/soap11/class-use//SOAP11FaultRoleImpl.html...>
Generating <https://builds.apache.org/job/ws-axiom-trunk/ws/axiom/modules/axiom-impl/target/apidocs/org/apache/axiom/soap/impl/llom/soap11/class-use//SOAP11FaultTextImpl.html...>
Generating <https://builds.apache.org/job/ws-axiom-trunk/ws/axiom/modules/axiom-impl/target/apidocs/org/apache/axiom/soap/impl/llom/soap11/class-use//SOAP11FaultDetailImpl.html...>
Generating <https://builds.apache.org/job/ws-axiom-trunk/ws/axiom/modules/axiom-impl/target/apidocs/org/apache/axiom/soap/impl/llom/soap11/class-use//SOAP11HeaderImpl.html...>
Generating <https://builds.apache.org/job/ws-axiom-trunk/ws/axiom/modules/axiom-impl/target/apidocs/org/apache/axiom/soap/impl/llom/soap11/class-use//SOAP11Factory.html...>
Generating <https://builds.apache.org/job/ws-axiom-trunk/ws/axiom/modules/axiom-impl/target/apidocs/org/apache/axiom/soap/impl/llom/soap11/class-use//SOAP11FaultCodeImpl.html...>
Generating <https://builds.apache.org/job/ws-axiom-trunk/ws/axiom/modules/axiom-impl/target/apidocs/org/apache/axiom/soap/impl/llom/soap11/class-use//SOAP11FaultReasonImpl.html...>
Generating <https://builds.apache.org/job/ws-axiom-trunk/ws/axiom/modules/axiom-impl/target/apidocs/org/apache/axiom/soap/impl/llom/soap11/class-use//SOAP11FaultValueImpl.html...>
Generating <https://builds.apache.org/job/ws-axiom-trunk/ws/axiom/modules/axiom-impl/target/apidocs/org/apache/axiom/soap/impl/llom/soap11/class-use//SOAP11FaultSubCodeImpl.html...>
Generating <https://builds.apache.org/job/ws-axiom-trunk/ws/axiom/modules/axiom-impl/target/apidocs/org/apache/axiom/om/impl/llom/factory/class-use//OMLinkedListImplFactory.html...>
Generating <https://builds.apache.org/job/ws-axiom-trunk/ws/axiom/modules/axiom-impl/target/apidocs/org/apache/axiom/om/impl/llom/factory/class-use//OMLinkedListMetaFactoryLoader.html...>
Generating <https://builds.apache.org/job/ws-axiom-trunk/ws/axiom/modules/axiom-impl/target/apidocs/org/apache/axiom/om/impl/llom/factory/class-use//OMLinkedListMetaFactory.html...>
Generating <https://builds.apache.org/job/ws-axiom-trunk/ws/axiom/modules/axiom-impl/target/apidocs/org/apache/axiom/om/impl/llom/class-use//OMDocTypeImpl.html...>
Generating <https://builds.apache.org/job/ws-axiom-trunk/ws/axiom/modules/axiom-impl/target/apidocs/org/apache/axiom/om/impl/llom/class-use//OMProcessingInstructionImpl.html...>
Generating <https://builds.apache.org/job/ws-axiom-trunk/ws/axiom/modules/axiom-impl/target/apidocs/org/apache/axiom/om/impl/llom/class-use//OMDocumentImpl.html...>
Generating <https://builds.apache.org/job/ws-axiom-trunk/ws/axiom/modules/axiom-impl/target/apidocs/org/apache/axiom/om/impl/llom/class-use//OMNodeImpl.html...>
Generating <https://builds.apache.org/job/ws-axiom-trunk/ws/axiom/modules/axiom-impl/target/apidocs/org/apache/axiom/om/impl/llom/class-use//PushOMBuilder.html...>
Generating <https://builds.apache.org/job/ws-axiom-trunk/ws/axiom/modules/axiom-impl/target/apidocs/org/apache/axiom/om/impl/llom/class-use//OMTextImpl.html...>
Generating <https://builds.apache.org/job/ws-axiom-trunk/ws/axiom/modules/axiom-impl/target/apidocs/org/apache/axiom/om/impl/llom/class-use//OMElementImpl.html...>
Generating <https://builds.apache.org/job/ws-axiom-trunk/ws/axiom/modules/axiom-impl/target/apidocs/org/apache/axiom/om/impl/llom/class-use//OMCommentImpl.html...>
Generating <https://builds.apache.org/job/ws-axiom-trunk/ws/axiom/modules/axiom-impl/target/apidocs/org/apache/axiom/om/impl/llom/class-use//OMEntityReferenceImpl.html...>
Generating <https://builds.apache.org/job/ws-axiom-trunk/ws/axiom/modules/axiom-impl/target/apidocs/org/apache/axiom/om/impl/llom/class-use//OMSourcedElementImpl.html...>
Generating <https://builds.apache.org/job/ws-axiom-trunk/ws/axiom/modules/axiom-impl/target/apidocs/org/apache/axiom/om/impl/llom/class-use//OMAttributeImpl.html...>
Generating <https://builds.apache.org/job/ws-axiom-trunk/ws/axiom/modules/axiom-impl/target/apidocs/org/apache/axiom/om/impl/llom/class-use//OMLeafNode.html...>
Generating <https://builds.apache.org/job/ws-axiom-trunk/ws/axiom/modules/axiom-impl/target/apidocs/org/apache/axiom/om/impl/llom/class-use//OMSerializableImpl.html...>
Generating <https://builds.apache.org/job/ws-axiom-trunk/ws/axiom/modules/axiom-impl/target/apidocs/org/apache/axiom/om/impl/llom//package-use.html...>
Generating <https://builds.apache.org/job/ws-axiom-trunk/ws/axiom/modules/axiom-impl/target/apidocs/org/apache/axiom/om/impl/llom/factory//package-use.html...>
Generating <https://builds.apache.org/job/ws-axiom-trunk/ws/axiom/modules/axiom-impl/target/apidocs/org/apache/axiom/soap/impl/llom//package-use.html...>
Generating <https://builds.apache.org/job/ws-axiom-trunk/ws/axiom/modules/axiom-impl/target/apidocs/org/apache/axiom/soap/impl/llom/soap11//package-use.html...>
Generating <https://builds.apache.org/job/ws-axiom-trunk/ws/axiom/modules/axiom-impl/target/apidocs/org/apache/axiom/soap/impl/llom/soap12//package-use.html...>
Building index for all the packages and classes...
Generating <https://builds.apache.org/job/ws-axiom-trunk/ws/axiom/modules/axiom-impl/target/apidocs/overview-tree.html...>
Generating <https://builds.apache.org/job/ws-axiom-trunk/ws/axiom/modules/axiom-impl/target/apidocs/index-all.html...>
Generating <https://builds.apache.org/job/ws-axiom-trunk/ws/axiom/modules/axiom-impl/target/apidocs/deprecated-list.html...>
Building index for all classes...
Generating <https://builds.apache.org/job/ws-axiom-trunk/ws/axiom/modules/axiom-impl/target/apidocs/allclasses-frame.html...>
Generating <https://builds.apache.org/job/ws-axiom-trunk/ws/axiom/modules/axiom-impl/target/apidocs/allclasses-noframe.html...>
Generating <https://builds.apache.org/job/ws-axiom-trunk/ws/axiom/modules/axiom-impl/target/apidocs/index.html...>
Generating <https://builds.apache.org/job/ws-axiom-trunk/ws/axiom/modules/axiom-impl/target/apidocs/overview-summary.html...>
Generating <https://builds.apache.org/job/ws-axiom-trunk/ws/axiom/modules/axiom-impl/target/apidocs/help-doc.html...>
Generating <https://builds.apache.org/job/ws-axiom-trunk/ws/axiom/modules/axiom-impl/target/apidocs/stylesheet.css...>
1 warning
[WARNING] Javadoc Warnings
[WARNING] <https://builds.apache.org/job/ws-axiom-trunk/ws/axiom/modules/axiom-impl/src/main/java/org/apache/axiom/om/impl/llom/OMDocumentImpl.java>:139:
warning - @param argument "state" is not a parameter name.
[INFO] Building jar: <https://builds.apache.org/job/ws-axiom-trunk/ws/axiom/modules/axiom-impl/target/axiom-impl-1.2.15-SNAPSHOT-javadoc.jar>
mojoSucceeded org.apache.maven.plugins:maven-javadoc-plugin:2.5(attach-javadocs)
mojoStarted org.apache.maven.plugins:maven-shade-plugin:1.6(default)
[INFO] 
[INFO] --- maven-shade-plugin:1.6:shade (default) @ axiom-impl ---
[INFO] Excluding org.apache.ws.commons.axiom:axiom-api:jar:1.2.15-SNAPSHOT from the shaded
jar.
[INFO] Excluding jaxen:jaxen:jar:1.1.4 from the shaded jar.
[INFO] Excluding org.apache.james:apache-mime4j-core:jar:0.7.2 from the shaded jar.
[INFO] Including org.apache.ws.commons.axiom:axiom-common-impl:jar:1.2.15-SNAPSHOT in the
shaded jar.
[INFO] Excluding org.apache.geronimo.specs:geronimo-activation_1.1_spec:jar:1.1 from the shaded
jar.
[INFO] Excluding org.apache.geronimo.specs:geronimo-javamail_1.4_spec:jar:1.7.1 from the shaded
jar.
[INFO] Excluding org.codehaus.woodstox:woodstox-core-asl:jar:4.1.4 from the shaded jar.
[INFO] Excluding org.codehaus.woodstox:stax2-api:jar:3.1.1 from the shaded jar.
[INFO] Excluding commons-logging:commons-logging:jar:1.1.1 from the shaded jar.
[INFO] Excluding org.apache.geronimo.specs:geronimo-stax-api_1.0_spec:jar:1.0.1 from the shaded
jar.
[INFO] Replacing original artifact with shaded artifact.
[INFO] Replacing <https://builds.apache.org/job/ws-axiom-trunk/ws/axiom/modules/axiom-impl/target/axiom-impl-1.2.15-SNAPSHOT.jar>
with <https://builds.apache.org/job/ws-axiom-trunk/ws/axiom/modules/axiom-impl/target/axiom-impl-1.2.15-SNAPSHOT-shaded.jar>
mojoSucceeded org.apache.maven.plugins:maven-shade-plugin:1.6(default)
mojoStarted org.apache.maven.plugins:maven-jar-plugin:2.3.1(default)
[INFO] 
[INFO] --- maven-jar-plugin:2.3.1:test-jar (default) @ axiom-impl ---
[INFO] Building jar: <https://builds.apache.org/job/ws-axiom-trunk/ws/axiom/modules/axiom-impl/target/axiom-impl-1.2.15-SNAPSHOT-tests.jar>
mojoSucceeded org.apache.maven.plugins:maven-jar-plugin:2.3.1(default)
mojoStarted org.apache.maven.plugins:maven-gpg-plugin:1.1(default)
[INFO] 
[INFO] --- maven-gpg-plugin:1.1:sign (default) @ axiom-impl ---
mojoSucceeded org.apache.maven.plugins:maven-gpg-plugin:1.1(default)
mojoStarted org.apache.rat:apache-rat-plugin:0.8(default)[INFO] Exclude: src/test/resources/**
[INFO] Exclude: dependency-reduced-pom.xml

[INFO] 
[INFO] --- apache-rat-plugin:0.8:check (default) @ axiom-impl ---
mojoSucceeded org.apache.rat:apache-rat-plugin:0.8(default)
mojoStarted org.apache.maven.plugins:maven-install-plugin:2.3.1(default-install)[INFO] Installing
<https://builds.apache.org/job/ws-axiom-trunk/ws/axiom/modules/axiom-impl/target/axiom-impl-1.2.15-SNAPSHOT.jar>
to <https://builds.apache.org/job/ws-axiom-trunk/ws/.repository/org/apache/ws/commons/axiom/axiom-impl/1.2.15-SNAPSHOT/axiom-impl-1.2.15-SNAPSHOT.jar>
[INFO] Installing <https://builds.apache.org/job/ws-axiom-trunk/ws/axiom/modules/axiom-impl/dependency-reduced-pom.xml>
to <https://builds.apache.org/job/ws-axiom-trunk/ws/.repository/org/apache/ws/commons/axiom/axiom-impl/1.2.15-SNAPSHOT/axiom-impl-1.2.15-SNAPSHOT.pom>

[INFO] 
[INFO] --- maven-install-plugin:2.3.1:install (default-install) @ axiom-impl ---
[INFO] Installing <https://builds.apache.org/job/ws-axiom-trunk/ws/axiom/modules/axiom-impl/target/axiom-impl-1.2.15-SNAPSHOT-sources.jar>
to <https://builds.apache.org/job/ws-axiom-trunk/ws/.repository/org/apache/ws/commons/axiom/axiom-impl/1.2.15-SNAPSHOT/axiom-impl-1.2.15-SNAPSHOT-sources.jar>
[INFO] Installing <https://builds.apache.org/job/ws-axiom-trunk/ws/axiom/modules/axiom-impl/target/axiom-impl-1.2.15-SNAPSHOT-javadoc.jar>
to <https://builds.apache.org/job/ws-axiom-trunk/ws/.repository/org/apache/ws/commons/axiom/axiom-impl/1.2.15-SNAPSHOT/axiom-impl-1.2.15-SNAPSHOT-javadoc.jar>
[INFO] Installing <https://builds.apache.org/job/ws-axiom-trunk/ws/axiom/modules/axiom-impl/target/axiom-impl-1.2.15-SNAPSHOT-tests.jar>
to <https://builds.apache.org/job/ws-axiom-trunk/ws/.repository/org/apache/ws/commons/axiom/axiom-impl/1.2.15-SNAPSHOT/axiom-impl-1.2.15-SNAPSHOT-tests.jar>
mojoSucceeded org.apache.maven.plugins:maven-install-plugin:2.3.1(default-install)
mojoStarted org.apache.felix:maven-bundle-plugin:1.4.0(default-install)[INFO] Parsing <https://builds.apache.org/job/ws-axiom-trunk/ws/.repository/repository.xml>

[INFO] 
[INFO] --- maven-bundle-plugin:1.4.0:install (default-install) @ axiom-impl ---
[INFO] Installing org/apache/ws/commons/axiom/axiom-impl/1.2.15-SNAPSHOT/axiom-impl-1.2.15-SNAPSHOT.jar
[INFO] Writing OBR metadata
mojoSucceeded org.apache.felix:maven-bundle-plugin:1.4.0(default-install)
mojoStarted org.apache.maven.plugins:maven-deploy-plugin:2.5(default-deploy)Downloading: https://repository.apache.org/content/repositories/snapshots/org/apache/ws/commons/axiom/axiom-impl/1.2.15-SNAPSHOT/maven-metadata.xml

[INFO] 
[INFO] --- maven-deploy-plugin:2.5:deploy (default-deploy) @ axiom-impl ---
Downloaded: https://repository.apache.org/content/repositories/snapshots/org/apache/ws/commons/axiom/axiom-impl/1.2.15-SNAPSHOT/maven-metadata.xml
(2 KB at 21.5 KB/sec)
Uploading: https://repository.apache.org/content/repositories/snapshots/org/apache/ws/commons/axiom/axiom-impl/1.2.15-SNAPSHOT/axiom-impl-1.2.15-20121220.125501-10.jar
Uploaded: https://repository.apache.org/content/repositories/snapshots/org/apache/ws/commons/axiom/axiom-impl/1.2.15-SNAPSHOT/axiom-impl-1.2.15-20121220.125501-10.jar
(167 KB at 1303.1 KB/sec)
Uploading: https://repository.apache.org/content/repositories/snapshots/org/apache/ws/commons/axiom/axiom-impl/1.2.15-SNAPSHOT/axiom-impl-1.2.15-20121220.125501-10.pom
Uploaded: https://repository.apache.org/content/repositories/snapshots/org/apache/ws/commons/axiom/axiom-impl/1.2.15-SNAPSHOT/axiom-impl-1.2.15-20121220.125501-10.pom
(8 KB at 118.1 KB/sec)
Downloading: https://repository.apache.org/content/repositories/snapshots/org/apache/ws/commons/axiom/axiom-impl/maven-metadata.xml
Downloaded: https://repository.apache.org/content/repositories/snapshots/org/apache/ws/commons/axiom/axiom-impl/maven-metadata.xml
(359 B at 3.2 KB/sec)
Uploading: https://repository.apache.org/content/repositories/snapshots/org/apache/ws/commons/axiom/axiom-impl/1.2.15-SNAPSHOT/maven-metadata.xml
Uploaded: https://repository.apache.org/content/repositories/snapshots/org/apache/ws/commons/axiom/axiom-impl/1.2.15-SNAPSHOT/maven-metadata.xml
(2 KB at 9.7 KB/sec)
Uploading: https://repository.apache.org/content/repositories/snapshots/org/apache/ws/commons/axiom/axiom-impl/maven-metadata.xml
Uploaded: https://repository.apache.org/content/repositories/snapshots/org/apache/ws/commons/axiom/axiom-impl/maven-metadata.xml
(359 B at 3.5 KB/sec)
Uploading: https://repository.apache.org/content/repositories/snapshots/org/apache/ws/commons/axiom/axiom-impl/1.2.15-SNAPSHOT/axiom-impl-1.2.15-20121220.125501-10-sources.jar
Uploaded: https://repository.apache.org/content/repositories/snapshots/org/apache/ws/commons/axiom/axiom-impl/1.2.15-SNAPSHOT/axiom-impl-1.2.15-20121220.125501-10-sources.jar
(104 KB at 1084.5 KB/sec)
Uploading: https://repository.apache.org/content/repositories/snapshots/org/apache/ws/commons/axiom/axiom-impl/1.2.15-SNAPSHOT/maven-metadata.xml
Uploaded: https://repository.apache.org/content/repositories/snapshots/org/apache/ws/commons/axiom/axiom-impl/1.2.15-SNAPSHOT/maven-metadata.xml
(2 KB at 25.1 KB/sec)
Uploading: https://repository.apache.org/content/repositories/snapshots/org/apache/ws/commons/axiom/axiom-impl/1.2.15-SNAPSHOT/axiom-impl-1.2.15-20121220.125501-10-javadoc.jar
Uploaded: https://repository.apache.org/content/repositories/snapshots/org/apache/ws/commons/axiom/axiom-impl/1.2.15-SNAPSHOT/axiom-impl-1.2.15-20121220.125501-10-javadoc.jar
(536 KB at 7232.7 KB/sec)
Uploading: https://repository.apache.org/content/repositories/snapshots/org/apache/ws/commons/axiom/axiom-impl/1.2.15-SNAPSHOT/maven-metadata.xml
Uploaded: https://repository.apache.org/content/repositories/snapshots/org/apache/ws/commons/axiom/axiom-impl/1.2.15-SNAPSHOT/maven-metadata.xml
(2 KB at 24.6 KB/sec)
Uploading: https://repository.apache.org/content/repositories/snapshots/org/apache/ws/commons/axiom/axiom-impl/1.2.15-SNAPSHOT/axiom-impl-1.2.15-20121220.125501-10-tests.jar
Uploaded: https://repository.apache.org/content/repositories/snapshots/org/apache/ws/commons/axiom/axiom-impl/1.2.15-SNAPSHOT/axiom-impl-1.2.15-20121220.125501-10-tests.jar
(18 KB at 284.5 KB/sec)
Uploading: https://repository.apache.org/content/repositories/snapshots/org/apache/ws/commons/axiom/axiom-impl/1.2.15-SNAPSHOT/maven-metadata.xml
Uploaded: https://repository.apache.org/content/repositories/snapshots/org/apache/ws/commons/axiom/axiom-impl/1.2.15-SNAPSHOT/maven-metadata.xml
(2 KB at 20.7 KB/sec)
mojoSucceeded org.apache.maven.plugins:maven-deploy-plugin:2.5(default-deploy)
mojoStarted org.apache.felix:maven-bundle-plugin:1.4.0(default-deploy)[INFO] Remote OBR update
disabled (enable with -DremoteOBR)

[INFO] 
[INFO] --- maven-bundle-plugin:1.4.0:deploy (default-deploy) @ axiom-impl ---
mojoSucceeded org.apache.felix:maven-bundle-plugin:1.4.0(default-deploy)
projectSucceeded org.apache.ws.commons.axiom:axiom-impl:1.2.15-SNAPSHOT
projectStarted org.apache.ws.commons.axiom:axiom-dom:1.2.15-SNAPSHOT
[INFO]                                                                         
[INFO] ------------------------------------------------------------------------
[INFO] Building Axiom DOM 1.2.15-SNAPSHOT
[INFO] ------------------------------------------------------------------------
[INFO] Deleting <https://builds.apache.org/job/ws-axiom-trunk/ws/axiom/modules/axiom-dom/target>
mojoStarted org.apache.maven.plugins:maven-clean-plugin:2.4.1(default-clean)
[INFO] 
[INFO] --- maven-clean-plugin:2.4.1:clean (default-clean) @ axiom-dom ---
mojoSucceeded org.apache.maven.plugins:maven-clean-plugin:2.4.1(default-clean)
mojoStarted org.apache.maven.plugins:maven-remote-resources-plugin:1.1(default)
[INFO] 
[INFO] --- maven-remote-resources-plugin:1.1:process (default) @ axiom-dom ---
[WARNING] org.apache.velocity.runtime.exception.ReferenceException: reference : template =
META-INF/DEPENDENCIES.vm [line 40,column 14] : $license.name is not a valid reference.
mojoSucceeded org.apache.maven.plugins:maven-remote-resources-plugin:1.1(default)
mojoStarted org.apache.maven.plugins:maven-resources-plugin:2.4.3(default-resources)[INFO]
Using 'UTF-8' encoding to copy filtered resources.

[INFO] 
[INFO] --- maven-resources-plugin:2.4.3:resources (default-resources) @ axiom-dom ---
[INFO] Copying 4 resources
[INFO] Copying 3 resources
mojoSucceeded org.apache.maven.plugins:maven-resources-plugin:2.4.3(default-resources)
mojoStarted org.apache.maven.plugins:maven-compiler-plugin:2.3.2(default-compile)
[INFO] 
[INFO] --- maven-compiler-plugin:2.3.2:compile (default-compile) @ axiom-dom ---
[INFO] Compiling 74 source files to <https://builds.apache.org/job/ws-axiom-trunk/ws/axiom/modules/axiom-dom/target/classes>
mojoSucceeded org.apache.maven.plugins:maven-compiler-plugin:2.3.2(default-compile)
mojoStarted org.apache.maven.plugins:maven-resources-plugin:2.4.3(default-testResources)[INFO]
Using 'UTF-8' encoding to copy filtered resources.
[INFO] skip non existing resourceDirectory <https://builds.apache.org/job/ws-axiom-trunk/ws/axiom/modules/axiom-dom/src/test/resources>
[INFO] Copying 3 resources

[INFO] 
[INFO] --- maven-resources-plugin:2.4.3:testResources (default-testResources) @ axiom-dom
---
mojoSucceeded org.apache.maven.plugins:maven-resources-plugin:2.4.3(default-testResources)
mojoStarted org.apache.maven.plugins:maven-compiler-plugin:2.3.2(default-testCompile)
[INFO] 
[INFO] --- maven-compiler-plugin:2.3.2:testCompile (default-testCompile) @ axiom-dom ---
[INFO] Compiling 13 source files to <https://builds.apache.org/job/ws-axiom-trunk/ws/axiom/modules/axiom-dom/target/test-classes>
mojoSucceeded org.apache.maven.plugins:maven-compiler-plugin:2.3.2(default-testCompile)
mojoStarted org.apache.maven.plugins:maven-surefire-plugin:2.10(default-test)[INFO] Surefire
report directory: <https://builds.apache.org/job/ws-axiom-trunk/ws/axiom/modules/axiom-dom/target/surefire-reports>

[INFO] 
-------------------------------------------------------
 T E S T S
-------------------------------------------------------

[INFO] --- maven-surefire-plugin:2.10:test (default-test) @ axiom-dom ---
Running org.apache.axiom.soap.impl.dom.SOAPImplementationTest
<detail><test:DetailEntry1 xmlns:test="http://www.test.org"/><test:DetailEntry2
xmlns:test="http://www.test.org"/></detail>
<soapenv:Detail xmlns:soapenv="http://www.w3.org/2003/05/soap-envelope"><test:DetailEntry1
xmlns:test="http://www.test.org"/><test:DetailEntry2 xmlns:test="http://www.test.org"/></soapenv:Detail>
Tests run: 331, Failures: 0, Errors: 0, Skipped: 0, Time elapsed: 197.996 sec
Running org.apache.axiom.soap.impl.dom.SOAPFaultCodeTest
Tests run: 4, Failures: 0, Errors: 0, Skipped: 0, Time elapsed: 0.007 sec
Running org.apache.axiom.soap.impl.dom.SOAPFaultSubCodeTest
Tests run: 8, Failures: 0, Errors: 0, Skipped: 0, Time elapsed: 0.012 sec
Running org.apache.axiom.soap.impl.dom.SOAPFaultRoleTest
Tests run: 6, Failures: 0, Errors: 0, Skipped: 0, TimeTests run: 21, Failures: 0, Errors:
0, Skipped: 0, Time elapsed: 0.13 sec
Running org.apache.axiom.om.impl.dom.factory.DOMFeatureTest
Tests run: 1, Failures: 0, Errors: 0, Skipped: 0, Time elapsed: 0.005 sec
Running org.apache.axiom.om.impl.dom.SOAPEnvelopeTest
Tests run: 2, Failures: 0, Errors: 0, Skipped: 0, Time elapsed: 0 sec
Running org.apache.axiom.om.impl.dom.DocumentImplTest
Tests run: 4, Failures: 0, Errors: 0, Skipped: 0, Time elapsed: 0.05 sec
Running org.apache.axiom.om.impl.dom.OMImplementationTest
Dec 20, 2012 12:58:25 PM org.apache.axiom.om.impl.builder.StAXOMBuilder parserNext
WARNING: Attempt to access a parser that has thrown a parse exception before; rethrowing the
original exception.
Dec 20, 2012 12:58:25 PM org.apache.axiom.om.impl.builder.StAXOMBuilder parserNext
WARNING: Attempt to access a parser that has thrown a parse exception before; rethrowing the
original exception.
Dec 20, 2012 12:58:28 PM org.apache.axiom.om.impl.dom.ElementImpl declareNamespace
WARNING: Deprecated usage of OMElement#declareNamespace(String,String) with empty prefix
Tests run: 1031, Failures: 0, Errors: 0, Skipped: 0, Time elapsed: 103.406 sec
Running org.apache.axiom.om.impl.dom.DOMImplementationTest
Warning: Running an XSLT 1.0 stylesheet with an XSLT 2.0 processor
Warning: Running an XSLT 1.0 stylesheet with an XSLT 2.0 processor
Warning: Running an XSLT 1.0 stylesheet with an XSLT 2.0 processor
Warning: Running an XSLT 1.0 stylesheet with an XSLT 2.0 processor
Warning: Running an XSLT 1.0 stylesheet with an XSLT 2.0 processor
Warning: Running an XSLT 1.0 stylesheet with an XSLT 2.0 processor
Tests run: 141, Failures: 0, Errors: 0, Skipped: 0, Time elapsed: 0.587 sec
Running org.apache.axiom.om.impl.dom.DocumentImplSerializationTest
Tests run: 6, Failures: 0, Errors: 0, Skipped: 0, Time elapsed: 0.001 sec
Running org.apache.axiom.om.impl.dom.CommonImplTest
Tests run: 3, Failures: 0, Errors: 0, Skipped: 0, Time elapsed: 0.004 sec
Running org.apache.axiom.om.impl.dom.OMDOMImplementationTest
Tests run: 22, Failures: 0, Errors: 0, Skipped: 0, Time elapsed: 0.014 sec

Results :

Tests run: 1580, Failures: 0, Errors: 0, Skipped: 0

mojoSucceeded org.apache.maven.plugins:maven-surefire-plugin:2.10(default-test)
[JENKINS] Recording test results
projectFailed org.apache.ws.commons.axiom:axiom-dom:1.2.15-SNAPSHOT
sessionEnded
[INFO] ------------------------------------------------------------------------
[INFO] Reactor Summary:
[INFO] 
[INFO] Axiom Parent POM .................................. SUCCESS [7.462s]
[INFO] Axiom Build Utilities ............................. SUCCESS [5.179s]
[INFO] Axiom Test Utilities .............................. SUCCESS [6.299s]
[INFO] Axiom Jaxen Test Suite ............................ SUCCESS [3.950s]
[INFO] Axiom DOM Test Suite .............................. SUCCESS [9.900s]
[INFO] Axiom API ......................................... SUCCESS [2:23.140s]
[INFO] Axiom Implementation Test Suite ................... SUCCESS [14.075s]
[INFO] Axiom Common Implementation Classes ............... SUCCESS [5.285s]
[INFO] Axiom Common Implementation Test Suite ............ SUCCESS [3.752s]
[INFO] Axiom Impl ........................................ SUCCESS [5:12.164s]
[INFO] Axiom DOM ......................................... FAILURE [5:05.921s]
[INFO] Axiom Compatibility Classes ....................... SKIPPED
[INFO] Axiom JAXB Integration ............................ SKIPPED
[INFO] Axiom C14N ........................................ SKIPPED
[INFO] Axiom Test Suite .................................. SKIPPED
[INFO] Axiom OSGi Tests .................................. SKIPPED
[INFO] Axiom Integration Test Suite ...................... SKIPPED
[INFO] Axiom Uber-JAR .................................... SKIPPED
[INFO] Axiom Samples ..................................... SKIPPED
[INFO] Axiom ............................................. SKIPPED
[INFO] ------------------------------------------------------------------------
[INFO] BUILD FAILURE
[INFO] --------------------------------------------------------------------channel stopped
Updating AXIOM-62

---------------------------------------------------------------------
To unsubscribe, e-mail: dev-unsubscribe@ws.apache.org
For additional commands, e-mail: dev-help@ws.apache.org


Mime
View raw message