ws-dev mailing list archives

Site index · List index
Message view « Date » · « Thread »
Top « Date » · « Thread »
From Apache Jenkins Server <jenk...@builds.apache.org>
Subject Build failed in Jenkins: ws-axiom-trunk #1347
Date Thu, 10 Jan 2013 19:15:38 GMT
See <https://builds.apache.org/job/ws-axiom-trunk/1347/changes>

Changes:

[veithen] * AXIOM-444: Fixed incompatibility with Spring-WS 2.1.2.
* Fixed a couple of other issues discovered while implementing this.

------------------------------------------
[...truncated 143 lines...]
[INFO] --- gmaven-plugin:1.2:execute (initialize) @ axiom ---
mojoSucceeded org.codehaus.gmaven:gmaven-plugin:1.2(initialize)
mojoStarted org.jacoco:jacoco-maven-plugin:0.6.1.201212231917(prepare-agent-for-surefire)
[INFO] 
[INFO] --- jacoco-maven-plugin:0.6.1.201212231917:prepare-agent (prepare-agent-for-surefire)
@ axiom ---
[INFO] Skipping JaCoCo for project with packaging type 'pom'
[INFO] jacoco.surefireArgLine set to 
mojoSucceeded org.jacoco:jacoco-maven-plugin:0.6.1.201212231917(prepare-agent-for-surefire)
mojoStarted org.apache.maven.plugins:maven-remote-resources-plugin:1.1(default)
[INFO] 
[INFO] --- maven-remote-resources-plugin:1.1:process (default) @ axiom ---
[INFO] Setting property: classpath.resource.loader.class => 'org.codehaus.plexus.velocity.ContextClassLoaderResourceLoader'.
[INFO] Setting property: velocimacro.messages.on => 'false'.
[INFO] Setting property: resource.loader => 'classpath'.
[INFO] Setting property: resource.manager.logwhenfound => 'false'.
mojoSucceeded org.apache.maven.plugins:maven-remote-resources-plugin:1.1(default)
mojoStarted org.codehaus.mojo:build-helper-maven-plugin:1.7(attach-jacoco-exec)[INFO] Skip
attaching artifacts

[INFO] 
[INFO] --- build-helper-maven-plugin:1.7:attach-artifact (attach-jacoco-exec) @ axiom ---
mojoSucceeded org.codehaus.mojo:build-helper-maven-plugin:1.7(attach-jacoco-exec)
mojoStarted org.apache.maven.plugins:maven-assembly-plugin:2.2-beta-5(source-release-assembly)
[INFO] 
[INFO] --- maven-assembly-plugin:2.2-beta-5:single (source-release-assembly) @ axiom ---
[INFO] axiom-1.2.15-SNAPSHOT/ already added, skipping
[INFO] axiom-1.2.15-SNAPSHOT/NOTICE already added, skipping
[INFO] Building zip: <https://builds.apache.org/job/ws-axiom-trunk/ws/axiom/target/axiom-1.2.15-SNAPSHOT-source-release.zip>
[INFO] axiom-1.2.15-SNAPSHOT/ already added, skipping
[INFO] axiom-1.2.15-SNAPSHOT/NOTICE already added, skipping
mojoSucceeded org.apache.maven.plugins:maven-assembly-plugin:2.2-beta-5(source-release-assembly)
forkedProjectStarted org.apache.ws.commons.axiom:axiom:1.2.15-SNAPSHOT
mojoStarted org.apache.maven.plugins:maven-enforcer-plugin:1.1(default)
[INFO] 
[INFO] --- maven-enforcer-plugin:1.1:enforce (default) @ axiom ---
mojoSucceeded org.apache.maven.plugins:maven-enforcer-plugin:1.1(default)
mojoStarted org.codehaus.gmaven:gmaven-plugin:1.2(initialize)
[INFO] 
[INFO] --- gmaven-plugin:1.2:execute (initialize) @ axiom ---
mojoSucceeded org.codehaus.gmaven:gmaven-plugin:1.2(initialize)
mojoStarted org.jacoco:jacoco-maven-plugin:0.6.1.201212231917(prepare-agent-for-surefire)[INFO]
Skipping JaCoCo for project with packaging type 'pom'
[INFO] jacoco.surefireArgLine set to  

[INFO] 
[INFO] --- jacoco-maven-plugin:0.6.1.201212231917:prepare-agent (prepare-agent-for-surefire)
@ axiom ---
mojoSucceeded org.jacoco:jacoco-maven-plugin:0.6.1.201212231917(prepare-agent-for-surefire)
forkedProjectSucceeded org.apache.ws.commons.axiom:axiom:1.2.15-SNAPSHOTJan 10, 2013 7:14:42
PM hudson.maven.ExecutedMojo <init>
WARNING: Failed to getClass for org.apache.maven.plugin.source.SourceJarMojo

mojoStarted org.apache.maven.plugins:maven-source-plugin:2.1.2(attach-sources)
[INFO] 
[INFO] --- maven-source-plugin:2.1.2:jar (attach-sources) @ axiom ---
mojoSucceeded org.apache.maven.plugins:maven-source-plugin:2.1.2(attach-sources)
mojoStarted org.apache.maven.plugins:maven-javadoc-plugin:2.5(attach-javadocs)
[INFO] 
[INFO] --- maven-javadoc-plugin:2.5:jar (attach-javadocs) @ axiom ---
[INFO] Not executing Javadoc as the project is not a Java classpath-capable package
mojoSucceeded org.apache.maven.plugins:maven-javadoc-plugin:2.5(attach-javadocs)
mojoStarted org.codehaus.mojo:animal-sniffer-maven-plugin:1.8(default)Downloading: http://repo.maven.apache.org/maven2/org/codehaus/mojo/animal-sniffer/1.8/animal-sniffer-1.8.pom

[INFO] 
[INFO] --- animal-sniffer-maven-plugin:1.8:check (default) @ axiom ---
Downloaded: http://repo.maven.apache.org/maven2/org/codehaus/mojo/animal-sniffer/1.8/animal-sniffer-1.8.pom
(3 KB at 21.0 KB/sec)
Downloading: http://repo.maven.apache.org/maven2/org/ow2/asm/asm-all/4.0/asm-all-4.0.pom
Downloaded: http://repo.maven.apache.org/maven2/org/ow2/asm/asm-all/4.0/asm-all-4.0.pom (2
KB at 14.7 KB/sec)
Downloading: http://repo.maven.apache.org/maven2/org/ow2/asm/asm-parent/4.0/asm-parent-4.0.pom
Downloaded: http://repo.maven.apache.org/maven2/org/ow2/asm/asm-parent/4.0/asm-parent-4.0.pom
(6 KB at 487.7 KB/sec)
Downloading: http://repo.maven.apache.org/maven2/org/codehaus/mojo/java-boot-classpath-detector/1.8/java-boot-classpath-detector-1.8.pom
Downloaded: http://repo.maven.apache.org/maven2/org/codehaus/mojo/java-boot-classpath-detector/1.8/java-boot-classpath-detector-1.8.pom
(3 KB at 38.4 KB/sec)
Downloading: http://repo.maven.apache.org/maven2/org/apache/maven/maven-plugin-api/2.0.1/maven-plugin-api-2.0.1.pom
Downloaded: http://repo.maven.apache.org/maven2/org/apache/maven/maven-plugin-api/2.0.1/maven-plugin-api-2.0.1.pom
(643 B at 34.9 KB/sec)
Downloading: http://repo.maven.apache.org/maven2/org/apache/maven/maven/2.0.1/maven-2.0.1.pom
Downloaded: http://repo.maven.apache.org/maven2/org/apache/maven/maven/2.0.1/maven-2.0.1.pom
(12 KB at 1122.9 KB/sec)
Downloading: http://repo.maven.apache.org/maven2/org/apache/maven/maven-core/2.0.1/maven-core-2.0.1.pom
Downloaded: http://repo.maven.apache.org/maven2/org/apache/maven/maven-core/2.0.1/maven-core-2.0.1.pom
(6 KB at 509.7 KB/sec)
Downloading: http://repo.maven.apache.org/maven2/org/apache/maven/maven-settings/2.0.1/maven-settings-2.0.1.pom
Downloaded: http://repo.maven.apache.org/maven2/org/apache/maven/maven-settings/2.0.1/maven-settings-2.0.1.pom
(2 KB at 23.2 KB/sec)
Downloading: http://repo.maven.apache.org/maven2/org/apache/maven/maven-model/2.0.1/maven-model-2.0.1.pom
Downloaded: http://repo.maven.apache.org/maven2/org/apache/maven/maven-model/2.0.1/maven-model-2.0.1.pom
(3 KB at 275.6 KB/sec)
Downloading: http://repo.maven.apache.org/maven2/org/codehaus/plexus/plexus-utils/1.0.5/plexus-utils-1.0.5.pom
Downloaded: http://repo.maven.apache.org/maven2/org/codehaus/plexus/plexus-utils/1.0.5/plexus-utils-1.0.5.pom
(918 B at 1.5 KB/sec)
Downloading: http://repo.maven.apache.org/maven2/org/apache/maven/maven-plugin-parameter-documenter/2.0.1/maven-plugin-parameter-documenter-2.0.1.pom
Downloaded: http://repo.maven.apache.org/maven2/org/apache/maven/maven-plugin-parameter-documenter/2.0.1/maven-plugin-parameter-documenter-2.0.1.pom
(2 KB at 31.4 KB/sec)
Downloading: http://repo.maven.apache.org/maven2/org/apache/maven/reporting/maven-reporting-api/2.0.1/maven-reporting-api-2.0.1.pom
Downloaded: http://repo.maven.apache.org/maven2/org/apache/maven/reporting/maven-reporting-api/2.0.1/maven-reporting-api-2.0.1.pom
(902 B at 51.8 KB/sec)
Downloading: http://repo.maven.apache.org/maven2/org/apache/maven/reporting/maven-reporting/2.0.1/maven-reporting-2.0.1.pom
Downloaded: http://repo.maven.apache.org/maven2/org/apache/maven/reporting/maven-reporting/2.0.1/maven-reporting-2.0.1.pom
(546 B at 35.5 KB/sec)
Downloading: http://repo.maven.apache.org/maven2/org/apache/maven/doxia/doxia-sink-api/1.0-alpha-6/doxia-sink-api-1.0-alpha-6.pom
Downloaded: http://repo.maven.apache.org/maven2/org/apache/maven/doxia/doxia-sink-api/1.0-alpha-6/doxia-sink-api-1.0-alpha-6.pom
(386 B at 25.1 KB/sec)
Downloading: http://repo.maven.apache.org/maven2/org/apache/maven/doxia/doxia/1.0-alpha-6/doxia-1.0-alpha-6.pom
Downloaded: http://repo.maven.apache.org/maven2/org/apache/maven/doxia/doxia/1.0-alpha-6/doxia-1.0-alpha-6.pom
(4 KB at 47.0 KB/sec)
Downloading: http://repo.maven.apache.org/maven2/org/apache/maven/maven-profile/2.0.1/maven-profile-2.0.1.pom
Downloaded: http://repo.maven.apache.org/maven2/org/apache/maven/maven-profile/2.0.1/maven-profile-2.0.1.pom
(2 KB at 157.9 KB/sec)
Downloading: http://repo.maven.apache.org/maven2/org/apache/maven/maven-artifact/2.0.1/maven-artifact-2.0.1.pom
Downloaded: http://repo.maven.apache.org/maven2/org/apache/maven/maven-artifact/2.0.1/maven-artifact-2.0.1.pom
(765 B at 93.4 KB/sec)
Downloading: http://repo.maven.apache.org/maven2/org/apache/maven/maven-repository-metadata/2.0.1/maven-repository-metadata-2.0.1.pom
Downloaded: http://repo.maven.apache.org/maven2/org/apache/maven/maven-repository-metadata/2.0.1/maven-repository-metadata-2.0.1.pom
(2 KB at 159.7 KB/sec)
Downloading: http://repo.maven.apache.org/maven2/org/apache/maven/maven-error-diagnostics/2.0.1/maven-error-diagnostics-2.0.1.pom
Downloaded: http://repo.maven.apache.org/maven2/org/apache/maven/maven-error-diagnostics/2.0.1/maven-error-diagnostics-2.0.1.pom
(854 B at 64.2 KB/sec)
Downloading: http://repo.maven.apache.org/maven2/org/apache/maven/maven-project/2.0.1/maven-project-2.0.1.pom
Downloaded: http://repo.maven.apache.org/maven2/org/apache/maven/maven-project/2.0.1/maven-project-2.0.1.pom
(2 KB at 43.4 KB/sec)
Downloading: http://repo.maven.apache.org/maven2/org/apache/maven/maven-artifact-manager/2.0.1/maven-artifact-manager-2.0.1.pom
Downloaded: http://repo.maven.apache.org/maven2/org/apache/maven/maven-artifact-manager/2.0.1/maven-artifact-manager-2.0.1.pom
(2 KB at 151.4 KB/sec)
Downloading: http://repo.maven.apache.org/maven2/org/apache/maven/maven-plugin-registry/2.0.1/maven-plugin-registry-2.0.1.pom
Downloaded: http://repo.maven.apache.org/maven2/org/apache/maven/maven-plugin-registry/2.0.1/maven-plugin-registry-2.0.1.pom
(2 KB at 36.0 KB/sec)
Downloading: http://repo.maven.apache.org/maven2/org/apache/maven/maven-plugin-descriptor/2.0.1/maven-plugin-descriptor-2.0.1.pom
Downloaded: http://repo.maven.apache.org/maven2/org/apache/maven/maven-plugin-descriptor/2.0.1/maven-plugin-descriptor-2.0.1.pom
(2 KB at 151.0 KB/sec)
Downloading: http://repo.maven.apache.org/maven2/org/apache/maven/maven-monitor/2.0.1/maven-monitor-2.0.1.pom
Downloaded: http://repo.maven.apache.org/maven2/org/apache/maven/maven-monitor/2.0.1/maven-monitor-2.0.1.pom
(442 B at 54.0 KB/sec)
Downloading: http://repo.maven.apache.org/maven2/org/codehaus/mojo/animal-sniffer/1.8/animal-sniffer-1.8.jar
Downloading: http://repo.maven.apache.org/maven2/org/ow2/asm/asm-all/4.0/asm-all-4.0.jar
Downloading: http://repo.maven.apache.org/maven2/org/codehaus/mojo/java-boot-classpath-detector/1.8/java-boot-classpath-detector-1.8.jar
Downloading: http://repo.maven.apache.org/maven2/org/apache/maven/reporting/maven-reporting-api/2.0.1/maven-reporting-api-2.0.1.jar
Downloading: http://repo.maven.apache.org/maven2/org/apache/maven/doxia/doxia-sink-api/1.0-alpha-6/doxia-sink-api-1.0-alpha-6.jar
Downloaded: http://repo.maven.apache.org/maven2/org/apache/maven/reporting/maven-reporting-api/2.0.1/maven-reporting-api-2.0.1.jar
(6 KB at 185.7 KB/sec)
Downloaded: http://repo.maven.apache.org/maven2/org/apache/maven/doxia/doxia-sink-api/1.0-alpha-6/doxia-sink-api-1.0-alpha-6.jar
(4 KB at 94.1 KB/sec)
Downloaded: http://repo.maven.apache.org/maven2/org/codehaus/mojo/java-boot-classpath-detector/1.8/java-boot-classpath-detector-1.8.jar
(5 KB at 54.5 KB/sec)
Downloaded: http://repo.maven.apache.org/maven2/org/codehaus/mojo/animal-sniffer/1.8/animal-sniffer-1.8.jar
(27 KB at 301.4 KB/sec)
Downloaded: http://repo.maven.apache.org/maven2/org/ow2/asm/asm-all/4.0/asm-all-4.0.jar (208
KB at 582.0 KB/sec)
[INFO] Checking unresolved references to org.codehaus.mojo.signature:java15:1.0
Downloading: http://repo.maven.apache.org/maven2/org/codehaus/mojo/signature/java15/1.0/java15-1.0.signature
Downloaded: http://repo.maven.apache.org/maven2/org/codehaus/mojo/signature/java15/1.0/java15-1.0.signature
(506 KB at 8712.6 KB/sec)
mojoSucceeded org.codehaus.mojo:animal-sniffer-maven-plugin:1.8(default)
mojoStarted org.apache.maven.plugins:maven-gpg-plugin:1.1(default)
[INFO] 
[INFO] --- maven-gpg-plugin:1.1:sign (default) @ axiom ---
mojoSucceeded org.apache.maven.plugins:maven-gpg-plugin:1.1(default)
mojoStarted org.apache.rat:apache-rat-plugin:0.8(default)
[INFO] 
[INFO] --- apache-rat-plugin:0.8:check (default) @ axiom ---
[INFO] Exclude: RELEASE-NOTE.txt
[INFO] Exclude: **/*.svg
[INFO] Exclude: legal/jaxen-LICENSE.txt
[INFO] Exclude: legal/stax2-api-LICENSE.txt
[INFO] Exclude: *.sonarj
[INFO] Exclude: release.properties
[INFO] Exclude: src/test/resources/**
[INFO] Exclude: dependency-reduced-pom.xml
mojoFailed org.apache.rat:apache-rat-plugin:0.8(default)
projectFailed org.apache.ws.commons.axiom:axiom:1.2.15-SNAPSHOT
sessionEnded
[INFO] ------------------------------------------------------------------------
[INFO] Reactor Summary:
[INFO] 
[INFO] Axiom ............................................. FAILURE [1:30.053s]
[INFO] Axiom Build Utilities ............................. SKIPPED
[INFO] Axiom Test Utilities .............................. SKIPPED
[INFO] Axiom Jaxen Test Suite ............................ SKIPPED
[INFO] Axiom DOM Test Suite .............................. SKIPPED
[INFO] Axiom API ......................................... SKIPPED
[INFO] Axiom Implementation Test Suite ................... SKIPPED
[INFO] Axiom Common Implementation Classes ............... SKIPPED
[INFO] Axiom Common Implementation Test Suite ............ SKIPPED
[INFO] Axiom Impl ........................................ SKIPPED
[INFO] Axiom DOM ......................................... SKIPPED
[INFO] Axiom Compatibility Classes ....................... SKIPPED
[INFO] Axiom JAXB Integration ............................ SKIPPED
[INFO] Axiom C14N ........................................ SKIPPED
[INFO] Axiom Test Suite .................................. SKIPPED
[INFO] Axiom Integration Test Suite ...................... SKIPPED
[INFO] Axiom Uber-JAR .................................... SKIPPED
[INFO] Axiom Samples ..................................... SKIPPED
[INFO] System Tests ...................................... SKIPPED
[INFO] JBoss Tests ....................................... SKIPPED
[INFO] Axiom OSGi Tests .................................. SKIPPED
[INFO] Spring WS Tests ................................... SKIPPED
[INFO] Developer Guide ................................... SKIPPED
[INFO] User Guide ........................................ SKIPPED
[INFO] Javadoc ........................................... SKIPPED
[INFO] Distribution ...................................... SKIPPED
[INFO] Code Coverage Report .............................. SKIPPED
[INFO] ------------------------------------------------------------------------
[INFO] BUILD FAILURE
[INFO] ------------------------------------------------------------------------
[INFO] Total time: 1:35.474s
[INFO] Finished at: Thu Jan 10 19:14:55 UTC 2013
[INFO] Final Memory: 26M/163M
[INFO] ------------------------------------------------------------------------
Projects to build: [MavenProject: org.apache.ws.commons.axiom:axiom:1.2.15-SNAPSHOT @ <https://builds.apache.org/job/ws-axiom-trunk/ws/axiom/pom.xml,>
MavenProject: org.apache.ws.commons.axiom:axiom-buildutils:1.2.15-SNAPSHOT @ <https://builds.apache.org/job/ws-axiom-trunk/ws/axiom/modules/axiom-buildutils/pom.xml,>
MavenProject: org.apache.ws.commons.axiom:axiom-testutils:1.2.15-SNAPSHOT @ <https://builds.apache.org/job/ws-axiom-trunk/ws/axiom/modules/axiom-testutils/pom.xml,>
MavenProject: org.apache.ws.commons.axiom:axiom-jaxen-testsuite:1.2.15-SNAPSHOT @ <https://builds.apache.org/job/ws-axiom-trunk/ws/axiom/modules/axiom-jaxen-testsuite/pom.xml,>
MavenProject: org.apache.ws.commons.axiom:axiom-dom-testsuite:1.2.15-SNAPSHOT @ <https://builds.apache.org/job/ws-axiom-trunk/ws/axiom/modules/axiom-dom-testsuite/pom.xml,>
MavenProject: org.apache.ws.commons.axiom:axiom-api:1.2.15-SNAPSHOT @ <https://builds.apache.org/job/ws-axiom-trunk/ws/axiom/modules/axiom-api/pom.xml,>
MavenProject: org.apache.ws.commons.axiom:axiom-testsuite:1.2.15-SNAPSHOT @ <https://builds.apache.org/job/ws-axiom-trunk/ws/axiom/modules/axiom-testsuite/pom.xml,>
MavenProject: org.apache.ws.commons.axiom:axiom-common-impl:1.2.15-SNAPSHOT @ <https://builds.apache.org/job/ws-axiom-trunk/ws/axiom/modules/axiom-common-impl/pom.xml,>
MavenProject: org.apache.ws.commons.axiom:axiom-common-impl-testsuite:1.2.15-SNAPSHOT @ <https://builds.apache.org/job/ws-axiom-trunk/ws/axiom/modules/axiom-common-impl-testsuite/pom.xml,>
MavenProject: org.apache.ws.commons.axiom:axiom-impl:1.2.15-SNAPSHOT @ <https://builds.apache.org/job/ws-axiom-trunk/ws/axiom/modules/axiom-impl/pom.xml,>
MavenProject: org.apache.ws.commons.axiom:axiom-dom:1.2.15-SNAPSHOT @ <https://builds.apache.org/job/ws-axiom-trunk/ws/axiom/modules/axiom-dom/pom.xml,>
MavenProject: org.apache.ws.commons.axiom:axiom-compat:1.2.15-SNAPSHOT @ <https://builds.apache.org/job/ws-axiom-trunk/ws/axiom/modules/axiom-compat/pom.xml,>
MavenProject: org.apache.ws.commons.axiom:axiom-jaxb:1.2.15-SNAPSHOT @ <https://builds.apache.org/job/ws-axiom-trunk/ws/axiom/modules/axiom-jaxb/pom.xml,>
MavenProject: org.apache.ws.commons.axiom:axiom-c14n:1.2.15-SNAPSHOT @ <https://builds.apache.org/job/ws-axiom-trunk/ws/axiom/modules/axiom-c14n/pom.xml,>
MavenProject: org.apache.ws.commons.axiom:axiom-tests:1.2.15-SNAPSHOT @ <https://builds.apache.org/job/ws-axiom-trunk/ws/axiom/modules/axiom-tests/pom.xml,>
MavenProject: org.apache.ws.commons.axiom:axiom-integration:1.2.15-SNAPSHOT @ <https://builds.apache.org/job/ws-axiom-trunk/ws/axiom/modules/axiom-integration/pom.xml,>
MavenProject: org.apache.ws.commons.axiom:axiom-all:1.2.15-SNAPSHOT @ <https://builds.apache.org/job/ws-axiom-trunk/ws/axiom/modules/axiom-all/pom.xml,>
MavenProject: org.apache.ws.commons.axiom:axiom-samples:1.2.15-SNAPSHOT @ <https://builds.apache.org/job/ws-axiom-trunk/ws/axiom/modules/axiom-samples/pom.xml,>
MavenProject: org.apache.ws.commons.axiom:systests:1.2.15-SNAPSHOT @ <https://builds.apache.org/job/ws-axiom-trunk/ws/axiom/systests/pom.xml,>
MavenProject: org.apache.ws.commons.axiom:jboss-tests:1.2.15-SNAPSHOT @ <https://builds.apache.org/job/ws-axiom-trunk/ws/axiom/systests/jboss-tests/pom.xml,>
MavenProject: org.apache.ws.commons.axiom:osgi-tests:1.2.15-SNAPSHOT @ <https://builds.apache.org/job/ws-axiom-trunk/ws/axiom/systests/osgi-tests/pom.xml,>
MavenProject: org.apache.ws.commons.axiom:spring-ws-tests:1.2.15-SNAPSHOT @ <https://builds.apache.org/job/ws-axiom-trunk/ws/axiom/systests/spring-ws-tests/pom.xml,>
MavenProject: org.apache.ws.commons.axiom:devguide:1.2.15-SNAPSHOT @ <https://builds.apache.org/job/ws-axiom-trunk/ws/axiom/devguide/pom.xml,>
MavenProject: org.apache.ws.commons.axiom:userguide:1.2.15-SNAPSHOT @ <https://builds.apache.org/job/ws-axiom-trunk/ws/axiom/userguide/pom.xml,>
MavenProject: org.apache.ws.commons.axiom:apidocs:1.2.15-SNAPSHOT @ <https://builds.apache.org/job/ws-axiom-trunk/ws/axiom/apidocs/pom.xml,>
MavenProject: org.apache.ws.commons.axiom:distribution:1.2.15-SNAPSHOT @ <https://builds.apache.org/job/ws-axiom-trunk/ws/axiom/distribution/pom.xml,>
MavenProject: org.apache.ws.commons.axiom:code-coverage:1.2.15-SNAPSHOT @ <https://builds.apache.org/job/ws-axiom-trunk/ws/axiom/code-coverage/pom.xml]>
[JENKINS] Archiving <https://builds.apache.org/job/ws-axiom-trunk/ws/axiom/userguide/pom.xml>
to /home/hudson/hudson/jobs/ws-axiom-trunk/modules/org.apache.ws.commons.axiom$userguide/builds/2013-01-10_19-13-03/archive/org.apache.ws.commons.axiom/userguide/1.2.15-SNAPSHOT/userguide-1.2.15-SNAPSHOT.pom
[JENKINS] Archiving <https://builds.apache.org/job/ws-axiom-trunk/ws/axiom/modules/axiom-dom-testsuite/pom.xml>
to /home/hudson/hudson/jobs/ws-axiom-trunk/modules/org.apache.ws.commons.axiom$axiom-dom-testsuite/builds/2013-01-10_19-13-02/archive/org.apache.ws.commons.axiom/axiom-dom-testsuite/1.2.15-SNAPSHOT/axiom-dom-testsuite-1.2.15-SNAPSHOT.pom
[JENKINS] Archiving <https://builds.apache.org/job/ws-axiom-trunk/ws/axiom/modules/axiom-common-impl-testsuite/pom.xml>
to /home/hudson/hudson/jobs/ws-axiom-trunk/modules/org.apache.ws.commons.axiom$axiom-common-impl-testsuite/builds/2013-01-10_19-13-02/archive/org.apache.ws.commons.axiom/axiom-common-impl-testsuite/1.2.15-SNAPSHOT/axiom-common-impl-testsuite-1.2.15-SNAPSHOT.pom
[JENKINS] Archiving <https://builds.apache.org/job/ws-axiom-trunk/ws/axiom/modules/axiom-impl/pom.xml>
to /home/hudson/hudson/jobs/ws-axiom-trunk/modules/org.apache.ws.commons.axiom$axiom-impl/builds/2013-01-10_19-13-02/archive/org.apache.ws.commons.axiom/axiom-impl/1.2.15-SNAPSHOT/axiom-impl-1.2.15-SNAPSHOT.pom
[JENKINS] Archiving <https://builds.apache.org/job/ws-axiom-trunk/ws/axiom/distribution/pom.xml>
to /home/hudson/hudson/jobs/ws-axiom-trunk/modules/org.apache.ws.commons.axiom$distribution/builds/2013-01-10_19-13-03/archive/org.apache.ws.commons.axiom/distribution/1.2.15-SNAPSHOT/distribution-1.2.15-SNAPSHOT.pom
[JENKINS] Archiving <https://builds.apache.org/job/ws-axiom-trunk/ws/axiom/code-coverage/pom.xml>
to /home/hudson/hudson/jobs/ws-axiom-trunk/modules/org.apache.ws.commons.axiom$code-coverage/builds/2013-01-10_19-13-03/archive/org.apache.ws.commons.axiom/code-coverage/1.2.15-SNAPSHOT/code-coverage-1.2.15-SNAPSHOT.pom
[JENKINS] Archiving <https://builds.apache.org/job/ws-axiom-trunk/ws/axiom/systests/pom.xml>
to /home/hudson/hudson/jobs/ws-axiom-trunk/modules/org.apache.ws.commons.axiom$systests/builds/2013-01-10_19-13-03/archive/org.apache.ws.commons.axiom/systests/1.2.15-SNAPSHOT/systests-1.2.15-SNAPSHOT.pom
[JENKINS] Archiving <https://builds.apache.org/job/ws-axiom-trunk/ws/axiom/modules/axiom-samples/pom.xml>
to /home/hudson/hudson/jobs/ws-axiom-trunk/modules/org.apache.ws.commons.axiom$axiom-samples/builds/2013-01-10_19-13-03/archive/org.apache.ws.commons.axiom/axiom-samples/1.2.15-SNAPSHOT/axiom-samples-1.2.15-SNAPSHOT.pom
[JENKINS] Archiving <https://builds.apache.org/job/ws-axiom-trunk/ws/axiom/systests/spring-ws-tests/pom.xml>
to /home/hudson/hudson/jobs/ws-axiom-trunk/modules/org.apache.ws.commons.axiom$spring-ws-tests/builds/2013-01-10_19-13-03/archive/org.apache.ws.commons.axiom/spring-ws-tests/1.2.15-SNAPSHOT/spring-ws-tests-1.2.15-SNAPSHOT.pom
[JENKINS] Archiving <https://builds.apache.org/job/ws-axiom-trunk/ws/axiom/modules/axiom-integration/pom.xml>
to /home/hudson/hudson/jobs/ws-axiom-trunk/modules/org.apache.ws.commons.axiom$axiom-integration/builds/2013-01-10_19-13-03/archive/org.apache.ws.commons.axiom/axiom-integration/1.2.15-SNAPSHOT/axiom-integration-1.2.15-SNAPSHOT.pom
[JENKINS] Archiving <https://builds.apache.org/job/ws-axiom-trunk/ws/axiom/modules/axiom-testsuite/pom.xml>
to /home/hudson/hudson/jobs/ws-axiom-trunk/modules/org.apache.ws.commons.axiom$axiom-testsuite/builds/2013-01-10_19-13-02/archive/org.apache.ws.commons.axiom/axiom-testsuite/1.2.15-SNAPSHOT/axiom-testsuite-1.2.15-SNAPSHOT.pom
[JENKINS] Archiving <https://builds.apache.org/job/ws-axiom-trunk/ws/axiom/modules/axiom-jaxb/pom.xml>
to /home/hudson/hudson/jobs/ws-axiom-trunk/modules/org.apache.ws.commons.axiom$axiom-jaxb/builds/2013-01-10_19-13-03/archive/org.apache.ws.commons.axiom/axiom-jaxb/1.2.15-SNAPSHOT/axiom-jaxb-1.2.15-SNAPSHOT.pom
[JENKINS] Archiving <https://builds.apache.org/job/ws-axiom-trunk/ws/axiom/modules/axiom-testutils/pom.xml>
to /home/hudson/hudson/jobs/ws-axiom-trunk/modules/org.apache.ws.commons.axiom$axiom-testutils/builds/2013-01-10_19-13-01/archive/org.apache.ws.commons.axiom/axiom-testutils/1.2.15-SNAPSHOT/axiom-testutils-1.2.15-SNAPSHOT.pom
[JENKINS] Archiving <https://builds.apache.org/job/ws-axiom-trunk/ws/axiom/modules/axiom-buildutils/pom.xml>
to /home/hudson/hudson/jobs/ws-axiom-trunk/modules/org.apache.ws.commons.axiom$axiom-buildutils/builds/2013-01-10_19-13-01/archive/org.apache.ws.commons.axiom/axiom-buildutils/1.2.15-SNAPSHOT/axiom-buildutils-1.2.15-SNAPSHOT.pom
[JENKINS] Archiving <https://builds.apache.org/job/ws-axiom-trunk/ws/axiom/modules/axiom-dom/pom.xml>
to /home/hudson/hudson/jobs/ws-axiom-trunk/modules/org.apache.ws.commons.axiom$axiom-dom/builds/2013-01-10_19-13-02/archive/org.apache.ws.commons.axiom/axiom-dom/1.2.15-SNAPSHOT/axiom-dom-1.2.15-SNAPSHOT.pom
[JENKINS] Archiving <https://builds.apache.org/job/ws-axiom-trunk/ws/axiom/modules/axiom-all/pom.xml>
to /home/hudson/hudson/jobs/ws-axiom-trunk/modules/org.apache.ws.commons.axiom$axiom-all/builds/2013-01-10_19-13-03/archive/org.apache.ws.commons.axiom/axiom-all/1.2.15-SNAPSHOT/axiom-all-1.2.15-SNAPSHOT.pom
[JENKINS] Archiving <https://builds.apache.org/job/ws-axiom-trunk/ws/axiom/modules/axiom-api/pom.xml>
to /home/hudson/hudson/jobs/ws-axiom-trunk/modules/org.apache.ws.commons.axiom$axiom-api/builds/2013-01-10_19-13-02/archive/org.apache.ws.commons.axiom/axiom-api/1.2.15-SNAPSHOT/axiom-api-1.2.15-SNAPSHOT.pom
[JENKINS] Archiving <https://builds.apache.org/job/ws-axiom-trunk/ws/axiom/apidocs/pom.xml>
to /home/hudson/hudson/jobs/ws-axiom-trunk/modules/org.apache.ws.commons.axiom$apidocs/builds/2013-01-10_19-13-03/archive/org.apache.ws.commons.axiom/apidocs/1.2.15-SNAPSHOT/apidocs-1.2.15-SNAPSHOT.pom
[JENKINS] Archiving <https://builds.apache.org/job/ws-axiom-trunk/ws/axiom/modules/axiom-jaxen-testsuite/pom.xml>
to /home/hudson/hudson/jobs/ws-axiom-trunk/modules/org.apache.ws.commons.axiom$axiom-jaxen-testsuite/builds/2013-01-10_19-13-02/archive/org.apache.ws.commons.axiom/axiom-jaxen-testsuite/1.2.15-SNAPSHOT/axiom-jaxen-testsuite-1.2.15-SNAPSHOT.pom
[JENKINS] Archiving <https://builds.apache.org/job/ws-axiom-trunk/ws/axiom/modules/axiom-tests/pom.xml>
to /home/hudson/hudson/jobs/ws-axiom-trunk/modules/org.apache.ws.commons.axiom$axiom-tests/builds/2013-01-10_19-13-03/archive/org.apache.ws.commons.axiom/axiom-tests/1.2.15-SNAPSHOT/axiom-tests-1.2.15-SNAPSHOT.pom
[JENKINS] Archiving <https://builds.apache.org/job/ws-axiom-trunk/ws/axiom/systests/osgi-tests/pom.xml>
to /home/hudson/hudson/jobs/ws-axiom-trunk/modules/org.apache.ws.commons.axiom$osgi-tests/builds/2013-01-10_19-13-03/archive/org.apache.ws.commons.axiom/osgi-tests/1.2.15-SNAPSHOT/osgi-tests-1.2.15-SNAPSHOT.pom
[JENKINS] Archiving <https://builds.apache.org/job/ws-axiom-trunk/ws/axiom/modules/axiom-common-impl/pom.xml>
to /home/hudson/hudson/jobs/ws-axiom-trunk/modules/org.apache.ws.commons.axiom$axiom-common-impl/builds/2013-01-10_19-13-02/archive/org.apache.ws.commons.axiom/axiom-common-impl/1.2.15-SNAPSHOT/axiom-common-impl-1.2.15-SNAPSHOT.pom
[JENKINS] Archiving <https://builds.apache.org/job/ws-axiom-trunk/ws/axiom/pom.xml>
to /home/hudson/hudson/jobs/ws-axiom-trunk/modules/org.apache.ws.commons.axiom$axiom/builds/2013-01-10_19-13-01/archive/org.apache.ws.commons.axiom/axiom/1.2.15-SNAPSHOT/axiom-1.2.15-SNAPSHOT.pom
[JENKINS] Archiving <https://builds.apache.org/job/ws-axiom-trunk/ws/axiom/target/axiom-1.2.15-SNAPSHOT-source-release.zip>
to /home/hudson/hudson/jobs/ws-axiom-trunk/modules/org.apache.ws.commons.axiom$axiom/builds/2013-01-10_19-13-01/archive/org.apache.ws.commons.axiom/axiom/1.2.15-SNAPSHOT/axiom-1.2.15-SNAPSHOT-source-release.zip
[JENKINS] Archiving <https://builds.apache.org/job/ws-axiom-trunk/ws/axiom/modules/axiom-compat/pom.xml>
to /home/hudson/hudson/jobs/ws-axiom-trunk/modules/org.apache.ws.commons.axiom$axiom-compat/builds/2013-01-10_19-13-02/archive/org.apache.ws.commons.axiom/axiom-compat/1.2.15-SNAPSHOT/axiom-compat-1.2.15-SNAPSHOT.pom
[JENKINS] Archiving <https://builds.apache.org/job/ws-axiom-trunk/ws/axiom/systests/jboss-tests/pom.xml>
to /home/hudson/hudson/jobs/ws-axiom-trunk/modules/org.apache.ws.commons.axiom$jboss-tests/builds/2013-01-10_19-13-03/archive/org.apache.ws.commons.axiom/jboss-tests/1.2.15-SNAPSHOT/jboss-tests-1.2.15-SNAPSHOT.pom
[JENKINS] Archiving <https://builds.apache.org/job/ws-axiom-trunk/ws/axiom/modules/axiom-c14n/pom.xml>
to /home/hudson/hudson/jobs/ws-axiom-trunk/modules/org.apache.ws.commons.axiom$axiom-c14n/builds/2013-01-10_19-13-03/archive/org.apache.ws.commons.axiom/axiom-c14n/1.2.15-SNAPSHOT/axiom-c14n-1.2.15-SNAPSHOT.pom
[JENKINS] Archiving <https://builds.apache.org/job/ws-axiom-trunk/ws/axiom/devguide/pom.xml>
to /home/hudson/hudson/jobs/ws-axiom-trunk/modules/org.apache.ws.commons.axiom$devguide/builds/2013-01-10_19-13-03/archive/org.apache.ws.commons.axiom/devguide/1.2.15-SNAPSHOT/devguide-1.2.15-SNAPSHOT.pom
Waiting for Jenkins to finish collecting data
mavenExecutionResult exceptions not empty
message : Failed to execute goal org.apache.rat:apache-rat-plugin:0.8:check (default) on project
axiom: Too many unapproved licenses: 143
cause : Too many unapproved licenses: 143
Stack trace : 
org.apache.maven.lifecycle.LifecycleExecutionException: Failed to execute goal org.apache.rat:apache-rat-plugin:0.8:check
(default) on project axiom: Too many unapproved licenses: 143
	at org.apache.maven.lifecycle.internal.MojoExecutor.execute(MojoExecutor.java:213)
	at org.apache.maven.lifecycle.internal.MojoExecutor.execute(MojoExecutor.java:153)
	at org.apache.maven.lifecycle.internal.MojoExecutor.execute(MojoExecutor.java:145)
	at org.apache.maven.lifecycle.internal.LifecycleModuleBuilder.buildProject(LifecycleModuleBuilder.java:84)
	at org.apache.maven.lifecycle.internal.LifecycleModuleBuilder.buildProject(LifecycleModuleBuilder.java:59)
	at org.apache.maven.lifecycle.internal.LifecycleStarter.singleThreadedBuild(LifecycleStarter.java:183)
	at org.apache.maven.lifecycle.internal.LifecycleStarter.execute(LifecycleStarter.java:161)
	at org.apache.maven.DefaultMaven.doExecute(DefaultMaven.java:320)
	at org.apache.maven.DefaultMaven.execute(DefaultMaven.java:156)
	at org.jvnet.hudson.maven3.launcher.Maven3Launcher.main(Maven3Launcher.java:79)
	at sun.reflect.NativeMethodAccessorImpl.invoke0(Native Method)
	at sun.reflect.NativeMethodAccessorImpl.invoke(NativeMethodAccessorImpl.java:39)
	at sun.reflect.DelegatingMethodAccessorImpl.invoke(DelegatingMethodAccessorImpl.java:25)
	at java.lang.reflect.Method.invoke(Method.java:597)
	at org.codehaus.plexus.classworlds.launcher.Launcher.launchStandard(Launcher.java:329)
	at org.codehaus.plexus.classworlds.launcher.Launcher.launch(Launcher.java:239)
	at org.jvnet.hudson.maven3.agent.Maven3Main.launch(Maven3Main.java:158)
	at hudson.maven.Maven3Builder.call(Maven3Builder.java:100)
	at hudson.maven.Maven3Builder.call(Maven3Builder.java:66)
	at hudson.remoting.UserRequest.perform(UserRequest.java:118)
	at hudson.remoting.UserRequest.perform(UserRequest.java:48)
	at hudson.remoting.Request$2.run(Request.java:326)
	at hudson.remoting.InterceptingExecutorService$1.call(InterceptingExecutorService.java:72)
	at java.util.concurrent.FutureTask$Sync.innerRun(FutureTask.java:303)
	at java.util.concurrent.FutureTask.run(FutureTask.java:138)
	at java.util.concurrent.ThreadPoolExecutor$Worker.runTask(ThreadPoolExecutor.java:886)
	at java.util.concurrent.ThreadPoolExecutor$Worker.run(ThreadPoolExecutor.java:908)
	at java.lang.Thread.run(Thread.java:662)
Caused by: org.apache.rat.mp.RatCheckException: Too many unapproved licenses: 143
	at org.apache.rat.mp.RatCheckMojo.check(RatCheckMojo.java:167)
	at org.apache.rat.mp.RatCheckMojo.execute(RatCheckMojo.java:159)
	at org.apache.maven.plugin.DefaultBuildPluginManager.executeMojo(DefaultBuildPluginManager.java:101)
	at org.apache.maven.lifecycle.internal.MojoExecutor.execute(MojoExecutor.java:209)
	... 27 more
Sending e-mails to: dev@ws.apache.org
channel stopped
Updating AXIOM-444

---------------------------------------------------------------------
To unsubscribe, e-mail: dev-unsubscribe@ws.apache.org
For additional commands, e-mail: dev-help@ws.apache.org


Mime
View raw message