ws-dev mailing list archives

Site index · List index
Message view « Date » · « Thread »
Top « Date » · « Thread »
From Apache Jenkins Server <jenk...@builds.apache.org>
Subject Build failed in Jenkins: wss4j-trunk #470
Date Mon, 01 Apr 2013 20:35:15 GMT
See <https://builds.apache.org/job/wss4j-trunk/470/changes>

Changes:

[giger] cleanups

[giger] refactoring SecurityToken stuff

------------------------------------------
[...truncated 1948 lines...]
symbol  : class TokenType
location: class org.apache.wss4j.stax.securityToken.WSSecurityTokenConstants
[ERROR] <https://builds.apache.org/job/wss4j-trunk/ws/wss4j/ws-security-stax/src/main/java/org/apache/wss4j/stax/securityToken/WSSecurityTokenConstants.java>:[57,24]
cannot find symbol
symbol  : class TokenType
location: class org.apache.wss4j.stax.securityToken.WSSecurityTokenConstants
[ERROR] <https://builds.apache.org/job/wss4j-trunk/ws/wss4j/ws-security-stax/src/main/java/org/apache/wss4j/stax/securityToken/WSSecurityTokenConstants.java>:[58,24]
cannot find symbol
symbol  : class TokenType
location: class org.apache.wss4j.stax.securityToken.WSSecurityTokenConstants
[ERROR] <https://builds.apache.org/job/wss4j-trunk/ws/wss4j/ws-security-stax/src/main/java/org/apache/wss4j/stax/ext/WSSSecurityProperties.java>:[70,36]
cannot find symbol
symbol  : class KeyIdentifier
location: class org.apache.wss4j.stax.securityToken.WSSecurityTokenConstants
[ERROR] <https://builds.apache.org/job/wss4j-trunk/ws/wss4j/ws-security-stax/src/main/java/org/apache/wss4j/stax/ext/WSSSecurityProperties.java>:[96,36]
cannot find symbol
symbol  : class KeyIdentifier
location: class org.apache.wss4j.stax.securityToken.WSSecurityTokenConstants
[ERROR] <https://builds.apache.org/job/wss4j-trunk/ws/wss4j/ws-security-stax/src/main/java/org/apache/wss4j/stax/ext/WSSSecurityProperties.java>:[174,35]
cannot find symbol
symbol  : class KeyIdentifier
location: class org.apache.wss4j.stax.securityToken.WSSecurityTokenConstants
[ERROR] <https://builds.apache.org/job/wss4j-trunk/ws/wss4j/ws-security-stax/src/main/java/org/apache/wss4j/stax/ext/WSSSecurityProperties.java>:[183,67]
cannot find symbol
symbol  : class KeyIdentifier
location: class org.apache.wss4j.stax.securityToken.WSSecurityTokenConstants
[ERROR] <https://builds.apache.org/job/wss4j-trunk/ws/wss4j/ws-security-stax/src/main/java/org/apache/wss4j/stax/ext/WSSSecurityProperties.java>:[260,35]
cannot find symbol
symbol  : class KeyIdentifier
location: class org.apache.wss4j.stax.securityToken.WSSecurityTokenConstants
[ERROR] <https://builds.apache.org/job/wss4j-trunk/ws/wss4j/ws-security-stax/src/main/java/org/apache/wss4j/stax/ext/WSSSecurityProperties.java>:[264,67]
cannot find symbol
symbol  : class KeyIdentifier
location: class org.apache.wss4j.stax.securityToken.WSSecurityTokenConstants
[ERROR] <https://builds.apache.org/job/wss4j-trunk/ws/wss4j/ws-security-stax/src/main/java/org/apache/wss4j/stax/ext/WSSConstants.java>:[286,24]
cannot find symbol
symbol  : class AlgorithmUsage
location: class org.apache.wss4j.stax.ext.WSSConstants
[ERROR] <https://builds.apache.org/job/wss4j-trunk/ws/wss4j/ws-security-stax/src/main/java/org/apache/wss4j/stax/ext/WSSConstants.java>:[287,24]
cannot find symbol
symbol  : class AlgorithmUsage
location: class org.apache.wss4j.stax.ext.WSSConstants
[ERROR] <https://builds.apache.org/job/wss4j-trunk/ws/wss4j/ws-security-stax/src/main/java/org/apache/wss4j/stax/ext/WSSConstants.java>:[288,24]
cannot find symbol
symbol  : class AlgorithmUsage
location: class org.apache.wss4j.stax.ext.WSSConstants
[ERROR] <https://builds.apache.org/job/wss4j-trunk/ws/wss4j/ws-security-stax/src/main/java/org/apache/wss4j/stax/ext/WSSConstants.java>:[289,24]
cannot find symbol
symbol  : class AlgorithmUsage
location: class org.apache.wss4j.stax.ext.WSSConstants
[ERROR] <https://builds.apache.org/job/wss4j-trunk/ws/wss4j/ws-security-stax/src/main/java/org/apache/wss4j/stax/ext/WSSConstants.java>:[290,24]
cannot find symbol
symbol  : class AlgorithmUsage
location: class org.apache.wss4j.stax.ext.WSSConstants
[ERROR] <https://builds.apache.org/job/wss4j-trunk/ws/wss4j/ws-security-stax/src/main/java/org/apache/wss4j/stax/ext/WSSConstants.java>:[291,24]
cannot find symbol
symbol  : class AlgorithmUsage
location: class org.apache.wss4j.stax.ext.WSSConstants
[ERROR] <https://builds.apache.org/job/wss4j-trunk/ws/wss4j/ws-security-stax/src/main/java/org/apache/wss4j/stax/impl/processor/output/EncryptedKeyOutputProcessor.java>:[35,49]
package org.apache.xml.security.stax.securityToken does not exist
[ERROR] <https://builds.apache.org/job/wss4j-trunk/ws/wss4j/ws-security-stax/src/main/java/org/apache/wss4j/stax/impl/processor/output/EncryptedKeyOutputProcessor.java>:[36,49]
package org.apache.xml.security.stax.securityToken does not exist
[ERROR] <https://builds.apache.org/job/wss4j-trunk/ws/wss4j/ws-security-stax/src/main/java/org/apache/wss4j/stax/impl/processor/output/EncryptedKeyOutputProcessor.java>:[153,22]
cannot find symbol
symbol  : class OutboundSecurityToken
location: class org.apache.wss4j.stax.impl.processor.output.EncryptedKeyOutputProcessor.FinalEncryptedKeyOutputProcessor
[ERROR] <https://builds.apache.org/job/wss4j-trunk/ws/wss4j/ws-security-stax/src/main/java/org/apache/wss4j/stax/impl/processor/output/EncryptedKeyOutputProcessor.java>:[155,41]
cannot find symbol
symbol  : class OutboundSecurityToken
location: class org.apache.wss4j.stax.impl.processor.output.EncryptedKeyOutputProcessor.FinalEncryptedKeyOutputProcessor
[ERROR] <https://builds.apache.org/job/wss4j-trunk/ws/wss4j/ws-security-stax/src/main/java/org/apache/wss4j/stax/impl/processor/output/EncryptedKeyOutputProcessor.java>:[312,16]
cannot find symbol
symbol  : class OutboundSecurityToken
location: class org.apache.wss4j.stax.impl.processor.output.EncryptedKeyOutputProcessor.FinalEncryptedKeyOutputProcessor
[ERROR] <https://builds.apache.org/job/wss4j-trunk/ws/wss4j/ws-security-stax/src/main/java/org/apache/wss4j/stax/impl/processor/output/EncryptedKeyOutputProcessor.java>:[313,40]
cannot find symbol
symbol  : class KeyIdentifier
location: class org.apache.wss4j.stax.securityToken.WSSecurityTokenConstants
[ERROR] <https://builds.apache.org/job/wss4j-trunk/ws/wss4j/ws-security-stax/src/main/java/org/apache/wss4j/stax/impl/securityToken/SecurityTokenReferenceImpl.java>:[28,49]
package org.apache.xml.security.stax.securityToken does not exist
[ERROR] <https://builds.apache.org/job/wss4j-trunk/ws/wss4j/ws-security-stax/src/main/java/org/apache/wss4j/stax/securityToken/SecurityTokenReference.java>:[22,49]
package org.apache.xml.security.stax.securityToken does not exist
[ERROR] <https://builds.apache.org/job/wss4j-trunk/ws/wss4j/ws-security-stax/src/main/java/org/apache/wss4j/stax/securityToken/SecurityTokenReference.java>:[26,48]
cannot find symbol
symbol: class SecurityToken
public interface SecurityTokenReference extends SecurityToken {
[ERROR] <https://builds.apache.org/job/wss4j-trunk/ws/wss4j/ws-security-stax/src/main/java/org/apache/wss4j/stax/impl/securityToken/SecurityTokenReferenceImpl.java>:[38,18]
cannot find symbol
symbol  : class InboundSecurityToken
location: class org.apache.wss4j.stax.impl.securityToken.SecurityTokenReferenceImpl
[ERROR] <https://builds.apache.org/job/wss4j-trunk/ws/wss4j/ws-security-stax/src/main/java/org/apache/wss4j/stax/impl/securityToken/SecurityTokenReferenceImpl.java>:[41,38]
cannot find symbol
symbol  : class InboundSecurityToken
location: class org.apache.wss4j.stax.impl.securityToken.SecurityTokenReferenceImpl
[ERROR] <https://builds.apache.org/job/wss4j-trunk/ws/wss4j/ws-security-stax/src/main/java/org/apache/wss4j/stax/impl/securityToken/SecurityTokenReferenceImpl.java>:[43,62]
cannot find symbol
symbol  : class KeyIdentifier
location: class org.apache.wss4j.stax.securityToken.WSSecurityTokenConstants
[ERROR] <https://builds.apache.org/job/wss4j-trunk/ws/wss4j/ws-security-stax/src/main/java/org/apache/wss4j/stax/impl/securityToken/SecurityTokenReferenceImpl.java>:[64,66]
cannot find symbol
symbol  : class AlgorithmUsage
location: class org.apache.xml.security.stax.ext.XMLSecurityConstants
[ERROR] <https://builds.apache.org/job/wss4j-trunk/ws/wss4j/ws-security-stax/src/main/java/org/apache/wss4j/stax/impl/securityToken/SecurityTokenReferenceImpl.java>:[75,75]
cannot find symbol
symbol  : class AlgorithmUsage
location: class org.apache.xml.security.stax.ext.XMLSecurityConstants
[ERROR] <https://builds.apache.org/job/wss4j-trunk/ws/wss4j/ws-security-stax/src/main/java/org/apache/wss4j/stax/impl/securityToken/SecurityTokenReferenceImpl.java>:[91,11]
cannot find symbol
symbol  : class InboundSecurityToken
location: class org.apache.wss4j.stax.impl.securityToken.SecurityTokenReferenceImpl
[ERROR] <https://builds.apache.org/job/wss4j-trunk/ws/wss4j/ws-security-stax/src/main/java/org/apache/wss4j/stax/impl/securityToken/SecurityTokenReferenceImpl.java>:[96,35]
cannot find symbol
symbol  : class TokenType
location: class org.apache.wss4j.stax.securityToken.WSSecurityTokenConstants
[ERROR] <https://builds.apache.org/job/wss4j-trunk/ws/wss4j/ws-security-stax/src/main/java/org/apache/wss4j/stax/impl/securityToken/X509DataSecurityTokenImpl.java>:[43,92]
cannot find symbol
symbol  : class KeyIdentifier
location: class org.apache.wss4j.stax.securityToken.WSSecurityTokenConstants
[ERROR] <https://builds.apache.org/job/wss4j-trunk/ws/wss4j/ws-security-stax/src/main/java/org/apache/wss4j/stax/securityEvent/KeyValueTokenSecurityEvent.java>:[24,66]
type org.apache.xml.security.stax.securityEvent.TokenSecurityEvent does not take parameters
[ERROR] <https://builds.apache.org/job/wss4j-trunk/ws/wss4j/ws-security-stax/src/main/java/org/apache/wss4j/stax/securityToken/SecureConversationSecurityToken.java>:[21,49]
package org.apache.xml.security.stax.securityToken does not exist
[ERROR] <https://builds.apache.org/job/wss4j-trunk/ws/wss4j/ws-security-stax/src/main/java/org/apache/wss4j/stax/securityToken/SecureConversationSecurityToken.java>:[23,57]
cannot find symbol
symbol: class SecurityToken
public interface SecureConversationSecurityToken extends SecurityToken {
[ERROR] <https://builds.apache.org/job/wss4j-trunk/ws/wss4j/ws-security-stax/src/main/java/org/apache/wss4j/stax/impl/securityToken/SecureConversationSecurityTokenImpl.java>:[31,71]
cannot find symbol
symbol  : class KeyIdentifier
location: class org.apache.wss4j.stax.securityToken.WSSecurityTokenConstants
[ERROR] <https://builds.apache.org/job/wss4j-trunk/ws/wss4j/ws-security-stax/src/main/java/org/apache/wss4j/stax/impl/securityToken/SecureConversationSecurityTokenImpl.java>:[36,35]
cannot find symbol
symbol  : class TokenType
location: class org.apache.wss4j.stax.securityToken.WSSecurityTokenConstants
[ERROR] <https://builds.apache.org/job/wss4j-trunk/ws/wss4j/ws-security-stax/src/main/java/org/apache/wss4j/stax/impl/securityToken/ECKeyValueSecurityTokenImpl.java>:[40,36]
cannot find symbol
symbol  : class KeyIdentifier
location: class org.apache.wss4j.stax.securityToken.WSSecurityTokenConstants
[ERROR] <https://builds.apache.org/job/wss4j-trunk/ws/wss4j/ws-security-stax/src/main/java/org/apache/wss4j/stax/impl/securityToken/X509PKIPathv1SecurityTokenImpl.java>:[44,69]
cannot find symbol
symbol  : class KeyIdentifier
location: class org.apache.wss4j.stax.securityToken.WSSecurityTokenConstants
[ERROR] <https://builds.apache.org/job/wss4j-trunk/ws/wss4j/ws-security-stax/src/main/java/org/apache/wss4j/stax/impl/securityToken/DsaKeyValueSecurityTokenImpl.java>:[40,36]
cannot find symbol
symbol  : class KeyIdentifier
location: class org.apache.wss4j.stax.securityToken.WSSecurityTokenConstants
[ERROR] <https://builds.apache.org/job/wss4j-trunk/ws/wss4j/ws-security-stax/src/main/java/org/apache/wss4j/stax/securityEvent/RelTokenSecurityEvent.java>:[22,49]
package org.apache.xml.security.stax.securityToken does not exist
[ERROR] <https://builds.apache.org/job/wss4j-trunk/ws/wss4j/ws-security-stax/src/main/java/org/apache/wss4j/stax/securityEvent/IssuedTokenSecurityEvent.java>:[23,49]
package org.apache.xml.security.stax.securityToken does not exist
[ERROR] <https://builds.apache.org/job/wss4j-trunk/ws/wss4j/ws-security-stax/src/main/java/org/apache/wss4j/stax/securityEvent/IssuedTokenSecurityEvent.java>:[25,98]
type org.apache.xml.security.stax.securityEvent.TokenSecurityEvent does not take parameters
[ERROR] <https://builds.apache.org/job/wss4j-trunk/ws/wss4j/ws-security-stax/src/main/java/org/apache/wss4j/stax/securityEvent/IssuedTokenSecurityEvent.java>:[25,57]
cannot find symbol
symbol: class SecurityToken
public abstract class IssuedTokenSecurityEvent<T extends SecurityToken> extends TokenSecurityEvent<T>
{
[ERROR] <https://builds.apache.org/job/wss4j-trunk/ws/wss4j/ws-security-stax/src/main/java/org/apache/wss4j/stax/securityEvent/RelTokenSecurityEvent.java>:[24,68]
cannot find symbol
symbol: class SecurityToken
public class RelTokenSecurityEvent extends IssuedTokenSecurityEvent<SecurityToken> {
[ERROR] <https://builds.apache.org/job/wss4j-trunk/ws/wss4j/ws-security-stax/src/main/java/org/apache/wss4j/stax/impl/processor/input/SecurityContextTokenInputHandler.java>:[33,49]
package org.apache.xml.security.stax.securityToken does not exist
[ERROR] <https://builds.apache.org/job/wss4j-trunk/ws/wss4j/ws-security-stax/src/main/java/org/apache/wss4j/stax/impl/processor/input/SecurityContextTokenInputHandler.java>:[34,49]
package org.apache.xml.security.stax.securityToken does not exist
[ERROR] <https://builds.apache.org/job/wss4j-trunk/ws/wss4j/ws-security-stax/src/main/java/org/apache/wss4j/stax/impl/processor/input/UsernameTokenInputHandler.java>:[44,49]
package org.apache.xml.security.stax.securityToken does not exist
[ERROR] <https://builds.apache.org/job/wss4j-trunk/ws/wss4j/ws-security-stax/src/main/java/org/apache/wss4j/stax/impl/processor/input/UsernameTokenInputHandler.java>:[45,49]
package org.apache.xml.security.stax.securityToken does not exist
[ERROR] <https://builds.apache.org/job/wss4j-trunk/ws/wss4j/ws-security-stax/src/main/java/org/apache/wss4j/stax/impl/processor/output/UsernameTokenOutputProcessor.java>:[34,49]
package org.apache.xml.security.stax.securityToken does not exist
[ERROR] <https://builds.apache.org/job/wss4j-trunk/ws/wss4j/ws-security-stax/src/main/java/org/apache/wss4j/stax/impl/processor/output/UsernameTokenOutputProcessor.java>:[35,49]
package org.apache.xml.security.stax.securityToken does not exist
[ERROR] <https://builds.apache.org/job/wss4j-trunk/ws/wss4j/ws-security-stax/src/main/java/org/apache/wss4j/stax/securityEvent/SecurityContextTokenSecurityEvent.java>:[22,49]
package org.apache.xml.security.stax.securityToken does not exist
[ERROR] <https://builds.apache.org/job/wss4j-trunk/ws/wss4j/ws-security-stax/src/main/java/org/apache/wss4j/stax/securityEvent/SecurityContextTokenSecurityEvent.java>:[24,80]
cannot find symbol
symbol: class SecurityToken
public class SecurityContextTokenSecurityEvent extends IssuedTokenSecurityEvent<SecurityToken>
{
[ERROR] <https://builds.apache.org/job/wss4j-trunk/ws/wss4j/ws-security-stax/src/main/java/org/apache/wss4j/stax/ext/OutboundWSSec.java>:[27,40]
cannot find symbol
symbol  : class OutboundSecurityContextImpl
location: package org.apache.xml.security.stax.impl
[ERROR] <https://builds.apache.org/job/wss4j-trunk/ws/wss4j/ws-security-stax/src/main/java/org/apache/wss4j/stax/securityToken/HttpsSecurityToken.java>:[22,49]
package org.apache.xml.security.stax.securityToken does not exist
[ERROR] <https://builds.apache.org/job/wss4j-trunk/ws/wss4j/ws-security-stax/src/main/java/org/apache/wss4j/stax/securityToken/HttpsSecurityToken.java>:[24,78]
cannot find symbol
symbol: class InboundSecurityToken
public interface HttpsSecurityToken extends SubjectAndPrincipalSecurityToken, InboundSecurityToken
{
[ERROR] <https://builds.apache.org/job/wss4j-trunk/ws/wss4j/ws-security-stax/src/main/java/org/apache/wss4j/stax/impl/securityToken/KerberosServiceSecurityTokenImpl.java>:[58,68]
cannot find symbol
symbol  : class KeyIdentifier
location: class org.apache.wss4j.stax.securityToken.WSSecurityTokenConstants
[ERROR] <https://builds.apache.org/job/wss4j-trunk/ws/wss4j/ws-security-stax/src/main/java/org/apache/wss4j/stax/impl/securityToken/KerberosServiceSecurityTokenImpl.java>:[71,35]
cannot find symbol
symbol  : class TokenType
location: class org.apache.wss4j.stax.securityToken.WSSecurityTokenConstants
[ERROR] <https://builds.apache.org/job/wss4j-trunk/ws/wss4j/ws-security-stax/src/main/java/org/apache/wss4j/stax/impl/securityToken/KerberosServiceSecurityTokenImpl.java>:[130,66]
cannot find symbol
symbol  : class AlgorithmUsage
location: class org.apache.xml.security.stax.ext.XMLSecurityConstants
[ERROR] <https://builds.apache.org/job/wss4j-trunk/ws/wss4j/ws-security-stax/src/main/java/org/apache/wss4j/stax/impl/securityToken/UsernameSecurityTokenImpl.java>:[60,61]
cannot find symbol
symbol  : class KeyIdentifier
location: class org.apache.wss4j.stax.securityToken.WSSecurityTokenConstants
[ERROR] <https://builds.apache.org/job/wss4j-trunk/ws/wss4j/ws-security-stax/src/main/java/org/apache/wss4j/stax/impl/securityToken/UsernameSecurityTokenImpl.java>:[78,66]
cannot find symbol
symbol  : class AlgorithmUsage
location: class org.apache.xml.security.stax.ext.XMLSecurityConstants
[ERROR] <https://builds.apache.org/job/wss4j-trunk/ws/wss4j/ws-security-stax/src/main/java/org/apache/wss4j/stax/impl/securityToken/UsernameSecurityTokenImpl.java>:[94,35]
cannot find symbol
symbol  : class TokenType
location: class org.apache.wss4j.stax.securityToken.WSSecurityTokenConstants
[ERROR] <https://builds.apache.org/job/wss4j-trunk/ws/wss4j/ws-security-stax/src/main/java/org/apache/wss4j/stax/validate/SamlTokenValidatorImpl.java>:[25,49]
package org.apache.xml.security.stax.securityToken does not exist
[INFO] 100 errors 
[INFO] -------------------------------------------------------------
[INFO] ------------------------------------------------------------------------
[INFO] Reactor Summary:
[INFO] 
[INFO] Apache WSS4J ...................................... SUCCESS [11.433s]
[INFO] Apache WSS4J parent ............................... SUCCESS [1.273s]
[INFO] Apache WSS4J WSU 1.0 Binding ...................... SUCCESS [11.558s]
[INFO] Apache WSS4J WS-Security 1.0 Binding .............. SUCCESS [5.757s]
[INFO] Apache WSS4J WS-Security 1.1 Binding .............. SUCCESS [5.441s]
[INFO] Apache WSS4J WS-SecureConversation binding ........ SUCCESS [7.100s]
[INFO] Apache WSS4J Bindings ............................. SUCCESS [1.462s]
[INFO] Apache WSS4J WS-SecurityPolicy model .............. SUCCESS [34.762s]
[INFO] Apache WSS4J WS-Security Common ................... SUCCESS [33.944s]
[INFO] Apache WSS4J DOM WS-Security ...................... SUCCESS [1:05.601s]
[INFO] Apache WSS4J Streaming WS-Security ................ FAILURE [16.551s]
[INFO] Apache WSS4J WS-Security Integration .............. SKIPPED
[INFO] Apache WSS4J Streaming WS-SecurityPolicy .......... SKIPPED
[INFO] ------------------------------------------------------------------------
[INFO] BUILD FAILURE
[INFO] ------------------------------------------------------------------------
[INFO] Total time: 3:16.966s
[INFO] Finished at: Mon Apr 01 20:33:34 UTC 2013
[INFO] Final Memory: 45M/394M
[INFO] ------------------------------------------------------------------------
[JENKINS] Archiving <https://builds.apache.org/job/wss4j-trunk/ws/wss4j/bindings/wsu10-binding/pom.xml>
to /home/hudson/hudson/jobs/wss4j-trunk/modules/org.apache.wss4j$wss4j-bindings-wsu10/builds/2013-04-01_20-30-09/archive/org.apache.wss4j/wss4j-bindings-wsu10/2.0-SNAPSHOT/wss4j-bindings-wsu10-2.0-SNAPSHOT.pom
[JENKINS] Archiving <https://builds.apache.org/job/wss4j-trunk/ws/wss4j/bindings/wsu10-binding/target/wss4j-bindings-wsu10-2.0-SNAPSHOT.jar>
to /home/hudson/hudson/jobs/wss4j-trunk/modules/org.apache.wss4j$wss4j-bindings-wsu10/builds/2013-04-01_20-30-09/archive/org.apache.wss4j/wss4j-bindings-wsu10/2.0-20130401.203043-37/wss4j-bindings-wsu10-2.0-20130401.203043-37.jar
[JENKINS] Archiving <https://builds.apache.org/job/wss4j-trunk/ws/wss4j/bindings/wsu10-binding/target/wss4j-bindings-wsu10-2.0-SNAPSHOT-sources.jar>
to /home/hudson/hudson/jobs/wss4j-trunk/modules/org.apache.wss4j$wss4j-bindings-wsu10/builds/2013-04-01_20-30-09/archive/org.apache.wss4j/wss4j-bindings-wsu10/2.0-20130401.203043-37/wss4j-bindings-wsu10-2.0-20130401.203043-37-sources.jar
[JENKINS] Archiving <https://builds.apache.org/job/wss4j-trunk/ws/wss4j/parent/pom.xml>
to /home/hudson/hudson/jobs/wss4j-trunk/modules/org.apache.wss4j$wss4j-parent/builds/2013-04-01_20-30-09/archive/org.apache.wss4j/wss4j-parent/2.0-SNAPSHOT/wss4j-parent-2.0-SNAPSHOT.pom
[JENKINS] Archiving <https://builds.apache.org/job/wss4j-trunk/ws/wss4j/bindings/wssc-binding/pom.xml>
to /home/hudson/hudson/jobs/wss4j-trunk/modules/org.apache.wss4j$wss4j-bindings-wssc/builds/2013-04-01_20-30-09/archive/org.apache.wss4j/wss4j-bindings-wssc/2.0-SNAPSHOT/wss4j-bindings-wssc-2.0-SNAPSHOT.pom
[JENKINS] Archiving <https://builds.apache.org/job/wss4j-trunk/ws/wss4j/bindings/wssc-binding/target/wss4j-bindings-wssc-2.0-SNAPSHOT.jar>
to /home/hudson/hudson/jobs/wss4j-trunk/modules/org.apache.wss4j$wss4j-bindings-wssc/builds/2013-04-01_20-30-09/archive/org.apache.wss4j/wss4j-bindings-wssc/2.0-20130401.203101-37/wss4j-bindings-wssc-2.0-20130401.203101-37.jar
[JENKINS] Archiving <https://builds.apache.org/job/wss4j-trunk/ws/wss4j/bindings/wssc-binding/target/wss4j-bindings-wssc-2.0-SNAPSHOT-sources.jar>
to /home/hudson/hudson/jobs/wss4j-trunk/modules/org.apache.wss4j$wss4j-bindings-wssc/builds/2013-04-01_20-30-09/archive/org.apache.wss4j/wss4j-bindings-wssc/2.0-20130401.203101-37/wss4j-bindings-wssc-2.0-20130401.203101-37-sources.jar
[JENKINS] Archiving <https://builds.apache.org/job/wss4j-trunk/ws/wss4j/ws-security-common/pom.xml>
to /home/hudson/hudson/jobs/wss4j-trunk/modules/org.apache.wss4j$wss4j-ws-security-common/builds/2013-04-01_20-30-09/archive/org.apache.wss4j/wss4j-ws-security-common/2.0-SNAPSHOT/wss4j-ws-security-common-2.0-SNAPSHOT.pom
[JENKINS] Archiving <https://builds.apache.org/job/wss4j-trunk/ws/wss4j/ws-security-common/target/wss4j-ws-security-common-2.0-SNAPSHOT.jar>
to /home/hudson/hudson/jobs/wss4j-trunk/modules/org.apache.wss4j$wss4j-ws-security-common/builds/2013-04-01_20-30-09/archive/org.apache.wss4j/wss4j-ws-security-common/2.0-20130401.203211-36/wss4j-ws-security-common-2.0-20130401.203211-36.jar
[JENKINS] Archiving <https://builds.apache.org/job/wss4j-trunk/ws/wss4j/ws-security-common/target/wss4j-ws-security-common-2.0-SNAPSHOT-sources.jar>
to /home/hudson/hudson/jobs/wss4j-trunk/modules/org.apache.wss4j$wss4j-ws-security-common/builds/2013-04-01_20-30-09/archive/org.apache.wss4j/wss4j-ws-security-common/2.0-20130401.203211-36/wss4j-ws-security-common-2.0-20130401.203211-36-sources.jar
[JENKINS] Archiving <https://builds.apache.org/job/wss4j-trunk/ws/wss4j/ws-security-common/target/wss4j-ws-security-common-2.0-SNAPSHOT-tests.jar>
to /home/hudson/hudson/jobs/wss4j-trunk/modules/org.apache.wss4j$wss4j-ws-security-common/builds/2013-04-01_20-30-09/archive/org.apache.wss4j/wss4j-ws-security-common/2.0-20130401.203211-36/wss4j-ws-security-common-2.0-20130401.203211-36-tests.jar
[JENKINS] Archiving <https://builds.apache.org/job/wss4j-trunk/ws/wss4j/ws-security-policy-stax/pom.xml>
to /home/hudson/hudson/jobs/wss4j-trunk/modules/org.apache.wss4j$wss4j-ws-security-policy-stax/builds/2013-04-01_20-30-09/archive/org.apache.wss4j/wss4j-ws-security-policy-stax/2.0-SNAPSHOT/wss4j-ws-security-policy-stax-2.0-SNAPSHOT.pom
[JENKINS] Archiving <https://builds.apache.org/job/wss4j-trunk/ws/wss4j/ws-security-stax/pom.xml>
to /home/hudson/hudson/jobs/wss4j-trunk/modules/org.apache.wss4j$wss4j-ws-security-stax/builds/2013-04-01_20-30-09/archive/org.apache.wss4j/wss4j-ws-security-stax/2.0-SNAPSHOT/wss4j-ws-security-stax-2.0-SNAPSHOT.pom
[JENKINS] Archiving <https://builds.apache.org/job/wss4j-trunk/ws/wss4j/pom.xml> to
/home/hudson/hudson/jobs/wss4j-trunk/modules/org.apache.wss4j$wss4j/builds/2013-04-01_20-30-09/archive/org.apache.wss4j/wss4j/2.0-SNAPSHOT/wss4j-2.0-SNAPSHOT.pom
[JENKINS] Archiving <https://builds.apache.org/job/wss4j-trunk/ws/wss4j/policy/pom.xml>
to /home/hudson/hudson/jobs/wss4j-trunk/modules/org.apache.wss4j$wss4j-policy/builds/2013-04-01_20-30-09/archive/org.apache.wss4j/wss4j-policy/2.0-SNAPSHOT/wss4j-policy-2.0-SNAPSHOT.pom
[JENKINS] Archiving <https://builds.apache.org/job/wss4j-trunk/ws/wss4j/policy/target/wss4j-policy-2.0-SNAPSHOT.jar>
to /home/hudson/hudson/jobs/wss4j-trunk/modules/org.apache.wss4j$wss4j-policy/builds/2013-04-01_20-30-09/archive/org.apache.wss4j/wss4j-policy/2.0-20130401.203137-37/wss4j-policy-2.0-20130401.203137-37.jar
[JENKINS] Archiving <https://builds.apache.org/job/wss4j-trunk/ws/wss4j/policy/target/wss4j-policy-2.0-SNAPSHOT-sources.jar>
to /home/hudson/hudson/jobs/wss4j-trunk/modules/org.apache.wss4j$wss4j-policy/builds/2013-04-01_20-30-09/archive/org.apache.wss4j/wss4j-policy/2.0-20130401.203137-37/wss4j-policy-2.0-20130401.203137-37-sources.jar
[JENKINS] Archiving <https://builds.apache.org/job/wss4j-trunk/ws/wss4j/integration/pom.xml>
to /home/hudson/hudson/jobs/wss4j-trunk/modules/org.apache.wss4j$integration/builds/2013-04-01_20-30-09/archive/org.apache.wss4j/integration/2.0-SNAPSHOT/integration-2.0-SNAPSHOT.pom
[JENKINS] Archiving <https://builds.apache.org/job/wss4j-trunk/ws/wss4j/bindings/pom.xml>
to /home/hudson/hudson/jobs/wss4j-trunk/modules/org.apache.wss4j$wss4j-bindings/builds/2013-04-01_20-30-09/archive/org.apache.wss4j/wss4j-bindings/2.0-SNAPSHOT/wss4j-bindings-2.0-SNAPSHOT.pom
[JENKINS] Archiving <https://builds.apache.org/job/wss4j-trunk/ws/wss4j/bindings/wss10-binding/pom.xml>
to /home/hudson/hudson/jobs/wss4j-trunk/modules/org.apache.wss4j$wss4j-bindings-wss10/builds/2013-04-01_20-30-09/archive/org.apache.wss4j/wss4j-bindings-wss10/2.0-SNAPSHOT/wss4j-bindings-wss10-2.0-SNAPSHOT.pom
[JENKINS] Archiving <https://builds.apache.org/job/wss4j-trunk/ws/wss4j/bindings/wss10-binding/target/wss4j-bindings-wss10-2.0-SNAPSHOT.jar>
to /home/hudson/hudson/jobs/wss4j-trunk/modules/org.apache.wss4j$wss4j-bindings-wss10/builds/2013-04-01_20-30-09/archive/org.apache.wss4j/wss4j-bindings-wss10/2.0-20130401.203049-37/wss4j-bindings-wss10-2.0-20130401.203049-37.jar
[JENKINS] Archiving <https://builds.apache.org/job/wss4j-trunk/ws/wss4j/bindings/wss10-binding/target/wss4j-bindings-wss10-2.0-SNAPSHOT-sources.jar>
to /home/hudson/hudson/jobs/wss4j-trunk/modules/org.apache.wss4j$wss4j-bindings-wss10/builds/2013-04-01_20-30-09/archive/org.apache.wss4j/wss4j-bindings-wss10/2.0-20130401.203049-37/wss4j-bindings-wss10-2.0-20130401.203049-37-sources.jar
[JENKINS] Archiving <https://builds.apache.org/job/wss4j-trunk/ws/wss4j/ws-security-dom/pom.xml>
to /home/hudson/hudson/jobs/wss4j-trunk/modules/org.apache.wss4j$wss4j-ws-security-dom/builds/2013-04-01_20-30-09/archive/org.apache.wss4j/wss4j-ws-security-dom/2.0-SNAPSHOT/wss4j-ws-security-dom-2.0-SNAPSHOT.pom
[JENKINS] Archiving <https://builds.apache.org/job/wss4j-trunk/ws/wss4j/ws-security-dom/target/wss4j-ws-security-dom-2.0-SNAPSHOT.jar>
to /home/hudson/hudson/jobs/wss4j-trunk/modules/org.apache.wss4j$wss4j-ws-security-dom/builds/2013-04-01_20-30-09/archive/org.apache.wss4j/wss4j-ws-security-dom/2.0-20130401.203317-34/wss4j-ws-security-dom-2.0-20130401.203317-34.jar
[JENKINS] Archiving <https://builds.apache.org/job/wss4j-trunk/ws/wss4j/ws-security-dom/target/wss4j-ws-security-dom-2.0-SNAPSHOT-sources.jar>
to /home/hudson/hudson/jobs/wss4j-trunk/modules/org.apache.wss4j$wss4j-ws-security-dom/builds/2013-04-01_20-30-09/archive/org.apache.wss4j/wss4j-ws-security-dom/2.0-20130401.203317-34/wss4j-ws-security-dom-2.0-20130401.203317-34-sources.jar
[JENKINS] Archiving <https://builds.apache.org/job/wss4j-trunk/ws/wss4j/ws-security-dom/target/wss4j-ws-security-dom-2.0-SNAPSHOT-tests.jar>
to /home/hudson/hudson/jobs/wss4j-trunk/modules/org.apache.wss4j$wss4j-ws-security-dom/builds/2013-04-01_20-30-09/archive/org.apache.wss4j/wss4j-ws-security-dom/2.0-20130401.203317-34/wss4j-ws-security-dom-2.0-20130401.203317-34-tests.jar
[JENKINS] Archiving <https://builds.apache.org/job/wss4j-trunk/ws/wss4j/bindings/wss11-binding/pom.xml>
to /home/hudson/hudson/jobs/wss4j-trunk/modules/org.apache.wss4j$wss4j-bindings-wss11/builds/2013-04-01_20-30-09/archive/org.apache.wss4j/wss4j-bindings-wss11/2.0-SNAPSHOT/wss4j-bindings-wss11-2.0-SNAPSHOT.pom
[JENKINS] Archiving <https://builds.apache.org/job/wss4j-trunk/ws/wss4j/bindings/wss11-binding/target/wss4j-bindings-wss11-2.0-SNAPSHOT.jar>
to /home/hudson/hudson/jobs/wss4j-trunk/modules/org.apache.wss4j$wss4j-bindings-wss11/builds/2013-04-01_20-30-09/archive/org.apache.wss4j/wss4j-bindings-wss11/2.0-20130401.203054-37/wss4j-bindings-wss11-2.0-20130401.203054-37.jar
[JENKINS] Archiving <https://builds.apache.org/job/wss4j-trunk/ws/wss4j/bindings/wss11-binding/target/wss4j-bindings-wss11-2.0-SNAPSHOT-sources.jar>
to /home/hudson/hudson/jobs/wss4j-trunk/modules/org.apache.wss4j$wss4j-bindings-wss11/builds/2013-04-01_20-30-09/archive/org.apache.wss4j/wss4j-bindings-wss11/2.0-20130401.203054-37/wss4j-bindings-wss11-2.0-20130401.203054-37-sources.jar
[WARNING] The requested profile "deploy" could not be activated because it does not exist.
Waiting for Jenkins to finish collecting data
mavenExecutionResult exceptions not empty
message : Failed to execute goal org.apache.maven.plugins:maven-compiler-plugin:2.5.1:compile
(default-compile) on project wss4j-ws-security-stax: Compilation failure
cause : Compilation failure
Stack trace : 
org.apache.maven.lifecycle.LifecycleExecutionException: Failed to execute goal org.apache.maven.plugins:maven-compiler-plugin:2.5.1:compile
(default-compile) on project wss4j-ws-security-stax: Compilation failure
	at org.apache.maven.lifecycle.internal.MojoExecutor.execute(MojoExecutor.java:213)
	at org.apache.maven.lifecycle.internal.MojoExecutor.execute(MojoExecutor.java:153)
	at org.apache.maven.lifecycle.internal.MojoExecutor.execute(MojoExecutor.java:145)
	at org.apache.maven.lifecycle.internal.LifecycleModuleBuilder.buildProject(LifecycleModuleBuilder.java:84)
	at org.apache.maven.lifecycle.internal.LifecycleModuleBuilder.buildProject(LifecycleModuleBuilder.java:59)
	at org.apache.maven.lifecycle.internal.LifecycleStarter.singleThreadedBuild(LifecycleStarter.java:183)
	at org.apache.maven.lifecycle.internal.LifecycleStarter.execute(LifecycleStarter.java:161)
	at org.apache.maven.DefaultMaven.doExecute(DefaultMaven.java:320)
	at org.apache.maven.DefaultMaven.execute(DefaultMaven.java:156)
	at org.jvnet.hudson.maven3.launcher.Maven3Launcher.main(Maven3Launcher.java:79)
	at sun.reflect.NativeMethodAccessorImpl.invoke0(Native Method)
	at sun.reflect.NativeMethodAccessorImpl.invoke(NativeMethodAccessorImpl.java:39)
	at sun.reflect.DelegatingMethodAccessorImpl.invoke(DelegatingMethodAccessorImpl.java:25)
	at java.lang.reflect.Method.invoke(Method.java:597)
	at org.codehaus.plexus.classworlds.launcher.Launcher.launchStandard(Launcher.java:329)
	at org.codehaus.plexus.classworlds.launcher.Launcher.launch(Launcher.java:239)
	at org.jvnet.hudson.maven3.agent.Maven3Main.launch(Maven3Main.java:158)
	at hudson.maven.Maven3Builder.call(Maven3Builder.java:100)
	at hudson.maven.Maven3Builder.call(Maven3Builder.java:66)
	at hudson.remoting.UserRequest.perform(UserRequest.java:118)
	at hudson.remoting.UserRequest.perform(UserRequest.java:48)
	at hudson.remoting.Request$2.run(Request.java:326)
	at hudson.remoting.InterceptingExecutorService$1.call(InterceptingExecutorService.java:72)
	at java.util.concurrent.FutureTask$Sync.innerRun(FutureTask.java:303)
	at java.util.concurrent.FutureTask.run(FutureTask.java:138)
	at java.util.concurrent.ThreadPoolExecutor$Worker.runTask(ThreadPoolExecutor.java:886)
	at java.util.concurrent.ThreadPoolExecutor$Worker.run(ThreadPoolExecutor.java:908)
	at java.lang.Thread.run(Thread.java:619)
Caused by: org.apache.maven.plugin.CompilationFailureException: Compilation failure
	at org.apache.maven.plugin.AbstractCompilerMojo.execute(AbstractCompilerMojo.java:729)
	at org.apache.maven.plugin.CompilerMojo.execute(CompilerMojo.java:128)
	at org.apache.maven.plugin.DefaultBuildPluginManager.executeMojo(DefaultBuildPluginManager.java:101)
	at org.apache.maven.lifecycle.internal.MojoExecutor.execute(MojoExecutor.java:209)
	... 27 more
Sending e-mails to: dev@ws.apache.org gigerstyle@gmx.ch
channel stopped

---------------------------------------------------------------------
To unsubscribe, e-mail: dev-unsubscribe@ws.apache.org
For additional commands, e-mail: dev-help@ws.apache.org


Mime
View raw message